SHARE
TWEET

Untitled

a guest May 19th, 2019 62 Never
Not a member of Pastebin yet? Sign Up, it unlocks many cool features!
  1.  * Package:    app-text/podofo-0.9.6_pre20170508-r1
  2.  * Repository: gentoo
  3.  * Maintainer: zmedico@gentoo.org
  4.  * USE:        abi_x86_64 amd64 boost elibc_glibc kernel_linux tools userland_GNU
  5.  * FEATURES:   network-sandbox preserve-libs sandbox userpriv usersandbox
  6. >>> Unpacking source...
  7. >>> Unpacking podofo-0.9.6_pre20170508.tar.xz to /var/tmp/portage/app-text/podofo-0.9.6_pre20170508-r1/work
  8. >>> Source unpacked in /var/tmp/portage/app-text/podofo-0.9.6_pre20170508-r1/work
  9. >>> Preparing source in /var/tmp/portage/app-text/podofo-0.9.6_pre20170508-r1/work/podofo-0.9.6_pre20170508 ...
  10. >>> Source prepared.
  11. >>> Configuring source in /var/tmp/portage/app-text/podofo-0.9.6_pre20170508-r1/work/podofo-0.9.6_pre20170508 ...
  12. >>> Working in BUILD_DIR: "/var/tmp/portage/app-text/podofo-0.9.6_pre20170508-r1/work/podofo-0.9.6_pre20170508_build"
  13. cmake -C /var/tmp/portage/app-text/podofo-0.9.6_pre20170508-r1/work/podofo-0.9.6_pre20170508_build/gentoo_common_config.cmake -G Unix Makefiles -DCMAKE_INSTALL_PREFIX=/usr -DPODOFO_BUILD_SHARED=1 -DPODOFO_HAVE_JPEG_LIB=1 -DPODOFO_HAVE_PNG_LIB=1 -DPODOFO_HAVE_TIFF_LIB=1 -DWANT_FONTCONFIG=1 -DUSE_STLPORT=0 -DWANT_BOOST=ON -DHAVE_LIBIDN=OFF -DPODOFO_HAVE_CPPUNIT=OFF -DPODOFO_BUILD_LIB_ONLY=OFF -DCMAKE_BUILD_TYPE=Gentoo -DCMAKE_TOOLCHAIN_FILE=/var/tmp/portage/app-text/podofo-0.9.6_pre20170508-r1/work/podofo-0.9.6_pre20170508_build/gentoo_toolchain.cmake  /var/tmp/portage/app-text/podofo-0.9.6_pre20170508-r1/work/podofo-0.9.6_pre20170508
  14. loading initial cache file /var/tmp/portage/app-text/podofo-0.9.6_pre20170508-r1/work/podofo-0.9.6_pre20170508_build/gentoo_common_config.cmake
  15. -- The C compiler identification is GNU 8.3.0
  16. -- The CXX compiler identification is GNU 8.3.0
  17. -- Check for working C compiler: /usr/bin/x86_64-pc-linux-gnu-gcc
  18. -- Check for working C compiler: /usr/bin/x86_64-pc-linux-gnu-gcc -- works
  19. -- Detecting C compiler ABI info
  20. -- Detecting C compiler ABI info - done
  21. -- Detecting C compile features
  22. -- Detecting C compile features - done
  23. -- Check for working CXX compiler: /usr/bin/x86_64-pc-linux-gnu-g++
  24. -- Check for working CXX compiler: /usr/bin/x86_64-pc-linux-gnu-g++ -- works
  25. -- Detecting CXX compiler ABI info
  26. -- Detecting CXX compiler ABI info - done
  27. -- Detecting CXX compile features
  28. -- Detecting CXX compile features - done
  29. Will install libraries to /usr/lib64
  30. -- Looking for strings.h
  31. -- Looking for strings.h - found
  32. -- Looking for arpa/inet.h
  33. -- Looking for arpa/inet.h - found
  34. -- Looking for winsock2.h
  35. -- Looking for winsock2.h - not found
  36. -- Looking for mem.h
  37. -- Looking for mem.h - not found
  38. -- Looking for ctype.h
  39. -- Looking for ctype.h - found
  40. -- Looking for sys/types.h
  41. -- Looking for sys/types.h - found
  42. -- Looking for stdint.h
  43. -- Looking for stdint.h - found
  44. -- Looking for BaseTsd.h
  45. -- Looking for BaseTsd.h - not found
  46. -- Looking for sys/types.h
  47. -- Looking for sys/types.h - found
  48. -- Looking for stdint.h
  49. -- Looking for stdint.h - found
  50. -- Looking for stddef.h
  51. -- Looking for stddef.h - found
  52. -- Check size of long int
  53. -- Check size of long int - done
  54. -- Check size of int64_t
  55. -- Check size of int64_t - done
  56. -- Check if the system is big endian
  57. -- Searching 16 bit integer
  58. -- Check size of unsigned short
  59. -- Check size of unsigned short - done
  60. -- Using unsigned short
  61. -- Check if the system is big endian - little endian
  62. Using gcc specific compiler options
  63. -- Found ZLIB: /usr/lib/libz.so  
  64. Found zlib headers in /usr/include, library at /usr/lib/libz.so
  65. -- Found PkgConfig: x86_64-pc-linux-gnu-pkg-config (found version "1.5.4")
  66. -- Checking for module 'libcrypto'
  67. --   Found libcrypto, version 1.0.2r
  68. -- Found LIBCRYPTO: /usr/lib/libcrypto.so  
  69. -- Performing Test PODOFO_HAVE_OPENSSL_1_1
  70. -- Performing Test PODOFO_HAVE_OPENSSL_1_1 - Failed
  71. -- Performing Test PODOFO_HAVE_OPENSSL_NO_RC4
  72. -- Performing Test PODOFO_HAVE_OPENSSL_NO_RC4 - Failed
  73. Found OpenSSL's libCrypto headers in /usr/include, library at /usr/lib/libcrypto.so
  74. -- Found LIBIDN: /usr/lib/libidn.so  
  75. Libidn not found. AES-256 Encryption support will be disabled
  76. -- Found LIBJPEG: /usr/lib/libjpeg.so  
  77. Found libjpeg headers in /usr/include, library at /usr/lib/libjpeg.so
  78. -- Found TIFF: /usr/lib/libtiff.so  
  79. Found libtiff headers in /usr/include, library at /usr/lib/libtiff.so
  80. -- Found ZLIB: /usr/lib/libz.so (found version "1.2.11")
  81. -- Found PNG: /usr/lib/libpng.so (found version "1.6.37")
  82. Found LibPng headers in /usr/include;/usr/include, library at /usr/lib/libpng.so;/usr/lib/libz.so
  83. Cppunit not found. No unit tests will be built.
  84. -- Found OpenSSL: /usr/lib/libssl.so
  85. Found freetype library at /usr/lib/libfreetype.so, headers /usr/include/freetype2
  86. CMake Warning (dev) at cmake/modules/FindLIBSTLPORT.cmake:12 (SET):
  87.   implicitly converting 'BOOLEAN' to 'STRING' type.
  88. Call Stack (most recent call first):
  89.   CMakeLists.txt:399 (FIND_PACKAGE)
  90. This warning is for project developers.  Use -Wno-dev to suppress it.
  91.  
  92. -- Checking for module 'fontconfig'
  93. --   Found fontconfig, version 2.13.0
  94. -- Found Fontconfig: fontconfig;freetype  
  95. Found fontconfig headers in /usr/include, library at fontconfig;freetype
  96. -- Found Lua50: /usr/lib/liblua.so;/usr/lib/libm.so  
  97. -- Found Lua: /usr/lib/liblua.so;/usr/lib/libm.so  
  98. Lua found - PoDoFoImpose and PoDoFoColor will be built with Lua support
  99.  * Lua include directory: /usr/include
  100.  * Lua libraries: /usr/lib/liblua.so;/usr/lib/libm.so
  101. Building multithreaded version of PoDoFo.
  102. -- Looking for pthread.h
  103. -- Looking for pthread.h - found
  104. -- Looking for pthread_create
  105. -- Looking for pthread_create - not found
  106. -- Looking for pthread_create in pthreads
  107. -- Looking for pthread_create in pthreads - not found
  108. -- Looking for pthread_create in pthread
  109. -- Looking for pthread_create in pthread - found
  110. -- Found Threads: TRUE  
  111. Looking optional for Boost.
  112. Boost is optional, so don't worry if it is not found.
  113. Set the BOOST_ROOT env var if you have problems.
  114. -- Found Boost: /usr/include  
  115. Building shared PoDoFo library
  116. Pkg-config found, creating a pkg-config file for linking against shared library.
  117. -- <<< Gentoo configuration >>>
  118. Build type      Gentoo
  119. Install path    /usr
  120. Compiler flags:
  121. C               -march=native -O2 -pipe
  122. C++             -march=native -O2 -pipe -Wall -Woverloaded-virtual -Wswitch-enum -Wcast-qual -Wwrite-strings -Wredundant-decls -Wreorder -Wno-deprecated-declarations
  123. Linker flags:
  124. Executable      -Wl,-O1 -Wl,--as-needed
  125. Module          -Wl,-O1 -Wl,--as-needed
  126. Shared          -Wl,-O1 -Wl,--as-needed
  127.  
  128. -- Configuring done
  129. -- Generating done
  130. -- Build files have been written to: /var/tmp/portage/app-text/podofo-0.9.6_pre20170508-r1/work/podofo-0.9.6_pre20170508_build
  131. >>> Source configured.
  132. >>> Compiling source in /var/tmp/portage/app-text/podofo-0.9.6_pre20170508-r1/work/podofo-0.9.6_pre20170508 ...
  133. >>> Working in BUILD_DIR: "/var/tmp/portage/app-text/podofo-0.9.6_pre20170508-r1/work/podofo-0.9.6_pre20170508_build"
  134. make -j8 VERBOSE=1
  135. /usr/bin/cmake -S/var/tmp/portage/app-text/podofo-0.9.6_pre20170508-r1/work/podofo-0.9.6_pre20170508 -B/var/tmp/portage/app-text/podofo-0.9.6_pre20170508-r1/work/podofo-0.9.6_pre20170508_build --check-build-system CMakeFiles/Makefile.cmake 0
  136. /usr/bin/cmake -E cmake_progress_start /var/tmp/portage/app-text/podofo-0.9.6_pre20170508-r1/work/podofo-0.9.6_pre20170508_build/CMakeFiles /var/tmp/portage/app-text/podofo-0.9.6_pre20170508-r1/work/podofo-0.9.6_pre20170508_build/CMakeFiles/progress.marks
  137. make -f CMakeFiles/Makefile2 all
  138. make[1]: Entering directory '/var/tmp/portage/app-text/podofo-0.9.6_pre20170508-r1/work/podofo-0.9.6_pre20170508_build'
  139. make -f src/CMakeFiles/podofo_shared.dir/build.make src/CMakeFiles/podofo_shared.dir/depend
  140. make[2]: Entering directory '/var/tmp/portage/app-text/podofo-0.9.6_pre20170508-r1/work/podofo-0.9.6_pre20170508_build'
  141. cd /var/tmp/portage/app-text/podofo-0.9.6_pre20170508-r1/work/podofo-0.9.6_pre20170508_build && /usr/bin/cmake -E cmake_depends "Unix Makefiles" /var/tmp/portage/app-text/podofo-0.9.6_pre20170508-r1/work/podofo-0.9.6_pre20170508 /var/tmp/portage/app-text/podofo-0.9.6_pre20170508-r1/work/podofo-0.9.6_pre20170508/src /var/tmp/portage/app-text/podofo-0.9.6_pre20170508-r1/work/podofo-0.9.6_pre20170508_build /var/tmp/portage/app-text/podofo-0.9.6_pre20170508-r1/work/podofo-0.9.6_pre20170508_build/src /var/tmp/portage/app-text/podofo-0.9.6_pre20170508-r1/work/podofo-0.9.6_pre20170508_build/src/CMakeFiles/podofo_shared.dir/DependInfo.cmake --color=
  142. Dependee "/var/tmp/portage/app-text/podofo-0.9.6_pre20170508-r1/work/podofo-0.9.6_pre20170508_build/src/CMakeFiles/podofo_shared.dir/DependInfo.cmake" is newer than depender "/var/tmp/portage/app-text/podofo-0.9.6_pre20170508-r1/work/podofo-0.9.6_pre20170508_build/src/CMakeFiles/podofo_shared.dir/depend.internal".
  143. Dependee "/var/tmp/portage/app-text/podofo-0.9.6_pre20170508-r1/work/podofo-0.9.6_pre20170508_build/src/CMakeFiles/CMakeDirectoryInformation.cmake" is newer than depender "/var/tmp/portage/app-text/podofo-0.9.6_pre20170508-r1/work/podofo-0.9.6_pre20170508_build/src/CMakeFiles/podofo_shared.dir/depend.internal".
  144. Scanning dependencies of target podofo_shared
  145. make[2]: Leaving directory '/var/tmp/portage/app-text/podofo-0.9.6_pre20170508-r1/work/podofo-0.9.6_pre20170508_build'
  146. make -f src/CMakeFiles/podofo_shared.dir/build.make src/CMakeFiles/podofo_shared.dir/build
  147. make[2]: Entering directory '/var/tmp/portage/app-text/podofo-0.9.6_pre20170508-r1/work/podofo-0.9.6_pre20170508_build'
  148. [  2%] Building CXX object src/CMakeFiles/podofo_shared.dir/base/PdfArray.cpp.o
  149. [  2%] Building CXX object src/CMakeFiles/podofo_shared.dir/base/PdfColor.cpp.o
  150. cd /var/tmp/portage/app-text/podofo-0.9.6_pre20170508-r1/work/podofo-0.9.6_pre20170508_build/src && /usr/bin/x86_64-pc-linux-gnu-g++ -Dpodofo_shared_EXPORTS -I/var/tmp/portage/app-text/podofo-0.9.6_pre20170508-r1/work/podofo-0.9.6_pre20170508_build -I/var/tmp/portage/app-text/podofo-0.9.6_pre20170508-r1/work/podofo-0.9.6_pre20170508 -I/var/tmp/portage/app-text/podofo-0.9.6_pre20170508-r1/work/podofo-0.9.6_pre20170508/src -I/usr/include/freetype2   -DNDEBUG -march=native -O2 -pipe -Wall -Woverloaded-virtual -Wswitch-enum -Wcast-qual -Wwrite-strings -Wredundant-decls -Wreorder -Wno-deprecated-declarations -fPIC   -W -DBUILDING_PODOFO -o CMakeFiles/podofo_shared.dir/base/PdfArray.cpp.o -c /var/tmp/portage/app-text/podofo-0.9.6_pre20170508-r1/work/podofo-0.9.6_pre20170508/src/base/PdfArray.cpp
  151. [  2%] Building CXX object src/CMakeFiles/podofo_shared.dir/base/PdfContentsTokenizer.cpp.o
  152. cd /var/tmp/portage/app-text/podofo-0.9.6_pre20170508-r1/work/podofo-0.9.6_pre20170508_build/src && /usr/bin/x86_64-pc-linux-gnu-g++ -Dpodofo_shared_EXPORTS -I/var/tmp/portage/app-text/podofo-0.9.6_pre20170508-r1/work/podofo-0.9.6_pre20170508_build -I/var/tmp/portage/app-text/podofo-0.9.6_pre20170508-r1/work/podofo-0.9.6_pre20170508 -I/var/tmp/portage/app-text/podofo-0.9.6_pre20170508-r1/work/podofo-0.9.6_pre20170508/src -I/usr/include/freetype2   -DNDEBUG -march=native -O2 -pipe -Wall -Woverloaded-virtual -Wswitch-enum -Wcast-qual -Wwrite-strings -Wredundant-decls -Wreorder -Wno-deprecated-declarations -fPIC   -W -DBUILDING_PODOFO -o CMakeFiles/podofo_shared.dir/base/PdfColor.cpp.o -c /var/tmp/portage/app-text/podofo-0.9.6_pre20170508-r1/work/podofo-0.9.6_pre20170508/src/base/PdfColor.cpp
  153. [  3%] Building CXX object src/CMakeFiles/podofo_shared.dir/base/PdfData.cpp.o
  154. cd /var/tmp/portage/app-text/podofo-0.9.6_pre20170508-r1/work/podofo-0.9.6_pre20170508_build/src && /usr/bin/x86_64-pc-linux-gnu-g++ -Dpodofo_shared_EXPORTS -I/var/tmp/portage/app-text/podofo-0.9.6_pre20170508-r1/work/podofo-0.9.6_pre20170508_build -I/var/tmp/portage/app-text/podofo-0.9.6_pre20170508-r1/work/podofo-0.9.6_pre20170508 -I/var/tmp/portage/app-text/podofo-0.9.6_pre20170508-r1/work/podofo-0.9.6_pre20170508/src -I/usr/include/freetype2   -DNDEBUG -march=native -O2 -pipe -Wall -Woverloaded-virtual -Wswitch-enum -Wcast-qual -Wwrite-strings -Wredundant-decls -Wreorder -Wno-deprecated-declarations -fPIC   -W -DBUILDING_PODOFO -o CMakeFiles/podofo_shared.dir/base/PdfContentsTokenizer.cpp.o -c /var/tmp/portage/app-text/podofo-0.9.6_pre20170508-r1/work/podofo-0.9.6_pre20170508/src/base/PdfContentsTokenizer.cpp
  155. [  4%] Building CXX object src/CMakeFiles/podofo_shared.dir/base/PdfDataType.cpp.o
  156. [  4%] Building CXX object src/CMakeFiles/podofo_shared.dir/base/PdfCanvas.cpp.o
  157. cd /var/tmp/portage/app-text/podofo-0.9.6_pre20170508-r1/work/podofo-0.9.6_pre20170508_build/src && /usr/bin/x86_64-pc-linux-gnu-g++ -Dpodofo_shared_EXPORTS -I/var/tmp/portage/app-text/podofo-0.9.6_pre20170508-r1/work/podofo-0.9.6_pre20170508_build -I/var/tmp/portage/app-text/podofo-0.9.6_pre20170508-r1/work/podofo-0.9.6_pre20170508 -I/var/tmp/portage/app-text/podofo-0.9.6_pre20170508-r1/work/podofo-0.9.6_pre20170508/src -I/usr/include/freetype2   -DNDEBUG -march=native -O2 -pipe -Wall -Woverloaded-virtual -Wswitch-enum -Wcast-qual -Wwrite-strings -Wredundant-decls -Wreorder -Wno-deprecated-declarations -fPIC   -W -DBUILDING_PODOFO -o CMakeFiles/podofo_shared.dir/base/PdfData.cpp.o -c /var/tmp/portage/app-text/podofo-0.9.6_pre20170508-r1/work/podofo-0.9.6_pre20170508/src/base/PdfData.cpp
  158. cd /var/tmp/portage/app-text/podofo-0.9.6_pre20170508-r1/work/podofo-0.9.6_pre20170508_build/src && /usr/bin/x86_64-pc-linux-gnu-g++ -Dpodofo_shared_EXPORTS -I/var/tmp/portage/app-text/podofo-0.9.6_pre20170508-r1/work/podofo-0.9.6_pre20170508_build -I/var/tmp/portage/app-text/podofo-0.9.6_pre20170508-r1/work/podofo-0.9.6_pre20170508 -I/var/tmp/portage/app-text/podofo-0.9.6_pre20170508-r1/work/podofo-0.9.6_pre20170508/src -I/usr/include/freetype2   -DNDEBUG -march=native -O2 -pipe -Wall -Woverloaded-virtual -Wswitch-enum -Wcast-qual -Wwrite-strings -Wredundant-decls -Wreorder -Wno-deprecated-declarations -fPIC   -W -DBUILDING_PODOFO -o CMakeFiles/podofo_shared.dir/base/PdfCanvas.cpp.o -c /var/tmp/portage/app-text/podofo-0.9.6_pre20170508-r1/work/podofo-0.9.6_pre20170508/src/base/PdfCanvas.cpp
  159. cd /var/tmp/portage/app-text/podofo-0.9.6_pre20170508-r1/work/podofo-0.9.6_pre20170508_build/src && /usr/bin/x86_64-pc-linux-gnu-g++ -Dpodofo_shared_EXPORTS -I/var/tmp/portage/app-text/podofo-0.9.6_pre20170508-r1/work/podofo-0.9.6_pre20170508_build -I/var/tmp/portage/app-text/podofo-0.9.6_pre20170508-r1/work/podofo-0.9.6_pre20170508 -I/var/tmp/portage/app-text/podofo-0.9.6_pre20170508-r1/work/podofo-0.9.6_pre20170508/src -I/usr/include/freetype2   -DNDEBUG -march=native -O2 -pipe -Wall -Woverloaded-virtual -Wswitch-enum -Wcast-qual -Wwrite-strings -Wredundant-decls -Wreorder -Wno-deprecated-declarations -fPIC   -W -DBUILDING_PODOFO -o CMakeFiles/podofo_shared.dir/base/PdfDataType.cpp.o -c /var/tmp/portage/app-text/podofo-0.9.6_pre20170508-r1/work/podofo-0.9.6_pre20170508/src/base/PdfDataType.cpp
  160. [  4%] Building CXX object src/CMakeFiles/podofo_shared.dir/base/PdfDate.cpp.o
  161. cd /var/tmp/portage/app-text/podofo-0.9.6_pre20170508-r1/work/podofo-0.9.6_pre20170508_build/src && /usr/bin/x86_64-pc-linux-gnu-g++ -Dpodofo_shared_EXPORTS -I/var/tmp/portage/app-text/podofo-0.9.6_pre20170508-r1/work/podofo-0.9.6_pre20170508_build -I/var/tmp/portage/app-text/podofo-0.9.6_pre20170508-r1/work/podofo-0.9.6_pre20170508 -I/var/tmp/portage/app-text/podofo-0.9.6_pre20170508-r1/work/podofo-0.9.6_pre20170508/src -I/usr/include/freetype2   -DNDEBUG -march=native -O2 -pipe -Wall -Woverloaded-virtual -Wswitch-enum -Wcast-qual -Wwrite-strings -Wredundant-decls -Wreorder -Wno-deprecated-declarations -fPIC   -W -DBUILDING_PODOFO -o CMakeFiles/podofo_shared.dir/base/PdfDate.cpp.o -c /var/tmp/portage/app-text/podofo-0.9.6_pre20170508-r1/work/podofo-0.9.6_pre20170508/src/base/PdfDate.cpp
  162. [  5%] Building CXX object src/CMakeFiles/podofo_shared.dir/base/PdfDictionary.cpp.o
  163. cd /var/tmp/portage/app-text/podofo-0.9.6_pre20170508-r1/work/podofo-0.9.6_pre20170508_build/src && /usr/bin/x86_64-pc-linux-gnu-g++ -Dpodofo_shared_EXPORTS -I/var/tmp/portage/app-text/podofo-0.9.6_pre20170508-r1/work/podofo-0.9.6_pre20170508_build -I/var/tmp/portage/app-text/podofo-0.9.6_pre20170508-r1/work/podofo-0.9.6_pre20170508 -I/var/tmp/portage/app-text/podofo-0.9.6_pre20170508-r1/work/podofo-0.9.6_pre20170508/src -I/usr/include/freetype2   -DNDEBUG -march=native -O2 -pipe -Wall -Woverloaded-virtual -Wswitch-enum -Wcast-qual -Wwrite-strings -Wredundant-decls -Wreorder -Wno-deprecated-declarations -fPIC   -W -DBUILDING_PODOFO -o CMakeFiles/podofo_shared.dir/base/PdfDictionary.cpp.o -c /var/tmp/portage/app-text/podofo-0.9.6_pre20170508-r1/work/podofo-0.9.6_pre20170508/src/base/PdfDictionary.cpp
  164. [  5%] Building CXX object src/CMakeFiles/podofo_shared.dir/base/PdfEncoding.cpp.o
  165. cd /var/tmp/portage/app-text/podofo-0.9.6_pre20170508-r1/work/podofo-0.9.6_pre20170508_build/src && /usr/bin/x86_64-pc-linux-gnu-g++ -Dpodofo_shared_EXPORTS -I/var/tmp/portage/app-text/podofo-0.9.6_pre20170508-r1/work/podofo-0.9.6_pre20170508_build -I/var/tmp/portage/app-text/podofo-0.9.6_pre20170508-r1/work/podofo-0.9.6_pre20170508 -I/var/tmp/portage/app-text/podofo-0.9.6_pre20170508-r1/work/podofo-0.9.6_pre20170508/src -I/usr/include/freetype2   -DNDEBUG -march=native -O2 -pipe -Wall -Woverloaded-virtual -Wswitch-enum -Wcast-qual -Wwrite-strings -Wredundant-decls -Wreorder -Wno-deprecated-declarations -fPIC   -W -DBUILDING_PODOFO -o CMakeFiles/podofo_shared.dir/base/PdfEncoding.cpp.o -c /var/tmp/portage/app-text/podofo-0.9.6_pre20170508-r1/work/podofo-0.9.6_pre20170508/src/base/PdfEncoding.cpp
  166. [  6%] Building CXX object src/CMakeFiles/podofo_shared.dir/base/PdfEncodingFactory.cpp.o
  167. cd /var/tmp/portage/app-text/podofo-0.9.6_pre20170508-r1/work/podofo-0.9.6_pre20170508_build/src && /usr/bin/x86_64-pc-linux-gnu-g++ -Dpodofo_shared_EXPORTS -I/var/tmp/portage/app-text/podofo-0.9.6_pre20170508-r1/work/podofo-0.9.6_pre20170508_build -I/var/tmp/portage/app-text/podofo-0.9.6_pre20170508-r1/work/podofo-0.9.6_pre20170508 -I/var/tmp/portage/app-text/podofo-0.9.6_pre20170508-r1/work/podofo-0.9.6_pre20170508/src -I/usr/include/freetype2   -DNDEBUG -march=native -O2 -pipe -Wall -Woverloaded-virtual -Wswitch-enum -Wcast-qual -Wwrite-strings -Wredundant-decls -Wreorder -Wno-deprecated-declarations -fPIC   -W -DBUILDING_PODOFO -o CMakeFiles/podofo_shared.dir/base/PdfEncodingFactory.cpp.o -c /var/tmp/portage/app-text/podofo-0.9.6_pre20170508-r1/work/podofo-0.9.6_pre20170508/src/base/PdfEncodingFactory.cpp
  168. /var/tmp/portage/app-text/podofo-0.9.6_pre20170508-r1/work/podofo-0.9.6_pre20170508/src/base/PdfDate.cpp: In member function ‘void PoDoFo::PdfDate::CreateStringRepresentation()’:
  169. /var/tmp/portage/app-text/podofo-0.9.6_pre20170508-r1/work/podofo-0.9.6_pre20170508/src/base/PdfDate.cpp:204:47: warning: ‘%s’ directive output may be truncated writing up to 5 bytes into a region of size between 1 and 26 [-Wformat-truncation=]
  170.      snprintf( m_szDate, PDF_DATE_BUFFER_SIZE, "%s%s'00'", szDate, szZone );
  171.                                                ^~~~~~~~~~          ~~~~~~
  172. In file included from /usr/include/stdio.h:867,
  173.                  from /usr/lib/gcc/x86_64-pc-linux-gnu/8.3.0/include/g++-v8/cstdio:42,
  174.                  from /usr/lib/gcc/x86_64-pc-linux-gnu/8.3.0/include/g++-v8/ext/string_conversions.h:43,
  175.                  from /usr/lib/gcc/x86_64-pc-linux-gnu/8.3.0/include/g++-v8/bits/basic_string.h:6400,
  176.                  from /usr/lib/gcc/x86_64-pc-linux-gnu/8.3.0/include/g++-v8/string:52,
  177.                  from /usr/lib/gcc/x86_64-pc-linux-gnu/8.3.0/include/g++-v8/stdexcept:39,
  178.                  from /usr/lib/gcc/x86_64-pc-linux-gnu/8.3.0/include/g++-v8/array:39,
  179.                  from /usr/lib/gcc/x86_64-pc-linux-gnu/8.3.0/include/g++-v8/tuple:39,
  180.                  from /usr/lib/gcc/x86_64-pc-linux-gnu/8.3.0/include/g++-v8/bits/stl_map.h:63,
  181.                  from /usr/lib/gcc/x86_64-pc-linux-gnu/8.3.0/include/g++-v8/map:61,
  182.                  from /var/tmp/portage/app-text/podofo-0.9.6_pre20170508-r1/work/podofo-0.9.6_pre20170508/src/base/PdfDefines.h:81,
  183.                  from /var/tmp/portage/app-text/podofo-0.9.6_pre20170508-r1/work/podofo-0.9.6_pre20170508/src/base/PdfDate.h:37,
  184.                  from /var/tmp/portage/app-text/podofo-0.9.6_pre20170508-r1/work/podofo-0.9.6_pre20170508/src/base/PdfDate.cpp:34:
  185. /usr/include/bits/stdio2.h:67:35: note: ‘__builtin___snprintf_chk’ output between 5 and 35 bytes into a destination of size 26
  186.    return __builtin___snprintf_chk (__s, __n, __USE_FORTIFY_LEVEL - 1,
  187.           ~~~~~~~~~~~~~~~~~~~~~~~~~^~~~~~~~~~~~~~~~~~~~~~~~~~~~~~~~~~~
  188.         __bos (__s), __fmt, __va_arg_pack ());
  189.         ~~~~~~~~~~~~~~~~~~~~~~~~~~~~~~~~~~~~~
  190. [  6%] Building CXX object src/CMakeFiles/podofo_shared.dir/base/PdfEncrypt.cpp.o
  191. cd /var/tmp/portage/app-text/podofo-0.9.6_pre20170508-r1/work/podofo-0.9.6_pre20170508_build/src && /usr/bin/x86_64-pc-linux-gnu-g++ -Dpodofo_shared_EXPORTS -I/var/tmp/portage/app-text/podofo-0.9.6_pre20170508-r1/work/podofo-0.9.6_pre20170508_build -I/var/tmp/portage/app-text/podofo-0.9.6_pre20170508-r1/work/podofo-0.9.6_pre20170508 -I/var/tmp/portage/app-text/podofo-0.9.6_pre20170508-r1/work/podofo-0.9.6_pre20170508/src -I/usr/include/freetype2   -DNDEBUG -march=native -O2 -pipe -Wall -Woverloaded-virtual -Wswitch-enum -Wcast-qual -Wwrite-strings -Wredundant-decls -Wreorder -Wno-deprecated-declarations -fPIC   -W -DBUILDING_PODOFO -o CMakeFiles/podofo_shared.dir/base/PdfEncrypt.cpp.o -c /var/tmp/portage/app-text/podofo-0.9.6_pre20170508-r1/work/podofo-0.9.6_pre20170508/src/base/PdfEncrypt.cpp
  192. [  7%] Building CXX object src/CMakeFiles/podofo_shared.dir/base/PdfError.cpp.o
  193. cd /var/tmp/portage/app-text/podofo-0.9.6_pre20170508-r1/work/podofo-0.9.6_pre20170508_build/src && /usr/bin/x86_64-pc-linux-gnu-g++ -Dpodofo_shared_EXPORTS -I/var/tmp/portage/app-text/podofo-0.9.6_pre20170508-r1/work/podofo-0.9.6_pre20170508_build -I/var/tmp/portage/app-text/podofo-0.9.6_pre20170508-r1/work/podofo-0.9.6_pre20170508 -I/var/tmp/portage/app-text/podofo-0.9.6_pre20170508-r1/work/podofo-0.9.6_pre20170508/src -I/usr/include/freetype2   -DNDEBUG -march=native -O2 -pipe -Wall -Woverloaded-virtual -Wswitch-enum -Wcast-qual -Wwrite-strings -Wredundant-decls -Wreorder -Wno-deprecated-declarations -fPIC   -W -DBUILDING_PODOFO -o CMakeFiles/podofo_shared.dir/base/PdfError.cpp.o -c /var/tmp/portage/app-text/podofo-0.9.6_pre20170508-r1/work/podofo-0.9.6_pre20170508/src/base/PdfError.cpp
  194. [  8%] Building CXX object src/CMakeFiles/podofo_shared.dir/base/PdfFileStream.cpp.o
  195. cd /var/tmp/portage/app-text/podofo-0.9.6_pre20170508-r1/work/podofo-0.9.6_pre20170508_build/src && /usr/bin/x86_64-pc-linux-gnu-g++ -Dpodofo_shared_EXPORTS -I/var/tmp/portage/app-text/podofo-0.9.6_pre20170508-r1/work/podofo-0.9.6_pre20170508_build -I/var/tmp/portage/app-text/podofo-0.9.6_pre20170508-r1/work/podofo-0.9.6_pre20170508 -I/var/tmp/portage/app-text/podofo-0.9.6_pre20170508-r1/work/podofo-0.9.6_pre20170508/src -I/usr/include/freetype2   -DNDEBUG -march=native -O2 -pipe -Wall -Woverloaded-virtual -Wswitch-enum -Wcast-qual -Wwrite-strings -Wredundant-decls -Wreorder -Wno-deprecated-declarations -fPIC   -W -DBUILDING_PODOFO -o CMakeFiles/podofo_shared.dir/base/PdfFileStream.cpp.o -c /var/tmp/portage/app-text/podofo-0.9.6_pre20170508-r1/work/podofo-0.9.6_pre20170508/src/base/PdfFileStream.cpp
  196. [  8%] Building CXX object src/CMakeFiles/podofo_shared.dir/base/PdfFilter.cpp.o
  197. cd /var/tmp/portage/app-text/podofo-0.9.6_pre20170508-r1/work/podofo-0.9.6_pre20170508_build/src && /usr/bin/x86_64-pc-linux-gnu-g++ -Dpodofo_shared_EXPORTS -I/var/tmp/portage/app-text/podofo-0.9.6_pre20170508-r1/work/podofo-0.9.6_pre20170508_build -I/var/tmp/portage/app-text/podofo-0.9.6_pre20170508-r1/work/podofo-0.9.6_pre20170508 -I/var/tmp/portage/app-text/podofo-0.9.6_pre20170508-r1/work/podofo-0.9.6_pre20170508/src -I/usr/include/freetype2   -DNDEBUG -march=native -O2 -pipe -Wall -Woverloaded-virtual -Wswitch-enum -Wcast-qual -Wwrite-strings -Wredundant-decls -Wreorder -Wno-deprecated-declarations -fPIC   -W -DBUILDING_PODOFO -o CMakeFiles/podofo_shared.dir/base/PdfFilter.cpp.o -c /var/tmp/portage/app-text/podofo-0.9.6_pre20170508-r1/work/podofo-0.9.6_pre20170508/src/base/PdfFilter.cpp
  198. [  9%] Building CXX object src/CMakeFiles/podofo_shared.dir/base/PdfFiltersPrivate.cpp.o
  199. cd /var/tmp/portage/app-text/podofo-0.9.6_pre20170508-r1/work/podofo-0.9.6_pre20170508_build/src && /usr/bin/x86_64-pc-linux-gnu-g++ -Dpodofo_shared_EXPORTS -I/var/tmp/portage/app-text/podofo-0.9.6_pre20170508-r1/work/podofo-0.9.6_pre20170508_build -I/var/tmp/portage/app-text/podofo-0.9.6_pre20170508-r1/work/podofo-0.9.6_pre20170508 -I/var/tmp/portage/app-text/podofo-0.9.6_pre20170508-r1/work/podofo-0.9.6_pre20170508/src -I/usr/include/freetype2   -DNDEBUG -march=native -O2 -pipe -Wall -Woverloaded-virtual -Wswitch-enum -Wcast-qual -Wwrite-strings -Wredundant-decls -Wreorder -Wno-deprecated-declarations -fPIC   -W -DBUILDING_PODOFO -o CMakeFiles/podofo_shared.dir/base/PdfFiltersPrivate.cpp.o -c /var/tmp/portage/app-text/podofo-0.9.6_pre20170508-r1/work/podofo-0.9.6_pre20170508/src/base/PdfFiltersPrivate.cpp
  200. [  9%] Building CXX object src/CMakeFiles/podofo_shared.dir/base/PdfImmediateWriter.cpp.o
  201. cd /var/tmp/portage/app-text/podofo-0.9.6_pre20170508-r1/work/podofo-0.9.6_pre20170508_build/src && /usr/bin/x86_64-pc-linux-gnu-g++ -Dpodofo_shared_EXPORTS -I/var/tmp/portage/app-text/podofo-0.9.6_pre20170508-r1/work/podofo-0.9.6_pre20170508_build -I/var/tmp/portage/app-text/podofo-0.9.6_pre20170508-r1/work/podofo-0.9.6_pre20170508 -I/var/tmp/portage/app-text/podofo-0.9.6_pre20170508-r1/work/podofo-0.9.6_pre20170508/src -I/usr/include/freetype2   -DNDEBUG -march=native -O2 -pipe -Wall -Woverloaded-virtual -Wswitch-enum -Wcast-qual -Wwrite-strings -Wredundant-decls -Wreorder -Wno-deprecated-declarations -fPIC   -W -DBUILDING_PODOFO -o CMakeFiles/podofo_shared.dir/base/PdfImmediateWriter.cpp.o -c /var/tmp/portage/app-text/podofo-0.9.6_pre20170508-r1/work/podofo-0.9.6_pre20170508/src/base/PdfImmediateWriter.cpp
  202. [ 10%] Building CXX object src/CMakeFiles/podofo_shared.dir/base/PdfInputDevice.cpp.o
  203. cd /var/tmp/portage/app-text/podofo-0.9.6_pre20170508-r1/work/podofo-0.9.6_pre20170508_build/src && /usr/bin/x86_64-pc-linux-gnu-g++ -Dpodofo_shared_EXPORTS -I/var/tmp/portage/app-text/podofo-0.9.6_pre20170508-r1/work/podofo-0.9.6_pre20170508_build -I/var/tmp/portage/app-text/podofo-0.9.6_pre20170508-r1/work/podofo-0.9.6_pre20170508 -I/var/tmp/portage/app-text/podofo-0.9.6_pre20170508-r1/work/podofo-0.9.6_pre20170508/src -I/usr/include/freetype2   -DNDEBUG -march=native -O2 -pipe -Wall -Woverloaded-virtual -Wswitch-enum -Wcast-qual -Wwrite-strings -Wredundant-decls -Wreorder -Wno-deprecated-declarations -fPIC   -W -DBUILDING_PODOFO -o CMakeFiles/podofo_shared.dir/base/PdfInputDevice.cpp.o -c /var/tmp/portage/app-text/podofo-0.9.6_pre20170508-r1/work/podofo-0.9.6_pre20170508/src/base/PdfInputDevice.cpp
  204. [ 11%] Building CXX object src/CMakeFiles/podofo_shared.dir/base/PdfInputStream.cpp.o
  205. cd /var/tmp/portage/app-text/podofo-0.9.6_pre20170508-r1/work/podofo-0.9.6_pre20170508_build/src && /usr/bin/x86_64-pc-linux-gnu-g++ -Dpodofo_shared_EXPORTS -I/var/tmp/portage/app-text/podofo-0.9.6_pre20170508-r1/work/podofo-0.9.6_pre20170508_build -I/var/tmp/portage/app-text/podofo-0.9.6_pre20170508-r1/work/podofo-0.9.6_pre20170508 -I/var/tmp/portage/app-text/podofo-0.9.6_pre20170508-r1/work/podofo-0.9.6_pre20170508/src -I/usr/include/freetype2   -DNDEBUG -march=native -O2 -pipe -Wall -Woverloaded-virtual -Wswitch-enum -Wcast-qual -Wwrite-strings -Wredundant-decls -Wreorder -Wno-deprecated-declarations -fPIC   -W -DBUILDING_PODOFO -o CMakeFiles/podofo_shared.dir/base/PdfInputStream.cpp.o -c /var/tmp/portage/app-text/podofo-0.9.6_pre20170508-r1/work/podofo-0.9.6_pre20170508/src/base/PdfInputStream.cpp
  206. [ 11%] Building CXX object src/CMakeFiles/podofo_shared.dir/base/PdfLocale.cpp.o
  207. cd /var/tmp/portage/app-text/podofo-0.9.6_pre20170508-r1/work/podofo-0.9.6_pre20170508_build/src && /usr/bin/x86_64-pc-linux-gnu-g++ -Dpodofo_shared_EXPORTS -I/var/tmp/portage/app-text/podofo-0.9.6_pre20170508-r1/work/podofo-0.9.6_pre20170508_build -I/var/tmp/portage/app-text/podofo-0.9.6_pre20170508-r1/work/podofo-0.9.6_pre20170508 -I/var/tmp/portage/app-text/podofo-0.9.6_pre20170508-r1/work/podofo-0.9.6_pre20170508/src -I/usr/include/freetype2   -DNDEBUG -march=native -O2 -pipe -Wall -Woverloaded-virtual -Wswitch-enum -Wcast-qual -Wwrite-strings -Wredundant-decls -Wreorder -Wno-deprecated-declarations -fPIC   -W -DBUILDING_PODOFO -o CMakeFiles/podofo_shared.dir/base/PdfLocale.cpp.o -c /var/tmp/portage/app-text/podofo-0.9.6_pre20170508-r1/work/podofo-0.9.6_pre20170508/src/base/PdfLocale.cpp
  208. [ 12%] Building CXX object src/CMakeFiles/podofo_shared.dir/base/PdfMemStream.cpp.o
  209. cd /var/tmp/portage/app-text/podofo-0.9.6_pre20170508-r1/work/podofo-0.9.6_pre20170508_build/src && /usr/bin/x86_64-pc-linux-gnu-g++ -Dpodofo_shared_EXPORTS -I/var/tmp/portage/app-text/podofo-0.9.6_pre20170508-r1/work/podofo-0.9.6_pre20170508_build -I/var/tmp/portage/app-text/podofo-0.9.6_pre20170508-r1/work/podofo-0.9.6_pre20170508 -I/var/tmp/portage/app-text/podofo-0.9.6_pre20170508-r1/work/podofo-0.9.6_pre20170508/src -I/usr/include/freetype2   -DNDEBUG -march=native -O2 -pipe -Wall -Woverloaded-virtual -Wswitch-enum -Wcast-qual -Wwrite-strings -Wredundant-decls -Wreorder -Wno-deprecated-declarations -fPIC   -W -DBUILDING_PODOFO -o CMakeFiles/podofo_shared.dir/base/PdfMemStream.cpp.o -c /var/tmp/portage/app-text/podofo-0.9.6_pre20170508-r1/work/podofo-0.9.6_pre20170508/src/base/PdfMemStream.cpp
  210. [ 12%] Building CXX object src/CMakeFiles/podofo_shared.dir/base/PdfMemoryManagement.cpp.o
  211. cd /var/tmp/portage/app-text/podofo-0.9.6_pre20170508-r1/work/podofo-0.9.6_pre20170508_build/src && /usr/bin/x86_64-pc-linux-gnu-g++ -Dpodofo_shared_EXPORTS -I/var/tmp/portage/app-text/podofo-0.9.6_pre20170508-r1/work/podofo-0.9.6_pre20170508_build -I/var/tmp/portage/app-text/podofo-0.9.6_pre20170508-r1/work/podofo-0.9.6_pre20170508 -I/var/tmp/portage/app-text/podofo-0.9.6_pre20170508-r1/work/podofo-0.9.6_pre20170508/src -I/usr/include/freetype2   -DNDEBUG -march=native -O2 -pipe -Wall -Woverloaded-virtual -Wswitch-enum -Wcast-qual -Wwrite-strings -Wredundant-decls -Wreorder -Wno-deprecated-declarations -fPIC   -W -DBUILDING_PODOFO -o CMakeFiles/podofo_shared.dir/base/PdfMemoryManagement.cpp.o -c /var/tmp/portage/app-text/podofo-0.9.6_pre20170508-r1/work/podofo-0.9.6_pre20170508/src/base/PdfMemoryManagement.cpp
  212. [ 13%] Building CXX object src/CMakeFiles/podofo_shared.dir/base/PdfName.cpp.o
  213. cd /var/tmp/portage/app-text/podofo-0.9.6_pre20170508-r1/work/podofo-0.9.6_pre20170508_build/src && /usr/bin/x86_64-pc-linux-gnu-g++ -Dpodofo_shared_EXPORTS -I/var/tmp/portage/app-text/podofo-0.9.6_pre20170508-r1/work/podofo-0.9.6_pre20170508_build -I/var/tmp/portage/app-text/podofo-0.9.6_pre20170508-r1/work/podofo-0.9.6_pre20170508 -I/var/tmp/portage/app-text/podofo-0.9.6_pre20170508-r1/work/podofo-0.9.6_pre20170508/src -I/usr/include/freetype2   -DNDEBUG -march=native -O2 -pipe -Wall -Woverloaded-virtual -Wswitch-enum -Wcast-qual -Wwrite-strings -Wredundant-decls -Wreorder -Wno-deprecated-declarations -fPIC   -W -DBUILDING_PODOFO -o CMakeFiles/podofo_shared.dir/base/PdfName.cpp.o -c /var/tmp/portage/app-text/podofo-0.9.6_pre20170508-r1/work/podofo-0.9.6_pre20170508/src/base/PdfName.cpp
  214. /var/tmp/portage/app-text/podofo-0.9.6_pre20170508-r1/work/podofo-0.9.6_pre20170508/src/base/PdfInputDevice.cpp: In member function ‘virtual void PoDoFo::PdfInputDevice::Seek(std::streamoff, std::ios_base::seekdir)’:
  215. /var/tmp/portage/app-text/podofo-0.9.6_pre20170508-r1/work/podofo-0.9.6_pre20170508/src/base/PdfInputDevice.cpp:226:19: warning: enumeration value ‘_S_ios_seekdir_end’ not handled in switch [-Wswitch-enum]
  216.              switch( dir )
  217.                    ^
  218. [ 13%] Building CXX object src/CMakeFiles/podofo_shared.dir/base/PdfObject.cpp.o
  219. cd /var/tmp/portage/app-text/podofo-0.9.6_pre20170508-r1/work/podofo-0.9.6_pre20170508_build/src && /usr/bin/x86_64-pc-linux-gnu-g++ -Dpodofo_shared_EXPORTS -I/var/tmp/portage/app-text/podofo-0.9.6_pre20170508-r1/work/podofo-0.9.6_pre20170508_build -I/var/tmp/portage/app-text/podofo-0.9.6_pre20170508-r1/work/podofo-0.9.6_pre20170508 -I/var/tmp/portage/app-text/podofo-0.9.6_pre20170508-r1/work/podofo-0.9.6_pre20170508/src -I/usr/include/freetype2   -DNDEBUG -march=native -O2 -pipe -Wall -Woverloaded-virtual -Wswitch-enum -Wcast-qual -Wwrite-strings -Wredundant-decls -Wreorder -Wno-deprecated-declarations -fPIC   -W -DBUILDING_PODOFO -o CMakeFiles/podofo_shared.dir/base/PdfObject.cpp.o -c /var/tmp/portage/app-text/podofo-0.9.6_pre20170508-r1/work/podofo-0.9.6_pre20170508/src/base/PdfObject.cpp
  220. [ 14%] Building CXX object src/CMakeFiles/podofo_shared.dir/base/PdfObjectStreamParserObject.cpp.o
  221. cd /var/tmp/portage/app-text/podofo-0.9.6_pre20170508-r1/work/podofo-0.9.6_pre20170508_build/src && /usr/bin/x86_64-pc-linux-gnu-g++ -Dpodofo_shared_EXPORTS -I/var/tmp/portage/app-text/podofo-0.9.6_pre20170508-r1/work/podofo-0.9.6_pre20170508_build -I/var/tmp/portage/app-text/podofo-0.9.6_pre20170508-r1/work/podofo-0.9.6_pre20170508 -I/var/tmp/portage/app-text/podofo-0.9.6_pre20170508-r1/work/podofo-0.9.6_pre20170508/src -I/usr/include/freetype2   -DNDEBUG -march=native -O2 -pipe -Wall -Woverloaded-virtual -Wswitch-enum -Wcast-qual -Wwrite-strings -Wredundant-decls -Wreorder -Wno-deprecated-declarations -fPIC   -W -DBUILDING_PODOFO -o CMakeFiles/podofo_shared.dir/base/PdfObjectStreamParserObject.cpp.o -c /var/tmp/portage/app-text/podofo-0.9.6_pre20170508-r1/work/podofo-0.9.6_pre20170508/src/base/PdfObjectStreamParserObject.cpp
  222. [ 15%] Building CXX object src/CMakeFiles/podofo_shared.dir/base/PdfOutputDevice.cpp.o
  223. cd /var/tmp/portage/app-text/podofo-0.9.6_pre20170508-r1/work/podofo-0.9.6_pre20170508_build/src && /usr/bin/x86_64-pc-linux-gnu-g++ -Dpodofo_shared_EXPORTS -I/var/tmp/portage/app-text/podofo-0.9.6_pre20170508-r1/work/podofo-0.9.6_pre20170508_build -I/var/tmp/portage/app-text/podofo-0.9.6_pre20170508-r1/work/podofo-0.9.6_pre20170508 -I/var/tmp/portage/app-text/podofo-0.9.6_pre20170508-r1/work/podofo-0.9.6_pre20170508/src -I/usr/include/freetype2   -DNDEBUG -march=native -O2 -pipe -Wall -Woverloaded-virtual -Wswitch-enum -Wcast-qual -Wwrite-strings -Wredundant-decls -Wreorder -Wno-deprecated-declarations -fPIC   -W -DBUILDING_PODOFO -o CMakeFiles/podofo_shared.dir/base/PdfOutputDevice.cpp.o -c /var/tmp/portage/app-text/podofo-0.9.6_pre20170508-r1/work/podofo-0.9.6_pre20170508/src/base/PdfOutputDevice.cpp
  224. [ 15%] Building CXX object src/CMakeFiles/podofo_shared.dir/base/PdfOutputStream.cpp.o
  225. cd /var/tmp/portage/app-text/podofo-0.9.6_pre20170508-r1/work/podofo-0.9.6_pre20170508_build/src && /usr/bin/x86_64-pc-linux-gnu-g++ -Dpodofo_shared_EXPORTS -I/var/tmp/portage/app-text/podofo-0.9.6_pre20170508-r1/work/podofo-0.9.6_pre20170508_build -I/var/tmp/portage/app-text/podofo-0.9.6_pre20170508-r1/work/podofo-0.9.6_pre20170508 -I/var/tmp/portage/app-text/podofo-0.9.6_pre20170508-r1/work/podofo-0.9.6_pre20170508/src -I/usr/include/freetype2   -DNDEBUG -march=native -O2 -pipe -Wall -Woverloaded-virtual -Wswitch-enum -Wcast-qual -Wwrite-strings -Wredundant-decls -Wreorder -Wno-deprecated-declarations -fPIC   -W -DBUILDING_PODOFO -o CMakeFiles/podofo_shared.dir/base/PdfOutputStream.cpp.o -c /var/tmp/portage/app-text/podofo-0.9.6_pre20170508-r1/work/podofo-0.9.6_pre20170508/src/base/PdfOutputStream.cpp
  226. [ 16%] Building CXX object src/CMakeFiles/podofo_shared.dir/base/PdfParser.cpp.o
  227. cd /var/tmp/portage/app-text/podofo-0.9.6_pre20170508-r1/work/podofo-0.9.6_pre20170508_build/src && /usr/bin/x86_64-pc-linux-gnu-g++ -Dpodofo_shared_EXPORTS -I/var/tmp/portage/app-text/podofo-0.9.6_pre20170508-r1/work/podofo-0.9.6_pre20170508_build -I/var/tmp/portage/app-text/podofo-0.9.6_pre20170508-r1/work/podofo-0.9.6_pre20170508 -I/var/tmp/portage/app-text/podofo-0.9.6_pre20170508-r1/work/podofo-0.9.6_pre20170508/src -I/usr/include/freetype2   -DNDEBUG -march=native -O2 -pipe -Wall -Woverloaded-virtual -Wswitch-enum -Wcast-qual -Wwrite-strings -Wredundant-decls -Wreorder -Wno-deprecated-declarations -fPIC   -W -DBUILDING_PODOFO -o CMakeFiles/podofo_shared.dir/base/PdfParser.cpp.o -c /var/tmp/portage/app-text/podofo-0.9.6_pre20170508-r1/work/podofo-0.9.6_pre20170508/src/base/PdfParser.cpp
  228. [ 16%] Building CXX object src/CMakeFiles/podofo_shared.dir/base/PdfParserObject.cpp.o
  229. cd /var/tmp/portage/app-text/podofo-0.9.6_pre20170508-r1/work/podofo-0.9.6_pre20170508_build/src && /usr/bin/x86_64-pc-linux-gnu-g++ -Dpodofo_shared_EXPORTS -I/var/tmp/portage/app-text/podofo-0.9.6_pre20170508-r1/work/podofo-0.9.6_pre20170508_build -I/var/tmp/portage/app-text/podofo-0.9.6_pre20170508-r1/work/podofo-0.9.6_pre20170508 -I/var/tmp/portage/app-text/podofo-0.9.6_pre20170508-r1/work/podofo-0.9.6_pre20170508/src -I/usr/include/freetype2   -DNDEBUG -march=native -O2 -pipe -Wall -Woverloaded-virtual -Wswitch-enum -Wcast-qual -Wwrite-strings -Wredundant-decls -Wreorder -Wno-deprecated-declarations -fPIC   -W -DBUILDING_PODOFO -o CMakeFiles/podofo_shared.dir/base/PdfParserObject.cpp.o -c /var/tmp/portage/app-text/podofo-0.9.6_pre20170508-r1/work/podofo-0.9.6_pre20170508/src/base/PdfParserObject.cpp
  230. [ 17%] Building CXX object src/CMakeFiles/podofo_shared.dir/base/PdfRect.cpp.o
  231. cd /var/tmp/portage/app-text/podofo-0.9.6_pre20170508-r1/work/podofo-0.9.6_pre20170508_build/src && /usr/bin/x86_64-pc-linux-gnu-g++ -Dpodofo_shared_EXPORTS -I/var/tmp/portage/app-text/podofo-0.9.6_pre20170508-r1/work/podofo-0.9.6_pre20170508_build -I/var/tmp/portage/app-text/podofo-0.9.6_pre20170508-r1/work/podofo-0.9.6_pre20170508 -I/var/tmp/portage/app-text/podofo-0.9.6_pre20170508-r1/work/podofo-0.9.6_pre20170508/src -I/usr/include/freetype2   -DNDEBUG -march=native -O2 -pipe -Wall -Woverloaded-virtual -Wswitch-enum -Wcast-qual -Wwrite-strings -Wredundant-decls -Wreorder -Wno-deprecated-declarations -fPIC   -W -DBUILDING_PODOFO -o CMakeFiles/podofo_shared.dir/base/PdfRect.cpp.o -c /var/tmp/portage/app-text/podofo-0.9.6_pre20170508-r1/work/podofo-0.9.6_pre20170508/src/base/PdfRect.cpp
  232. [ 17%] Building CXX object src/CMakeFiles/podofo_shared.dir/base/PdfRefCountedBuffer.cpp.o
  233. cd /var/tmp/portage/app-text/podofo-0.9.6_pre20170508-r1/work/podofo-0.9.6_pre20170508_build/src && /usr/bin/x86_64-pc-linux-gnu-g++ -Dpodofo_shared_EXPORTS -I/var/tmp/portage/app-text/podofo-0.9.6_pre20170508-r1/work/podofo-0.9.6_pre20170508_build -I/var/tmp/portage/app-text/podofo-0.9.6_pre20170508-r1/work/podofo-0.9.6_pre20170508 -I/var/tmp/portage/app-text/podofo-0.9.6_pre20170508-r1/work/podofo-0.9.6_pre20170508/src -I/usr/include/freetype2   -DNDEBUG -march=native -O2 -pipe -Wall -Woverloaded-virtual -Wswitch-enum -Wcast-qual -Wwrite-strings -Wredundant-decls -Wreorder -Wno-deprecated-declarations -fPIC   -W -DBUILDING_PODOFO -o CMakeFiles/podofo_shared.dir/base/PdfRefCountedBuffer.cpp.o -c /var/tmp/portage/app-text/podofo-0.9.6_pre20170508-r1/work/podofo-0.9.6_pre20170508/src/base/PdfRefCountedBuffer.cpp
  234. [ 18%] Building CXX object src/CMakeFiles/podofo_shared.dir/base/PdfRefCountedInputDevice.cpp.o
  235. cd /var/tmp/portage/app-text/podofo-0.9.6_pre20170508-r1/work/podofo-0.9.6_pre20170508_build/src && /usr/bin/x86_64-pc-linux-gnu-g++ -Dpodofo_shared_EXPORTS -I/var/tmp/portage/app-text/podofo-0.9.6_pre20170508-r1/work/podofo-0.9.6_pre20170508_build -I/var/tmp/portage/app-text/podofo-0.9.6_pre20170508-r1/work/podofo-0.9.6_pre20170508 -I/var/tmp/portage/app-text/podofo-0.9.6_pre20170508-r1/work/podofo-0.9.6_pre20170508/src -I/usr/include/freetype2   -DNDEBUG -march=native -O2 -pipe -Wall -Woverloaded-virtual -Wswitch-enum -Wcast-qual -Wwrite-strings -Wredundant-decls -Wreorder -Wno-deprecated-declarations -fPIC   -W -DBUILDING_PODOFO -o CMakeFiles/podofo_shared.dir/base/PdfRefCountedInputDevice.cpp.o -c /var/tmp/portage/app-text/podofo-0.9.6_pre20170508-r1/work/podofo-0.9.6_pre20170508/src/base/PdfRefCountedInputDevice.cpp
  236. [ 19%] Building CXX object src/CMakeFiles/podofo_shared.dir/base/PdfReference.cpp.o
  237. cd /var/tmp/portage/app-text/podofo-0.9.6_pre20170508-r1/work/podofo-0.9.6_pre20170508_build/src && /usr/bin/x86_64-pc-linux-gnu-g++ -Dpodofo_shared_EXPORTS -I/var/tmp/portage/app-text/podofo-0.9.6_pre20170508-r1/work/podofo-0.9.6_pre20170508_build -I/var/tmp/portage/app-text/podofo-0.9.6_pre20170508-r1/work/podofo-0.9.6_pre20170508 -I/var/tmp/portage/app-text/podofo-0.9.6_pre20170508-r1/work/podofo-0.9.6_pre20170508/src -I/usr/include/freetype2   -DNDEBUG -march=native -O2 -pipe -Wall -Woverloaded-virtual -Wswitch-enum -Wcast-qual -Wwrite-strings -Wredundant-decls -Wreorder -Wno-deprecated-declarations -fPIC   -W -DBUILDING_PODOFO -o CMakeFiles/podofo_shared.dir/base/PdfReference.cpp.o -c /var/tmp/portage/app-text/podofo-0.9.6_pre20170508-r1/work/podofo-0.9.6_pre20170508/src/base/PdfReference.cpp
  238. [ 19%] Building CXX object src/CMakeFiles/podofo_shared.dir/base/PdfStream.cpp.o
  239. cd /var/tmp/portage/app-text/podofo-0.9.6_pre20170508-r1/work/podofo-0.9.6_pre20170508_build/src && /usr/bin/x86_64-pc-linux-gnu-g++ -Dpodofo_shared_EXPORTS -I/var/tmp/portage/app-text/podofo-0.9.6_pre20170508-r1/work/podofo-0.9.6_pre20170508_build -I/var/tmp/portage/app-text/podofo-0.9.6_pre20170508-r1/work/podofo-0.9.6_pre20170508 -I/var/tmp/portage/app-text/podofo-0.9.6_pre20170508-r1/work/podofo-0.9.6_pre20170508/src -I/usr/include/freetype2   -DNDEBUG -march=native -O2 -pipe -Wall -Woverloaded-virtual -Wswitch-enum -Wcast-qual -Wwrite-strings -Wredundant-decls -Wreorder -Wno-deprecated-declarations -fPIC   -W -DBUILDING_PODOFO -o CMakeFiles/podofo_shared.dir/base/PdfStream.cpp.o -c /var/tmp/portage/app-text/podofo-0.9.6_pre20170508-r1/work/podofo-0.9.6_pre20170508/src/base/PdfStream.cpp
  240. [ 20%] Building CXX object src/CMakeFiles/podofo_shared.dir/base/PdfString.cpp.o
  241. cd /var/tmp/portage/app-text/podofo-0.9.6_pre20170508-r1/work/podofo-0.9.6_pre20170508_build/src && /usr/bin/x86_64-pc-linux-gnu-g++ -Dpodofo_shared_EXPORTS -I/var/tmp/portage/app-text/podofo-0.9.6_pre20170508-r1/work/podofo-0.9.6_pre20170508_build -I/var/tmp/portage/app-text/podofo-0.9.6_pre20170508-r1/work/podofo-0.9.6_pre20170508 -I/var/tmp/portage/app-text/podofo-0.9.6_pre20170508-r1/work/podofo-0.9.6_pre20170508/src -I/usr/include/freetype2   -DNDEBUG -march=native -O2 -pipe -Wall -Woverloaded-virtual -Wswitch-enum -Wcast-qual -Wwrite-strings -Wredundant-decls -Wreorder -Wno-deprecated-declarations -fPIC   -W -DBUILDING_PODOFO -o CMakeFiles/podofo_shared.dir/base/PdfString.cpp.o -c /var/tmp/portage/app-text/podofo-0.9.6_pre20170508-r1/work/podofo-0.9.6_pre20170508/src/base/PdfString.cpp
  242. [ 20%] Building CXX object src/CMakeFiles/podofo_shared.dir/base/PdfTokenizer.cpp.o
  243. cd /var/tmp/portage/app-text/podofo-0.9.6_pre20170508-r1/work/podofo-0.9.6_pre20170508_build/src && /usr/bin/x86_64-pc-linux-gnu-g++ -Dpodofo_shared_EXPORTS -I/var/tmp/portage/app-text/podofo-0.9.6_pre20170508-r1/work/podofo-0.9.6_pre20170508_build -I/var/tmp/portage/app-text/podofo-0.9.6_pre20170508-r1/work/podofo-0.9.6_pre20170508 -I/var/tmp/portage/app-text/podofo-0.9.6_pre20170508-r1/work/podofo-0.9.6_pre20170508/src -I/usr/include/freetype2   -DNDEBUG -march=native -O2 -pipe -Wall -Woverloaded-virtual -Wswitch-enum -Wcast-qual -Wwrite-strings -Wredundant-decls -Wreorder -Wno-deprecated-declarations -fPIC   -W -DBUILDING_PODOFO -o CMakeFiles/podofo_shared.dir/base/PdfTokenizer.cpp.o -c /var/tmp/portage/app-text/podofo-0.9.6_pre20170508-r1/work/podofo-0.9.6_pre20170508/src/base/PdfTokenizer.cpp
  244. [ 21%] Building CXX object src/CMakeFiles/podofo_shared.dir/base/PdfVariant.cpp.o
  245. cd /var/tmp/portage/app-text/podofo-0.9.6_pre20170508-r1/work/podofo-0.9.6_pre20170508_build/src && /usr/bin/x86_64-pc-linux-gnu-g++ -Dpodofo_shared_EXPORTS -I/var/tmp/portage/app-text/podofo-0.9.6_pre20170508-r1/work/podofo-0.9.6_pre20170508_build -I/var/tmp/portage/app-text/podofo-0.9.6_pre20170508-r1/work/podofo-0.9.6_pre20170508 -I/var/tmp/portage/app-text/podofo-0.9.6_pre20170508-r1/work/podofo-0.9.6_pre20170508/src -I/usr/include/freetype2   -DNDEBUG -march=native -O2 -pipe -Wall -Woverloaded-virtual -Wswitch-enum -Wcast-qual -Wwrite-strings -Wredundant-decls -Wreorder -Wno-deprecated-declarations -fPIC   -W -DBUILDING_PODOFO -o CMakeFiles/podofo_shared.dir/base/PdfVariant.cpp.o -c /var/tmp/portage/app-text/podofo-0.9.6_pre20170508-r1/work/podofo-0.9.6_pre20170508/src/base/PdfVariant.cpp
  246. [ 21%] Building CXX object src/CMakeFiles/podofo_shared.dir/base/PdfVecObjects.cpp.o
  247. cd /var/tmp/portage/app-text/podofo-0.9.6_pre20170508-r1/work/podofo-0.9.6_pre20170508_build/src && /usr/bin/x86_64-pc-linux-gnu-g++ -Dpodofo_shared_EXPORTS -I/var/tmp/portage/app-text/podofo-0.9.6_pre20170508-r1/work/podofo-0.9.6_pre20170508_build -I/var/tmp/portage/app-text/podofo-0.9.6_pre20170508-r1/work/podofo-0.9.6_pre20170508 -I/var/tmp/portage/app-text/podofo-0.9.6_pre20170508-r1/work/podofo-0.9.6_pre20170508/src -I/usr/include/freetype2   -DNDEBUG -march=native -O2 -pipe -Wall -Woverloaded-virtual -Wswitch-enum -Wcast-qual -Wwrite-strings -Wredundant-decls -Wreorder -Wno-deprecated-declarations -fPIC   -W -DBUILDING_PODOFO -o CMakeFiles/podofo_shared.dir/base/PdfVecObjects.cpp.o -c /var/tmp/portage/app-text/podofo-0.9.6_pre20170508-r1/work/podofo-0.9.6_pre20170508/src/base/PdfVecObjects.cpp
  248. [ 22%] Building CXX object src/CMakeFiles/podofo_shared.dir/base/PdfWriter.cpp.o
  249. cd /var/tmp/portage/app-text/podofo-0.9.6_pre20170508-r1/work/podofo-0.9.6_pre20170508_build/src && /usr/bin/x86_64-pc-linux-gnu-g++ -Dpodofo_shared_EXPORTS -I/var/tmp/portage/app-text/podofo-0.9.6_pre20170508-r1/work/podofo-0.9.6_pre20170508_build -I/var/tmp/portage/app-text/podofo-0.9.6_pre20170508-r1/work/podofo-0.9.6_pre20170508 -I/var/tmp/portage/app-text/podofo-0.9.6_pre20170508-r1/work/podofo-0.9.6_pre20170508/src -I/usr/include/freetype2   -DNDEBUG -march=native -O2 -pipe -Wall -Woverloaded-virtual -Wswitch-enum -Wcast-qual -Wwrite-strings -Wredundant-decls -Wreorder -Wno-deprecated-declarations -fPIC   -W -DBUILDING_PODOFO -o CMakeFiles/podofo_shared.dir/base/PdfWriter.cpp.o -c /var/tmp/portage/app-text/podofo-0.9.6_pre20170508-r1/work/podofo-0.9.6_pre20170508/src/base/PdfWriter.cpp
  250. [ 23%] Building CXX object src/CMakeFiles/podofo_shared.dir/base/PdfXRef.cpp.o
  251. cd /var/tmp/portage/app-text/podofo-0.9.6_pre20170508-r1/work/podofo-0.9.6_pre20170508_build/src && /usr/bin/x86_64-pc-linux-gnu-g++ -Dpodofo_shared_EXPORTS -I/var/tmp/portage/app-text/podofo-0.9.6_pre20170508-r1/work/podofo-0.9.6_pre20170508_build -I/var/tmp/portage/app-text/podofo-0.9.6_pre20170508-r1/work/podofo-0.9.6_pre20170508 -I/var/tmp/portage/app-text/podofo-0.9.6_pre20170508-r1/work/podofo-0.9.6_pre20170508/src -I/usr/include/freetype2   -DNDEBUG -march=native -O2 -pipe -Wall -Woverloaded-virtual -Wswitch-enum -Wcast-qual -Wwrite-strings -Wredundant-decls -Wreorder -Wno-deprecated-declarations -fPIC   -W -DBUILDING_PODOFO -o CMakeFiles/podofo_shared.dir/base/PdfXRef.cpp.o -c /var/tmp/portage/app-text/podofo-0.9.6_pre20170508-r1/work/podofo-0.9.6_pre20170508/src/base/PdfXRef.cpp
  252. /var/tmp/portage/app-text/podofo-0.9.6_pre20170508-r1/work/podofo-0.9.6_pre20170508/src/base/PdfString.cpp: In function ‘bool PoDoFo::isLegalUTF8(const pdf_utf8*, int)’:
  253. /var/tmp/portage/app-text/podofo-0.9.6_pre20170508-r1/work/podofo-0.9.6_pre20170508/src/base/PdfString.cpp:878:13: warning: this statement may fall through [-Wimplicit-fallthrough=]
  254.      case 4: if ((a = (*--srcptr)) < 0x80 || a > 0xBF) return false;
  255.              ^~
  256. /var/tmp/portage/app-text/podofo-0.9.6_pre20170508-r1/work/podofo-0.9.6_pre20170508/src/base/PdfString.cpp:879:5: note: here
  257.      case 3: if ((a = (*--srcptr)) < 0x80 || a > 0xBF) return false;
  258.      ^~~~
  259. /var/tmp/portage/app-text/podofo-0.9.6_pre20170508-r1/work/podofo-0.9.6_pre20170508/src/base/PdfString.cpp:879:13: warning: this statement may fall through [-Wimplicit-fallthrough=]
  260.      case 3: if ((a = (*--srcptr)) < 0x80 || a > 0xBF) return false;
  261.              ^~
  262. /var/tmp/portage/app-text/podofo-0.9.6_pre20170508-r1/work/podofo-0.9.6_pre20170508/src/base/PdfString.cpp:880:5: note: here
  263.      case 2: if ((a = (*--srcptr)) > 0xBF) return false;
  264.      ^~~~
  265. /var/tmp/portage/app-text/podofo-0.9.6_pre20170508-r1/work/podofo-0.9.6_pre20170508/src/base/PdfString.cpp:882:2: warning: this statement may fall through [-Wimplicit-fallthrough=]
  266.   switch (*source) {
  267.   ^~~~~~
  268. /var/tmp/portage/app-text/podofo-0.9.6_pre20170508-r1/work/podofo-0.9.6_pre20170508/src/base/PdfString.cpp:891:5: note: here
  269.      case 1: if (*source >= 0x80 && *source < 0xC2) return false;
  270.      ^~~~
  271. /var/tmp/portage/app-text/podofo-0.9.6_pre20170508-r1/work/podofo-0.9.6_pre20170508/src/base/PdfString.cpp: In static member function ‘static PoDoFo::pdf_long PoDoFo::PdfString::ConvertUTF8toUTF16(const pdf_utf8*, PoDoFo::pdf_long, PoDoFo::pdf_utf16be*, PoDoFo::pdf_long, PoDoFo::EPdfStringConversion)’:
  272. /var/tmp/portage/app-text/podofo-0.9.6_pre20170508-r1/work/podofo-0.9.6_pre20170508/src/base/PdfString.cpp:944:34: warning: this statement may fall through [-Wimplicit-fallthrough=]
  273.       case 5: ch += *source++; ch <<= 6; /* remember, illegal UTF-8 */
  274.                                ~~~^~~~~
  275. /var/tmp/portage/app-text/podofo-0.9.6_pre20170508-r1/work/podofo-0.9.6_pre20170508/src/base/PdfString.cpp:945:6: note: here
  276.       case 4: ch += *source++; ch <<= 6; /* remember, illegal UTF-8 */
  277.       ^~~~
  278. /var/tmp/portage/app-text/podofo-0.9.6_pre20170508-r1/work/podofo-0.9.6_pre20170508/src/base/PdfString.cpp:945:34: warning: this statement may fall through [-Wimplicit-fallthrough=]
  279.       case 4: ch += *source++; ch <<= 6; /* remember, illegal UTF-8 */
  280.                                ~~~^~~~~
  281. /var/tmp/portage/app-text/podofo-0.9.6_pre20170508-r1/work/podofo-0.9.6_pre20170508/src/base/PdfString.cpp:946:6: note: here
  282.       case 3: ch += *source++; ch <<= 6;
  283.       ^~~~
  284. /var/tmp/portage/app-text/podofo-0.9.6_pre20170508-r1/work/podofo-0.9.6_pre20170508/src/base/PdfString.cpp:946:34: warning: this statement may fall through [-Wimplicit-fallthrough=]
  285.       case 3: ch += *source++; ch <<= 6;
  286.                                ~~~^~~~~
  287. /var/tmp/portage/app-text/podofo-0.9.6_pre20170508-r1/work/podofo-0.9.6_pre20170508/src/base/PdfString.cpp:947:6: note: here
  288.       case 2: ch += *source++; ch <<= 6;
  289.       ^~~~
  290. /var/tmp/portage/app-text/podofo-0.9.6_pre20170508-r1/work/podofo-0.9.6_pre20170508/src/base/PdfString.cpp:947:34: warning: this statement may fall through [-Wimplicit-fallthrough=]
  291.       case 2: ch += *source++; ch <<= 6;
  292.                                ~~~^~~~~
  293. /var/tmp/portage/app-text/podofo-0.9.6_pre20170508-r1/work/podofo-0.9.6_pre20170508/src/base/PdfString.cpp:948:6: note: here
  294.       case 1: ch += *source++; ch <<= 6;
  295.       ^~~~
  296. /var/tmp/portage/app-text/podofo-0.9.6_pre20170508-r1/work/podofo-0.9.6_pre20170508/src/base/PdfString.cpp:948:34: warning: this statement may fall through [-Wimplicit-fallthrough=]
  297.       case 1: ch += *source++; ch <<= 6;
  298.                                ~~~^~~~~
  299. /var/tmp/portage/app-text/podofo-0.9.6_pre20170508-r1/work/podofo-0.9.6_pre20170508/src/base/PdfString.cpp:949:6: note: here
  300.       case 0: ch += *source++;
  301.       ^~~~
  302. /var/tmp/portage/app-text/podofo-0.9.6_pre20170508-r1/work/podofo-0.9.6_pre20170508/src/base/PdfString.cpp: In static member function ‘static PoDoFo::pdf_long PoDoFo::PdfString::ConvertUTF16toUTF8(const pdf_utf16be*, PoDoFo::pdf_long, PoDoFo::pdf_utf8*, PoDoFo::pdf_long, PoDoFo::EPdfStringConversion)’:
  303. /var/tmp/portage/app-text/podofo-0.9.6_pre20170508-r1/work/podofo-0.9.6_pre20170508/src/base/PdfString.cpp:1103:91: warning: this statement may fall through [-Wimplicit-fallthrough=]
  304.                  case 4: *--target = static_cast<pdf_utf8>((ch | byteMark) & byteMask); ch >>= 6;
  305.                                                                                         ~~~^~~~~
  306. /var/tmp/portage/app-text/podofo-0.9.6_pre20170508-r1/work/podofo-0.9.6_pre20170508/src/base/PdfString.cpp:1104:17: note: here
  307.                  case 3: *--target = static_cast<pdf_utf8>((ch | byteMark) & byteMask); ch >>= 6;
  308.                  ^~~~
  309. /var/tmp/portage/app-text/podofo-0.9.6_pre20170508-r1/work/podofo-0.9.6_pre20170508/src/base/PdfString.cpp:1104:91: warning: this statement may fall through [-Wimplicit-fallthrough=]
  310.                  case 3: *--target = static_cast<pdf_utf8>((ch | byteMark) & byteMask); ch >>= 6;
  311.                                                                                         ~~~^~~~~
  312. /var/tmp/portage/app-text/podofo-0.9.6_pre20170508-r1/work/podofo-0.9.6_pre20170508/src/base/PdfString.cpp:1105:17: note: here
  313.                  case 2: *--target = static_cast<pdf_utf8>((ch | byteMark) & byteMask); ch >>= 6;
  314.                  ^~~~
  315. /var/tmp/portage/app-text/podofo-0.9.6_pre20170508-r1/work/podofo-0.9.6_pre20170508/src/base/PdfString.cpp:1105:91: warning: this statement may fall through [-Wimplicit-fallthrough=]
  316.                  case 2: *--target = static_cast<pdf_utf8>((ch | byteMark) & byteMask); ch >>= 6;
  317.                                                                                         ~~~^~~~~
  318. /var/tmp/portage/app-text/podofo-0.9.6_pre20170508-r1/work/podofo-0.9.6_pre20170508/src/base/PdfString.cpp:1106:17: note: here
  319.                  case 1: *--target = static_cast<pdf_utf8>(ch | firstByteMark[bytesToWrite]);
  320.                  ^~~~
  321. /var/tmp/portage/app-text/podofo-0.9.6_pre20170508-r1/work/podofo-0.9.6_pre20170508/src/base/PdfTokenizer.cpp: In member function ‘PoDoFo::EPdfDataType PoDoFo::PdfTokenizer::DetermineDataType(const char*, PoDoFo::EPdfTokenType, PoDoFo::PdfVariant&)’:
  322. /var/tmp/portage/app-text/podofo-0.9.6_pre20170508-r1/work/podofo-0.9.6_pre20170508/src/base/PdfTokenizer.cpp:439:75: warning: type qualifiers ignored on cast result type [-Wignored-qualifiers]
  323.              else if( !(isdigit( static_cast<const unsigned char>(*pszStart) ) || *pszStart == '-' || *pszStart == '+' ) )
  324.                                                                            ^
  325. /var/tmp/portage/app-text/podofo-0.9.6_pre20170508-r1/work/podofo-0.9.6_pre20170508/src/base/PdfTokenizer.cpp:511:73: warning: type qualifiers ignored on cast result type [-Wignored-qualifiers]
  326.                                           static_cast<const pdf_uint16>(l) );
  327.                                                                          ^
  328. [ 23%] Building CXX object src/CMakeFiles/podofo_shared.dir/base/PdfXRefStream.cpp.o
  329. cd /var/tmp/portage/app-text/podofo-0.9.6_pre20170508-r1/work/podofo-0.9.6_pre20170508_build/src && /usr/bin/x86_64-pc-linux-gnu-g++ -Dpodofo_shared_EXPORTS -I/var/tmp/portage/app-text/podofo-0.9.6_pre20170508-r1/work/podofo-0.9.6_pre20170508_build -I/var/tmp/portage/app-text/podofo-0.9.6_pre20170508-r1/work/podofo-0.9.6_pre20170508 -I/var/tmp/portage/app-text/podofo-0.9.6_pre20170508-r1/work/podofo-0.9.6_pre20170508/src -I/usr/include/freetype2   -DNDEBUG -march=native -O2 -pipe -Wall -Woverloaded-virtual -Wswitch-enum -Wcast-qual -Wwrite-strings -Wredundant-decls -Wreorder -Wno-deprecated-declarations -fPIC   -W -DBUILDING_PODOFO -o CMakeFiles/podofo_shared.dir/base/PdfXRefStream.cpp.o -c /var/tmp/portage/app-text/podofo-0.9.6_pre20170508-r1/work/podofo-0.9.6_pre20170508/src/base/PdfXRefStream.cpp
  330. [ 24%] Building CXX object src/CMakeFiles/podofo_shared.dir/base/PdfXRefStreamParserObject.cpp.o
  331. cd /var/tmp/portage/app-text/podofo-0.9.6_pre20170508-r1/work/podofo-0.9.6_pre20170508_build/src && /usr/bin/x86_64-pc-linux-gnu-g++ -Dpodofo_shared_EXPORTS -I/var/tmp/portage/app-text/podofo-0.9.6_pre20170508-r1/work/podofo-0.9.6_pre20170508_build -I/var/tmp/portage/app-text/podofo-0.9.6_pre20170508-r1/work/podofo-0.9.6_pre20170508 -I/var/tmp/portage/app-text/podofo-0.9.6_pre20170508-r1/work/podofo-0.9.6_pre20170508/src -I/usr/include/freetype2   -DNDEBUG -march=native -O2 -pipe -Wall -Woverloaded-virtual -Wswitch-enum -Wcast-qual -Wwrite-strings -Wredundant-decls -Wreorder -Wno-deprecated-declarations -fPIC   -W -DBUILDING_PODOFO -o CMakeFiles/podofo_shared.dir/base/PdfXRefStreamParserObject.cpp.o -c /var/tmp/portage/app-text/podofo-0.9.6_pre20170508-r1/work/podofo-0.9.6_pre20170508/src/base/PdfXRefStreamParserObject.cpp
  332. [ 24%] Building CXX object src/CMakeFiles/podofo_shared.dir/doc/PdfAcroForm.cpp.o
  333. cd /var/tmp/portage/app-text/podofo-0.9.6_pre20170508-r1/work/podofo-0.9.6_pre20170508_build/src && /usr/bin/x86_64-pc-linux-gnu-g++ -Dpodofo_shared_EXPORTS -I/var/tmp/portage/app-text/podofo-0.9.6_pre20170508-r1/work/podofo-0.9.6_pre20170508_build -I/var/tmp/portage/app-text/podofo-0.9.6_pre20170508-r1/work/podofo-0.9.6_pre20170508 -I/var/tmp/portage/app-text/podofo-0.9.6_pre20170508-r1/work/podofo-0.9.6_pre20170508/src -I/usr/include/freetype2   -DNDEBUG -march=native -O2 -pipe -Wall -Woverloaded-virtual -Wswitch-enum -Wcast-qual -Wwrite-strings -Wredundant-decls -Wreorder -Wno-deprecated-declarations -fPIC   -W -DBUILDING_PODOFO -o CMakeFiles/podofo_shared.dir/doc/PdfAcroForm.cpp.o -c /var/tmp/portage/app-text/podofo-0.9.6_pre20170508-r1/work/podofo-0.9.6_pre20170508/src/doc/PdfAcroForm.cpp
  334. [ 25%] Building CXX object src/CMakeFiles/podofo_shared.dir/doc/PdfAction.cpp.o
  335. cd /var/tmp/portage/app-text/podofo-0.9.6_pre20170508-r1/work/podofo-0.9.6_pre20170508_build/src && /usr/bin/x86_64-pc-linux-gnu-g++ -Dpodofo_shared_EXPORTS -I/var/tmp/portage/app-text/podofo-0.9.6_pre20170508-r1/work/podofo-0.9.6_pre20170508_build -I/var/tmp/portage/app-text/podofo-0.9.6_pre20170508-r1/work/podofo-0.9.6_pre20170508 -I/var/tmp/portage/app-text/podofo-0.9.6_pre20170508-r1/work/podofo-0.9.6_pre20170508/src -I/usr/include/freetype2   -DNDEBUG -march=native -O2 -pipe -Wall -Woverloaded-virtual -Wswitch-enum -Wcast-qual -Wwrite-strings -Wredundant-decls -Wreorder -Wno-deprecated-declarations -fPIC   -W -DBUILDING_PODOFO -o CMakeFiles/podofo_shared.dir/doc/PdfAction.cpp.o -c /var/tmp/portage/app-text/podofo-0.9.6_pre20170508-r1/work/podofo-0.9.6_pre20170508/src/doc/PdfAction.cpp
  336. [ 25%] Building CXX object src/CMakeFiles/podofo_shared.dir/doc/PdfAnnotation.cpp.o
  337. cd /var/tmp/portage/app-text/podofo-0.9.6_pre20170508-r1/work/podofo-0.9.6_pre20170508_build/src && /usr/bin/x86_64-pc-linux-gnu-g++ -Dpodofo_shared_EXPORTS -I/var/tmp/portage/app-text/podofo-0.9.6_pre20170508-r1/work/podofo-0.9.6_pre20170508_build -I/var/tmp/portage/app-text/podofo-0.9.6_pre20170508-r1/work/podofo-0.9.6_pre20170508 -I/var/tmp/portage/app-text/podofo-0.9.6_pre20170508-r1/work/podofo-0.9.6_pre20170508/src -I/usr/include/freetype2   -DNDEBUG -march=native -O2 -pipe -Wall -Woverloaded-virtual -Wswitch-enum -Wcast-qual -Wwrite-strings -Wredundant-decls -Wreorder -Wno-deprecated-declarations -fPIC   -W -DBUILDING_PODOFO -o CMakeFiles/podofo_shared.dir/doc/PdfAnnotation.cpp.o -c /var/tmp/portage/app-text/podofo-0.9.6_pre20170508-r1/work/podofo-0.9.6_pre20170508/src/doc/PdfAnnotation.cpp
  338. [ 26%] Building CXX object src/CMakeFiles/podofo_shared.dir/doc/PdfCMapEncoding.cpp.o
  339. cd /var/tmp/portage/app-text/podofo-0.9.6_pre20170508-r1/work/podofo-0.9.6_pre20170508_build/src && /usr/bin/x86_64-pc-linux-gnu-g++ -Dpodofo_shared_EXPORTS -I/var/tmp/portage/app-text/podofo-0.9.6_pre20170508-r1/work/podofo-0.9.6_pre20170508_build -I/var/tmp/portage/app-text/podofo-0.9.6_pre20170508-r1/work/podofo-0.9.6_pre20170508 -I/var/tmp/portage/app-text/podofo-0.9.6_pre20170508-r1/work/podofo-0.9.6_pre20170508/src -I/usr/include/freetype2   -DNDEBUG -march=native -O2 -pipe -Wall -Woverloaded-virtual -Wswitch-enum -Wcast-qual -Wwrite-strings -Wredundant-decls -Wreorder -Wno-deprecated-declarations -fPIC   -W -DBUILDING_PODOFO -o CMakeFiles/podofo_shared.dir/doc/PdfCMapEncoding.cpp.o -c /var/tmp/portage/app-text/podofo-0.9.6_pre20170508-r1/work/podofo-0.9.6_pre20170508/src/doc/PdfCMapEncoding.cpp
  340. [ 27%] Building CXX object src/CMakeFiles/podofo_shared.dir/doc/PdfContents.cpp.o
  341. cd /var/tmp/portage/app-text/podofo-0.9.6_pre20170508-r1/work/podofo-0.9.6_pre20170508_build/src && /usr/bin/x86_64-pc-linux-gnu-g++ -Dpodofo_shared_EXPORTS -I/var/tmp/portage/app-text/podofo-0.9.6_pre20170508-r1/work/podofo-0.9.6_pre20170508_build -I/var/tmp/portage/app-text/podofo-0.9.6_pre20170508-r1/work/podofo-0.9.6_pre20170508 -I/var/tmp/portage/app-text/podofo-0.9.6_pre20170508-r1/work/podofo-0.9.6_pre20170508/src -I/usr/include/freetype2   -DNDEBUG -march=native -O2 -pipe -Wall -Woverloaded-virtual -Wswitch-enum -Wcast-qual -Wwrite-strings -Wredundant-decls -Wreorder -Wno-deprecated-declarations -fPIC   -W -DBUILDING_PODOFO -o CMakeFiles/podofo_shared.dir/doc/PdfContents.cpp.o -c /var/tmp/portage/app-text/podofo-0.9.6_pre20170508-r1/work/podofo-0.9.6_pre20170508/src/doc/PdfContents.cpp
  342. [ 27%] Building CXX object src/CMakeFiles/podofo_shared.dir/doc/PdfDestination.cpp.o
  343. cd /var/tmp/portage/app-text/podofo-0.9.6_pre20170508-r1/work/podofo-0.9.6_pre20170508_build/src && /usr/bin/x86_64-pc-linux-gnu-g++ -Dpodofo_shared_EXPORTS -I/var/tmp/portage/app-text/podofo-0.9.6_pre20170508-r1/work/podofo-0.9.6_pre20170508_build -I/var/tmp/portage/app-text/podofo-0.9.6_pre20170508-r1/work/podofo-0.9.6_pre20170508 -I/var/tmp/portage/app-text/podofo-0.9.6_pre20170508-r1/work/podofo-0.9.6_pre20170508/src -I/usr/include/freetype2   -DNDEBUG -march=native -O2 -pipe -Wall -Woverloaded-virtual -Wswitch-enum -Wcast-qual -Wwrite-strings -Wredundant-decls -Wreorder -Wno-deprecated-declarations -fPIC   -W -DBUILDING_PODOFO -o CMakeFiles/podofo_shared.dir/doc/PdfDestination.cpp.o -c /var/tmp/portage/app-text/podofo-0.9.6_pre20170508-r1/work/podofo-0.9.6_pre20170508/src/doc/PdfDestination.cpp
  344. [ 28%] Building CXX object src/CMakeFiles/podofo_shared.dir/doc/PdfDifferenceEncoding.cpp.o
  345. cd /var/tmp/portage/app-text/podofo-0.9.6_pre20170508-r1/work/podofo-0.9.6_pre20170508_build/src && /usr/bin/x86_64-pc-linux-gnu-g++ -Dpodofo_shared_EXPORTS -I/var/tmp/portage/app-text/podofo-0.9.6_pre20170508-r1/work/podofo-0.9.6_pre20170508_build -I/var/tmp/portage/app-text/podofo-0.9.6_pre20170508-r1/work/podofo-0.9.6_pre20170508 -I/var/tmp/portage/app-text/podofo-0.9.6_pre20170508-r1/work/podofo-0.9.6_pre20170508/src -I/usr/include/freetype2   -DNDEBUG -march=native -O2 -pipe -Wall -Woverloaded-virtual -Wswitch-enum -Wcast-qual -Wwrite-strings -Wredundant-decls -Wreorder -Wno-deprecated-declarations -fPIC   -W -DBUILDING_PODOFO -o CMakeFiles/podofo_shared.dir/doc/PdfDifferenceEncoding.cpp.o -c /var/tmp/portage/app-text/podofo-0.9.6_pre20170508-r1/work/podofo-0.9.6_pre20170508/src/doc/PdfDifferenceEncoding.cpp
  346. [ 28%] Building CXX object src/CMakeFiles/podofo_shared.dir/doc/PdfDocument.cpp.o
  347. cd /var/tmp/portage/app-text/podofo-0.9.6_pre20170508-r1/work/podofo-0.9.6_pre20170508_build/src && /usr/bin/x86_64-pc-linux-gnu-g++ -Dpodofo_shared_EXPORTS -I/var/tmp/portage/app-text/podofo-0.9.6_pre20170508-r1/work/podofo-0.9.6_pre20170508_build -I/var/tmp/portage/app-text/podofo-0.9.6_pre20170508-r1/work/podofo-0.9.6_pre20170508 -I/var/tmp/portage/app-text/podofo-0.9.6_pre20170508-r1/work/podofo-0.9.6_pre20170508/src -I/usr/include/freetype2   -DNDEBUG -march=native -O2 -pipe -Wall -Woverloaded-virtual -Wswitch-enum -Wcast-qual -Wwrite-strings -Wredundant-decls -Wreorder -Wno-deprecated-declarations -fPIC   -W -DBUILDING_PODOFO -o CMakeFiles/podofo_shared.dir/doc/PdfDocument.cpp.o -c /var/tmp/portage/app-text/podofo-0.9.6_pre20170508-r1/work/podofo-0.9.6_pre20170508/src/doc/PdfDocument.cpp
  348. [ 29%] Building CXX object src/CMakeFiles/podofo_shared.dir/doc/PdfElement.cpp.o
  349. cd /var/tmp/portage/app-text/podofo-0.9.6_pre20170508-r1/work/podofo-0.9.6_pre20170508_build/src && /usr/bin/x86_64-pc-linux-gnu-g++ -Dpodofo_shared_EXPORTS -I/var/tmp/portage/app-text/podofo-0.9.6_pre20170508-r1/work/podofo-0.9.6_pre20170508_build -I/var/tmp/portage/app-text/podofo-0.9.6_pre20170508-r1/work/podofo-0.9.6_pre20170508 -I/var/tmp/portage/app-text/podofo-0.9.6_pre20170508-r1/work/podofo-0.9.6_pre20170508/src -I/usr/include/freetype2   -DNDEBUG -march=native -O2 -pipe -Wall -Woverloaded-virtual -Wswitch-enum -Wcast-qual -Wwrite-strings -Wredundant-decls -Wreorder -Wno-deprecated-declarations -fPIC   -W -DBUILDING_PODOFO -o CMakeFiles/podofo_shared.dir/doc/PdfElement.cpp.o -c /var/tmp/portage/app-text/podofo-0.9.6_pre20170508-r1/work/podofo-0.9.6_pre20170508/src/doc/PdfElement.cpp
  350. [ 29%] Building CXX object src/CMakeFiles/podofo_shared.dir/doc/PdfEncodingObjectFactory.cpp.o
  351. cd /var/tmp/portage/app-text/podofo-0.9.6_pre20170508-r1/work/podofo-0.9.6_pre20170508_build/src && /usr/bin/x86_64-pc-linux-gnu-g++ -Dpodofo_shared_EXPORTS -I/var/tmp/portage/app-text/podofo-0.9.6_pre20170508-r1/work/podofo-0.9.6_pre20170508_build -I/var/tmp/portage/app-text/podofo-0.9.6_pre20170508-r1/work/podofo-0.9.6_pre20170508 -I/var/tmp/portage/app-text/podofo-0.9.6_pre20170508-r1/work/podofo-0.9.6_pre20170508/src -I/usr/include/freetype2   -DNDEBUG -march=native -O2 -pipe -Wall -Woverloaded-virtual -Wswitch-enum -Wcast-qual -Wwrite-strings -Wredundant-decls -Wreorder -Wno-deprecated-declarations -fPIC   -W -DBUILDING_PODOFO -o CMakeFiles/podofo_shared.dir/doc/PdfEncodingObjectFactory.cpp.o -c /var/tmp/portage/app-text/podofo-0.9.6_pre20170508-r1/work/podofo-0.9.6_pre20170508/src/doc/PdfEncodingObjectFactory.cpp
  352. [ 30%] Building CXX object src/CMakeFiles/podofo_shared.dir/doc/PdfExtGState.cpp.o
  353. cd /var/tmp/portage/app-text/podofo-0.9.6_pre20170508-r1/work/podofo-0.9.6_pre20170508_build/src && /usr/bin/x86_64-pc-linux-gnu-g++ -Dpodofo_shared_EXPORTS -I/var/tmp/portage/app-text/podofo-0.9.6_pre20170508-r1/work/podofo-0.9.6_pre20170508_build -I/var/tmp/portage/app-text/podofo-0.9.6_pre20170508-r1/work/podofo-0.9.6_pre20170508 -I/var/tmp/portage/app-text/podofo-0.9.6_pre20170508-r1/work/podofo-0.9.6_pre20170508/src -I/usr/include/freetype2   -DNDEBUG -march=native -O2 -pipe -Wall -Woverloaded-virtual -Wswitch-enum -Wcast-qual -Wwrite-strings -Wredundant-decls -Wreorder -Wno-deprecated-declarations -fPIC   -W -DBUILDING_PODOFO -o CMakeFiles/podofo_shared.dir/doc/PdfExtGState.cpp.o -c /var/tmp/portage/app-text/podofo-0.9.6_pre20170508-r1/work/podofo-0.9.6_pre20170508/src/doc/PdfExtGState.cpp
  354. [ 31%] Building CXX object src/CMakeFiles/podofo_shared.dir/doc/PdfField.cpp.o
  355. cd /var/tmp/portage/app-text/podofo-0.9.6_pre20170508-r1/work/podofo-0.9.6_pre20170508_build/src && /usr/bin/x86_64-pc-linux-gnu-g++ -Dpodofo_shared_EXPORTS -I/var/tmp/portage/app-text/podofo-0.9.6_pre20170508-r1/work/podofo-0.9.6_pre20170508_build -I/var/tmp/portage/app-text/podofo-0.9.6_pre20170508-r1/work/podofo-0.9.6_pre20170508 -I/var/tmp/portage/app-text/podofo-0.9.6_pre20170508-r1/work/podofo-0.9.6_pre20170508/src -I/usr/include/freetype2   -DNDEBUG -march=native -O2 -pipe -Wall -Woverloaded-virtual -Wswitch-enum -Wcast-qual -Wwrite-strings -Wredundant-decls -Wreorder -Wno-deprecated-declarations -fPIC   -W -DBUILDING_PODOFO -o CMakeFiles/podofo_shared.dir/doc/PdfField.cpp.o -c /var/tmp/portage/app-text/podofo-0.9.6_pre20170508-r1/work/podofo-0.9.6_pre20170508/src/doc/PdfField.cpp
  356. [ 31%] Building CXX object src/CMakeFiles/podofo_shared.dir/doc/PdfFileSpec.cpp.o
  357. cd /var/tmp/portage/app-text/podofo-0.9.6_pre20170508-r1/work/podofo-0.9.6_pre20170508_build/src && /usr/bin/x86_64-pc-linux-gnu-g++ -Dpodofo_shared_EXPORTS -I/var/tmp/portage/app-text/podofo-0.9.6_pre20170508-r1/work/podofo-0.9.6_pre20170508_build -I/var/tmp/portage/app-text/podofo-0.9.6_pre20170508-r1/work/podofo-0.9.6_pre20170508 -I/var/tmp/portage/app-text/podofo-0.9.6_pre20170508-r1/work/podofo-0.9.6_pre20170508/src -I/usr/include/freetype2   -DNDEBUG -march=native -O2 -pipe -Wall -Woverloaded-virtual -Wswitch-enum -Wcast-qual -Wwrite-strings -Wredundant-decls -Wreorder -Wno-deprecated-declarations -fPIC   -W -DBUILDING_PODOFO -o CMakeFiles/podofo_shared.dir/doc/PdfFileSpec.cpp.o -c /var/tmp/portage/app-text/podofo-0.9.6_pre20170508-r1/work/podofo-0.9.6_pre20170508/src/doc/PdfFileSpec.cpp
  358. [ 32%] Building CXX object src/CMakeFiles/podofo_shared.dir/doc/PdfFont.cpp.o
  359. cd /var/tmp/portage/app-text/podofo-0.9.6_pre20170508-r1/work/podofo-0.9.6_pre20170508_build/src && /usr/bin/x86_64-pc-linux-gnu-g++ -Dpodofo_shared_EXPORTS -I/var/tmp/portage/app-text/podofo-0.9.6_pre20170508-r1/work/podofo-0.9.6_pre20170508_build -I/var/tmp/portage/app-text/podofo-0.9.6_pre20170508-r1/work/podofo-0.9.6_pre20170508 -I/var/tmp/portage/app-text/podofo-0.9.6_pre20170508-r1/work/podofo-0.9.6_pre20170508/src -I/usr/include/freetype2   -DNDEBUG -march=native -O2 -pipe -Wall -Woverloaded-virtual -Wswitch-enum -Wcast-qual -Wwrite-strings -Wredundant-decls -Wreorder -Wno-deprecated-declarations -fPIC   -W -DBUILDING_PODOFO -o CMakeFiles/podofo_shared.dir/doc/PdfFont.cpp.o -c /var/tmp/portage/app-text/podofo-0.9.6_pre20170508-r1/work/podofo-0.9.6_pre20170508/src/doc/PdfFont.cpp
  360. [ 32%] Building CXX object src/CMakeFiles/podofo_shared.dir/doc/PdfFontCID.cpp.o
  361. cd /var/tmp/portage/app-text/podofo-0.9.6_pre20170508-r1/work/podofo-0.9.6_pre20170508_build/src && /usr/bin/x86_64-pc-linux-gnu-g++ -Dpodofo_shared_EXPORTS -I/var/tmp/portage/app-text/podofo-0.9.6_pre20170508-r1/work/podofo-0.9.6_pre20170508_build -I/var/tmp/portage/app-text/podofo-0.9.6_pre20170508-r1/work/podofo-0.9.6_pre20170508 -I/var/tmp/portage/app-text/podofo-0.9.6_pre20170508-r1/work/podofo-0.9.6_pre20170508/src -I/usr/include/freetype2   -DNDEBUG -march=native -O2 -pipe -Wall -Woverloaded-virtual -Wswitch-enum -Wcast-qual -Wwrite-strings -Wredundant-decls -Wreorder -Wno-deprecated-declarations -fPIC   -W -DBUILDING_PODOFO -o CMakeFiles/podofo_shared.dir/doc/PdfFontCID.cpp.o -c /var/tmp/portage/app-text/podofo-0.9.6_pre20170508-r1/work/podofo-0.9.6_pre20170508/src/doc/PdfFontCID.cpp
  362. [ 33%] Building CXX object src/CMakeFiles/podofo_shared.dir/doc/PdfFontCache.cpp.o
  363. cd /var/tmp/portage/app-text/podofo-0.9.6_pre20170508-r1/work/podofo-0.9.6_pre20170508_build/src && /usr/bin/x86_64-pc-linux-gnu-g++ -Dpodofo_shared_EXPORTS -I/var/tmp/portage/app-text/podofo-0.9.6_pre20170508-r1/work/podofo-0.9.6_pre20170508_build -I/var/tmp/portage/app-text/podofo-0.9.6_pre20170508-r1/work/podofo-0.9.6_pre20170508 -I/var/tmp/portage/app-text/podofo-0.9.6_pre20170508-r1/work/podofo-0.9.6_pre20170508/src -I/usr/include/freetype2   -DNDEBUG -march=native -O2 -pipe -Wall -Woverloaded-virtual -Wswitch-enum -Wcast-qual -Wwrite-strings -Wredundant-decls -Wreorder -Wno-deprecated-declarations -fPIC   -W -DBUILDING_PODOFO -o CMakeFiles/podofo_shared.dir/doc/PdfFontCache.cpp.o -c /var/tmp/portage/app-text/podofo-0.9.6_pre20170508-r1/work/podofo-0.9.6_pre20170508/src/doc/PdfFontCache.cpp
  364. [ 34%] Building CXX object src/CMakeFiles/podofo_shared.dir/doc/PdfFontConfigWrapper.cpp.o
  365. cd /var/tmp/portage/app-text/podofo-0.9.6_pre20170508-r1/work/podofo-0.9.6_pre20170508_build/src && /usr/bin/x86_64-pc-linux-gnu-g++ -Dpodofo_shared_EXPORTS -I/var/tmp/portage/app-text/podofo-0.9.6_pre20170508-r1/work/podofo-0.9.6_pre20170508_build -I/var/tmp/portage/app-text/podofo-0.9.6_pre20170508-r1/work/podofo-0.9.6_pre20170508 -I/var/tmp/portage/app-text/podofo-0.9.6_pre20170508-r1/work/podofo-0.9.6_pre20170508/src -I/usr/include/freetype2   -DNDEBUG -march=native -O2 -pipe -Wall -Woverloaded-virtual -Wswitch-enum -Wcast-qual -Wwrite-strings -Wredundant-decls -Wreorder -Wno-deprecated-declarations -fPIC   -W -DBUILDING_PODOFO -o CMakeFiles/podofo_shared.dir/doc/PdfFontConfigWrapper.cpp.o -c /var/tmp/portage/app-text/podofo-0.9.6_pre20170508-r1/work/podofo-0.9.6_pre20170508/src/doc/PdfFontConfigWrapper.cpp
  366. [ 34%] Building CXX object src/CMakeFiles/podofo_shared.dir/doc/PdfFontFactory.cpp.o
  367. cd /var/tmp/portage/app-text/podofo-0.9.6_pre20170508-r1/work/podofo-0.9.6_pre20170508_build/src && /usr/bin/x86_64-pc-linux-gnu-g++ -Dpodofo_shared_EXPORTS -I/var/tmp/portage/app-text/podofo-0.9.6_pre20170508-r1/work/podofo-0.9.6_pre20170508_build -I/var/tmp/portage/app-text/podofo-0.9.6_pre20170508-r1/work/podofo-0.9.6_pre20170508 -I/var/tmp/portage/app-text/podofo-0.9.6_pre20170508-r1/work/podofo-0.9.6_pre20170508/src -I/usr/include/freetype2   -DNDEBUG -march=native -O2 -pipe -Wall -Woverloaded-virtual -Wswitch-enum -Wcast-qual -Wwrite-strings -Wredundant-decls -Wreorder -Wno-deprecated-declarations -fPIC   -W -DBUILDING_PODOFO -o CMakeFiles/podofo_shared.dir/doc/PdfFontFactory.cpp.o -c /var/tmp/portage/app-text/podofo-0.9.6_pre20170508-r1/work/podofo-0.9.6_pre20170508/src/doc/PdfFontFactory.cpp
  368. [ 35%] Building CXX object src/CMakeFiles/podofo_shared.dir/doc/PdfFontMetrics.cpp.o
  369. cd /var/tmp/portage/app-text/podofo-0.9.6_pre20170508-r1/work/podofo-0.9.6_pre20170508_build/src && /usr/bin/x86_64-pc-linux-gnu-g++ -Dpodofo_shared_EXPORTS -I/var/tmp/portage/app-text/podofo-0.9.6_pre20170508-r1/work/podofo-0.9.6_pre20170508_build -I/var/tmp/portage/app-text/podofo-0.9.6_pre20170508-r1/work/podofo-0.9.6_pre20170508 -I/var/tmp/portage/app-text/podofo-0.9.6_pre20170508-r1/work/podofo-0.9.6_pre20170508/src -I/usr/include/freetype2   -DNDEBUG -march=native -O2 -pipe -Wall -Woverloaded-virtual -Wswitch-enum -Wcast-qual -Wwrite-strings -Wredundant-decls -Wreorder -Wno-deprecated-declarations -fPIC   -W -DBUILDING_PODOFO -o CMakeFiles/podofo_shared.dir/doc/PdfFontMetrics.cpp.o -c /var/tmp/portage/app-text/podofo-0.9.6_pre20170508-r1/work/podofo-0.9.6_pre20170508/src/doc/PdfFontMetrics.cpp
  370. [ 35%] Building CXX object src/CMakeFiles/podofo_shared.dir/doc/PdfFontMetricsBase14.cpp.o
  371. cd /var/tmp/portage/app-text/podofo-0.9.6_pre20170508-r1/work/podofo-0.9.6_pre20170508_build/src && /usr/bin/x86_64-pc-linux-gnu-g++ -Dpodofo_shared_EXPORTS -I/var/tmp/portage/app-text/podofo-0.9.6_pre20170508-r1/work/podofo-0.9.6_pre20170508_build -I/var/tmp/portage/app-text/podofo-0.9.6_pre20170508-r1/work/podofo-0.9.6_pre20170508 -I/var/tmp/portage/app-text/podofo-0.9.6_pre20170508-r1/work/podofo-0.9.6_pre20170508/src -I/usr/include/freetype2   -DNDEBUG -march=native -O2 -pipe -Wall -Woverloaded-virtual -Wswitch-enum -Wcast-qual -Wwrite-strings -Wredundant-decls -Wreorder -Wno-deprecated-declarations -fPIC   -W -DBUILDING_PODOFO -o CMakeFiles/podofo_shared.dir/doc/PdfFontMetricsBase14.cpp.o -c /var/tmp/portage/app-text/podofo-0.9.6_pre20170508-r1/work/podofo-0.9.6_pre20170508/src/doc/PdfFontMetricsBase14.cpp
  372. [ 36%] Building CXX object src/CMakeFiles/podofo_shared.dir/doc/PdfFontMetricsFreetype.cpp.o
  373. cd /var/tmp/portage/app-text/podofo-0.9.6_pre20170508-r1/work/podofo-0.9.6_pre20170508_build/src && /usr/bin/x86_64-pc-linux-gnu-g++ -Dpodofo_shared_EXPORTS -I/var/tmp/portage/app-text/podofo-0.9.6_pre20170508-r1/work/podofo-0.9.6_pre20170508_build -I/var/tmp/portage/app-text/podofo-0.9.6_pre20170508-r1/work/podofo-0.9.6_pre20170508 -I/var/tmp/portage/app-text/podofo-0.9.6_pre20170508-r1/work/podofo-0.9.6_pre20170508/src -I/usr/include/freetype2   -DNDEBUG -march=native -O2 -pipe -Wall -Woverloaded-virtual -Wswitch-enum -Wcast-qual -Wwrite-strings -Wredundant-decls -Wreorder -Wno-deprecated-declarations -fPIC   -W -DBUILDING_PODOFO -o CMakeFiles/podofo_shared.dir/doc/PdfFontMetricsFreetype.cpp.o -c /var/tmp/portage/app-text/podofo-0.9.6_pre20170508-r1/work/podofo-0.9.6_pre20170508/src/doc/PdfFontMetricsFreetype.cpp
  374. [ 36%] Building CXX object src/CMakeFiles/podofo_shared.dir/doc/PdfFontMetricsObject.cpp.o
  375. cd /var/tmp/portage/app-text/podofo-0.9.6_pre20170508-r1/work/podofo-0.9.6_pre20170508_build/src && /usr/bin/x86_64-pc-linux-gnu-g++ -Dpodofo_shared_EXPORTS -I/var/tmp/portage/app-text/podofo-0.9.6_pre20170508-r1/work/podofo-0.9.6_pre20170508_build -I/var/tmp/portage/app-text/podofo-0.9.6_pre20170508-r1/work/podofo-0.9.6_pre20170508 -I/var/tmp/portage/app-text/podofo-0.9.6_pre20170508-r1/work/podofo-0.9.6_pre20170508/src -I/usr/include/freetype2   -DNDEBUG -march=native -O2 -pipe -Wall -Woverloaded-virtual -Wswitch-enum -Wcast-qual -Wwrite-strings -Wredundant-decls -Wreorder -Wno-deprecated-declarations -fPIC   -W -DBUILDING_PODOFO -o CMakeFiles/podofo_shared.dir/doc/PdfFontMetricsObject.cpp.o -c /var/tmp/portage/app-text/podofo-0.9.6_pre20170508-r1/work/podofo-0.9.6_pre20170508/src/doc/PdfFontMetricsObject.cpp
  376. [ 37%] Building CXX object src/CMakeFiles/podofo_shared.dir/doc/PdfFontSimple.cpp.o
  377. cd /var/tmp/portage/app-text/podofo-0.9.6_pre20170508-r1/work/podofo-0.9.6_pre20170508_build/src && /usr/bin/x86_64-pc-linux-gnu-g++ -Dpodofo_shared_EXPORTS -I/var/tmp/portage/app-text/podofo-0.9.6_pre20170508-r1/work/podofo-0.9.6_pre20170508_build -I/var/tmp/portage/app-text/podofo-0.9.6_pre20170508-r1/work/podofo-0.9.6_pre20170508 -I/var/tmp/portage/app-text/podofo-0.9.6_pre20170508-r1/work/podofo-0.9.6_pre20170508/src -I/usr/include/freetype2   -DNDEBUG -march=native -O2 -pipe -Wall -Woverloaded-virtual -Wswitch-enum -Wcast-qual -Wwrite-strings -Wredundant-decls -Wreorder -Wno-deprecated-declarations -fPIC   -W -DBUILDING_PODOFO -o CMakeFiles/podofo_shared.dir/doc/PdfFontSimple.cpp.o -c /var/tmp/portage/app-text/podofo-0.9.6_pre20170508-r1/work/podofo-0.9.6_pre20170508/src/doc/PdfFontSimple.cpp
  378. [ 38%] Building CXX object src/CMakeFiles/podofo_shared.dir/doc/PdfFontTTFSubset.cpp.o
  379. cd /var/tmp/portage/app-text/podofo-0.9.6_pre20170508-r1/work/podofo-0.9.6_pre20170508_build/src && /usr/bin/x86_64-pc-linux-gnu-g++ -Dpodofo_shared_EXPORTS -I/var/tmp/portage/app-text/podofo-0.9.6_pre20170508-r1/work/podofo-0.9.6_pre20170508_build -I/var/tmp/portage/app-text/podofo-0.9.6_pre20170508-r1/work/podofo-0.9.6_pre20170508 -I/var/tmp/portage/app-text/podofo-0.9.6_pre20170508-r1/work/podofo-0.9.6_pre20170508/src -I/usr/include/freetype2   -DNDEBUG -march=native -O2 -pipe -Wall -Woverloaded-virtual -Wswitch-enum -Wcast-qual -Wwrite-strings -Wredundant-decls -Wreorder -Wno-deprecated-declarations -fPIC   -W -DBUILDING_PODOFO -o CMakeFiles/podofo_shared.dir/doc/PdfFontTTFSubset.cpp.o -c /var/tmp/portage/app-text/podofo-0.9.6_pre20170508-r1/work/podofo-0.9.6_pre20170508/src/doc/PdfFontTTFSubset.cpp
  380. [ 38%] Building CXX object src/CMakeFiles/podofo_shared.dir/doc/PdfFontTrueType.cpp.o
  381. cd /var/tmp/portage/app-text/podofo-0.9.6_pre20170508-r1/work/podofo-0.9.6_pre20170508_build/src && /usr/bin/x86_64-pc-linux-gnu-g++ -Dpodofo_shared_EXPORTS -I/var/tmp/portage/app-text/podofo-0.9.6_pre20170508-r1/work/podofo-0.9.6_pre20170508_build -I/var/tmp/portage/app-text/podofo-0.9.6_pre20170508-r1/work/podofo-0.9.6_pre20170508 -I/var/tmp/portage/app-text/podofo-0.9.6_pre20170508-r1/work/podofo-0.9.6_pre20170508/src -I/usr/include/freetype2   -DNDEBUG -march=native -O2 -pipe -Wall -Woverloaded-virtual -Wswitch-enum -Wcast-qual -Wwrite-strings -Wredundant-decls -Wreorder -Wno-deprecated-declarations -fPIC   -W -DBUILDING_PODOFO -o CMakeFiles/podofo_shared.dir/doc/PdfFontTrueType.cpp.o -c /var/tmp/portage/app-text/podofo-0.9.6_pre20170508-r1/work/podofo-0.9.6_pre20170508/src/doc/PdfFontTrueType.cpp
  382. [ 39%] Building CXX object src/CMakeFiles/podofo_shared.dir/doc/PdfFontType1.cpp.o
  383. cd /var/tmp/portage/app-text/podofo-0.9.6_pre20170508-r1/work/podofo-0.9.6_pre20170508_build/src && /usr/bin/x86_64-pc-linux-gnu-g++ -Dpodofo_shared_EXPORTS -I/var/tmp/portage/app-text/podofo-0.9.6_pre20170508-r1/work/podofo-0.9.6_pre20170508_build -I/var/tmp/portage/app-text/podofo-0.9.6_pre20170508-r1/work/podofo-0.9.6_pre20170508 -I/var/tmp/portage/app-text/podofo-0.9.6_pre20170508-r1/work/podofo-0.9.6_pre20170508/src -I/usr/include/freetype2   -DNDEBUG -march=native -O2 -pipe -Wall -Woverloaded-virtual -Wswitch-enum -Wcast-qual -Wwrite-strings -Wredundant-decls -Wreorder -Wno-deprecated-declarations -fPIC   -W -DBUILDING_PODOFO -o CMakeFiles/podofo_shared.dir/doc/PdfFontType1.cpp.o -c /var/tmp/portage/app-text/podofo-0.9.6_pre20170508-r1/work/podofo-0.9.6_pre20170508/src/doc/PdfFontType1.cpp
  384. [ 39%] Building CXX object src/CMakeFiles/podofo_shared.dir/doc/PdfFontType3.cpp.o
  385. cd /var/tmp/portage/app-text/podofo-0.9.6_pre20170508-r1/work/podofo-0.9.6_pre20170508_build/src && /usr/bin/x86_64-pc-linux-gnu-g++ -Dpodofo_shared_EXPORTS -I/var/tmp/portage/app-text/podofo-0.9.6_pre20170508-r1/work/podofo-0.9.6_pre20170508_build -I/var/tmp/portage/app-text/podofo-0.9.6_pre20170508-r1/work/podofo-0.9.6_pre20170508 -I/var/tmp/portage/app-text/podofo-0.9.6_pre20170508-r1/work/podofo-0.9.6_pre20170508/src -I/usr/include/freetype2   -DNDEBUG -march=native -O2 -pipe -Wall -Woverloaded-virtual -Wswitch-enum -Wcast-qual -Wwrite-strings -Wredundant-decls -Wreorder -Wno-deprecated-declarations -fPIC   -W -DBUILDING_PODOFO -o CMakeFiles/podofo_shared.dir/doc/PdfFontType3.cpp.o -c /var/tmp/portage/app-text/podofo-0.9.6_pre20170508-r1/work/podofo-0.9.6_pre20170508/src/doc/PdfFontType3.cpp
  386. [ 40%] Building CXX object src/CMakeFiles/podofo_shared.dir/doc/PdfFontType1Base14.cpp.o
  387. cd /var/tmp/portage/app-text/podofo-0.9.6_pre20170508-r1/work/podofo-0.9.6_pre20170508_build/src && /usr/bin/x86_64-pc-linux-gnu-g++ -Dpodofo_shared_EXPORTS -I/var/tmp/portage/app-text/podofo-0.9.6_pre20170508-r1/work/podofo-0.9.6_pre20170508_build -I/var/tmp/portage/app-text/podofo-0.9.6_pre20170508-r1/work/podofo-0.9.6_pre20170508 -I/var/tmp/portage/app-text/podofo-0.9.6_pre20170508-r1/work/podofo-0.9.6_pre20170508/src -I/usr/include/freetype2   -DNDEBUG -march=native -O2 -pipe -Wall -Woverloaded-virtual -Wswitch-enum -Wcast-qual -Wwrite-strings -Wredundant-decls -Wreorder -Wno-deprecated-declarations -fPIC   -W -DBUILDING_PODOFO -o CMakeFiles/podofo_shared.dir/doc/PdfFontType1Base14.cpp.o -c /var/tmp/portage/app-text/podofo-0.9.6_pre20170508-r1/work/podofo-0.9.6_pre20170508/src/doc/PdfFontType1Base14.cpp
  388. [ 40%] Building CXX object src/CMakeFiles/podofo_shared.dir/doc/PdfFunction.cpp.o
  389. cd /var/tmp/portage/app-text/podofo-0.9.6_pre20170508-r1/work/podofo-0.9.6_pre20170508_build/src && /usr/bin/x86_64-pc-linux-gnu-g++ -Dpodofo_shared_EXPORTS -I/var/tmp/portage/app-text/podofo-0.9.6_pre20170508-r1/work/podofo-0.9.6_pre20170508_build -I/var/tmp/portage/app-text/podofo-0.9.6_pre20170508-r1/work/podofo-0.9.6_pre20170508 -I/var/tmp/portage/app-text/podofo-0.9.6_pre20170508-r1/work/podofo-0.9.6_pre20170508/src -I/usr/include/freetype2   -DNDEBUG -march=native -O2 -pipe -Wall -Woverloaded-virtual -Wswitch-enum -Wcast-qual -Wwrite-strings -Wredundant-decls -Wreorder -Wno-deprecated-declarations -fPIC   -W -DBUILDING_PODOFO -o CMakeFiles/podofo_shared.dir/doc/PdfFunction.cpp.o -c /var/tmp/portage/app-text/podofo-0.9.6_pre20170508-r1/work/podofo-0.9.6_pre20170508/src/doc/PdfFunction.cpp
  390. [ 41%] Building CXX object src/CMakeFiles/podofo_shared.dir/doc/PdfHintStream.cpp.o
  391. cd /var/tmp/portage/app-text/podofo-0.9.6_pre20170508-r1/work/podofo-0.9.6_pre20170508_build/src && /usr/bin/x86_64-pc-linux-gnu-g++ -Dpodofo_shared_EXPORTS -I/var/tmp/portage/app-text/podofo-0.9.6_pre20170508-r1/work/podofo-0.9.6_pre20170508_build -I/var/tmp/portage/app-text/podofo-0.9.6_pre20170508-r1/work/podofo-0.9.6_pre20170508 -I/var/tmp/portage/app-text/podofo-0.9.6_pre20170508-r1/work/podofo-0.9.6_pre20170508/src -I/usr/include/freetype2   -DNDEBUG -march=native -O2 -pipe -Wall -Woverloaded-virtual -Wswitch-enum -Wcast-qual -Wwrite-strings -Wredundant-decls -Wreorder -Wno-deprecated-declarations -fPIC   -W -DBUILDING_PODOFO -o CMakeFiles/podofo_shared.dir/doc/PdfHintStream.cpp.o -c /var/tmp/portage/app-text/podofo-0.9.6_pre20170508-r1/work/podofo-0.9.6_pre20170508/src/doc/PdfHintStream.cpp
  392. [ 42%] Building CXX object src/CMakeFiles/podofo_shared.dir/doc/PdfIdentityEncoding.cpp.o
  393. cd /var/tmp/portage/app-text/podofo-0.9.6_pre20170508-r1/work/podofo-0.9.6_pre20170508_build/src && /usr/bin/x86_64-pc-linux-gnu-g++ -Dpodofo_shared_EXPORTS -I/var/tmp/portage/app-text/podofo-0.9.6_pre20170508-r1/work/podofo-0.9.6_pre20170508_build -I/var/tmp/portage/app-text/podofo-0.9.6_pre20170508-r1/work/podofo-0.9.6_pre20170508 -I/var/tmp/portage/app-text/podofo-0.9.6_pre20170508-r1/work/podofo-0.9.6_pre20170508/src -I/usr/include/freetype2   -DNDEBUG -march=native -O2 -pipe -Wall -Woverloaded-virtual -Wswitch-enum -Wcast-qual -Wwrite-strings -Wredundant-decls -Wreorder -Wno-deprecated-declarations -fPIC   -W -DBUILDING_PODOFO -o CMakeFiles/podofo_shared.dir/doc/PdfIdentityEncoding.cpp.o -c /var/tmp/portage/app-text/podofo-0.9.6_pre20170508-r1/work/podofo-0.9.6_pre20170508/src/doc/PdfIdentityEncoding.cpp
  394. [ 42%] Building CXX object src/CMakeFiles/podofo_shared.dir/doc/PdfImage.cpp.o
  395. cd /var/tmp/portage/app-text/podofo-0.9.6_pre20170508-r1/work/podofo-0.9.6_pre20170508_build/src && /usr/bin/x86_64-pc-linux-gnu-g++ -Dpodofo_shared_EXPORTS -I/var/tmp/portage/app-text/podofo-0.9.6_pre20170508-r1/work/podofo-0.9.6_pre20170508_build -I/var/tmp/portage/app-text/podofo-0.9.6_pre20170508-r1/work/podofo-0.9.6_pre20170508 -I/var/tmp/portage/app-text/podofo-0.9.6_pre20170508-r1/work/podofo-0.9.6_pre20170508/src -I/usr/include/freetype2   -DNDEBUG -march=native -O2 -pipe -Wall -Woverloaded-virtual -Wswitch-enum -Wcast-qual -Wwrite-strings -Wredundant-decls -Wreorder -Wno-deprecated-declarations -fPIC   -W -DBUILDING_PODOFO -o CMakeFiles/podofo_shared.dir/doc/PdfImage.cpp.o -c /var/tmp/portage/app-text/podofo-0.9.6_pre20170508-r1/work/podofo-0.9.6_pre20170508/src/doc/PdfImage.cpp
  396. [ 43%] Building CXX object src/CMakeFiles/podofo_shared.dir/doc/PdfInfo.cpp.o
  397. cd /var/tmp/portage/app-text/podofo-0.9.6_pre20170508-r1/work/podofo-0.9.6_pre20170508_build/src && /usr/bin/x86_64-pc-linux-gnu-g++ -Dpodofo_shared_EXPORTS -I/var/tmp/portage/app-text/podofo-0.9.6_pre20170508-r1/work/podofo-0.9.6_pre20170508_build -I/var/tmp/portage/app-text/podofo-0.9.6_pre20170508-r1/work/podofo-0.9.6_pre20170508 -I/var/tmp/portage/app-text/podofo-0.9.6_pre20170508-r1/work/podofo-0.9.6_pre20170508/src -I/usr/include/freetype2   -DNDEBUG -march=native -O2 -pipe -Wall -Woverloaded-virtual -Wswitch-enum -Wcast-qual -Wwrite-strings -Wredundant-decls -Wreorder -Wno-deprecated-declarations -fPIC   -W -DBUILDING_PODOFO -o CMakeFiles/podofo_shared.dir/doc/PdfInfo.cpp.o -c /var/tmp/portage/app-text/podofo-0.9.6_pre20170508-r1/work/podofo-0.9.6_pre20170508/src/doc/PdfInfo.cpp
  398. [ 43%] Building CXX object src/CMakeFiles/podofo_shared.dir/doc/PdfMemDocument.cpp.o
  399. cd /var/tmp/portage/app-text/podofo-0.9.6_pre20170508-r1/work/podofo-0.9.6_pre20170508_build/src && /usr/bin/x86_64-pc-linux-gnu-g++ -Dpodofo_shared_EXPORTS -I/var/tmp/portage/app-text/podofo-0.9.6_pre20170508-r1/work/podofo-0.9.6_pre20170508_build -I/var/tmp/portage/app-text/podofo-0.9.6_pre20170508-r1/work/podofo-0.9.6_pre20170508 -I/var/tmp/portage/app-text/podofo-0.9.6_pre20170508-r1/work/podofo-0.9.6_pre20170508/src -I/usr/include/freetype2   -DNDEBUG -march=native -O2 -pipe -Wall -Woverloaded-virtual -Wswitch-enum -Wcast-qual -Wwrite-strings -Wredundant-decls -Wreorder -Wno-deprecated-declarations -fPIC   -W -DBUILDING_PODOFO -o CMakeFiles/podofo_shared.dir/doc/PdfMemDocument.cpp.o -c /var/tmp/portage/app-text/podofo-0.9.6_pre20170508-r1/work/podofo-0.9.6_pre20170508/src/doc/PdfMemDocument.cpp
  400. [ 44%] Building CXX object src/CMakeFiles/podofo_shared.dir/doc/PdfNamesTree.cpp.o
  401. cd /var/tmp/portage/app-text/podofo-0.9.6_pre20170508-r1/work/podofo-0.9.6_pre20170508_build/src && /usr/bin/x86_64-pc-linux-gnu-g++ -Dpodofo_shared_EXPORTS -I/var/tmp/portage/app-text/podofo-0.9.6_pre20170508-r1/work/podofo-0.9.6_pre20170508_build -I/var/tmp/portage/app-text/podofo-0.9.6_pre20170508-r1/work/podofo-0.9.6_pre20170508 -I/var/tmp/portage/app-text/podofo-0.9.6_pre20170508-r1/work/podofo-0.9.6_pre20170508/src -I/usr/include/freetype2   -DNDEBUG -march=native -O2 -pipe -Wall -Woverloaded-virtual -Wswitch-enum -Wcast-qual -Wwrite-strings -Wredundant-decls -Wreorder -Wno-deprecated-declarations -fPIC   -W -DBUILDING_PODOFO -o CMakeFiles/podofo_shared.dir/doc/PdfNamesTree.cpp.o -c /var/tmp/portage/app-text/podofo-0.9.6_pre20170508-r1/work/podofo-0.9.6_pre20170508/src/doc/PdfNamesTree.cpp
  402. [ 44%] Building CXX object src/CMakeFiles/podofo_shared.dir/doc/PdfOutlines.cpp.o
  403. cd /var/tmp/portage/app-text/podofo-0.9.6_pre20170508-r1/work/podofo-0.9.6_pre20170508_build/src && /usr/bin/x86_64-pc-linux-gnu-g++ -Dpodofo_shared_EXPORTS -I/var/tmp/portage/app-text/podofo-0.9.6_pre20170508-r1/work/podofo-0.9.6_pre20170508_build -I/var/tmp/portage/app-text/podofo-0.9.6_pre20170508-r1/work/podofo-0.9.6_pre20170508 -I/var/tmp/portage/app-text/podofo-0.9.6_pre20170508-r1/work/podofo-0.9.6_pre20170508/src -I/usr/include/freetype2   -DNDEBUG -march=native -O2 -pipe -Wall -Woverloaded-virtual -Wswitch-enum -Wcast-qual -Wwrite-strings -Wredundant-decls -Wreorder -Wno-deprecated-declarations -fPIC   -W -DBUILDING_PODOFO -o CMakeFiles/podofo_shared.dir/doc/PdfOutlines.cpp.o -c /var/tmp/portage/app-text/podofo-0.9.6_pre20170508-r1/work/podofo-0.9.6_pre20170508/src/doc/PdfOutlines.cpp
  404. [ 45%] Building CXX object src/CMakeFiles/podofo_shared.dir/doc/PdfPage.cpp.o
  405. cd /var/tmp/portage/app-text/podofo-0.9.6_pre20170508-r1/work/podofo-0.9.6_pre20170508_build/src && /usr/bin/x86_64-pc-linux-gnu-g++ -Dpodofo_shared_EXPORTS -I/var/tmp/portage/app-text/podofo-0.9.6_pre20170508-r1/work/podofo-0.9.6_pre20170508_build -I/var/tmp/portage/app-text/podofo-0.9.6_pre20170508-r1/work/podofo-0.9.6_pre20170508 -I/var/tmp/portage/app-text/podofo-0.9.6_pre20170508-r1/work/podofo-0.9.6_pre20170508/src -I/usr/include/freetype2   -DNDEBUG -march=native -O2 -pipe -Wall -Woverloaded-virtual -Wswitch-enum -Wcast-qual -Wwrite-strings -Wredundant-decls -Wreorder -Wno-deprecated-declarations -fPIC   -W -DBUILDING_PODOFO -o CMakeFiles/podofo_shared.dir/doc/PdfPage.cpp.o -c /var/tmp/portage/app-text/podofo-0.9.6_pre20170508-r1/work/podofo-0.9.6_pre20170508/src/doc/PdfPage.cpp
  406. [ 46%] Building CXX object src/CMakeFiles/podofo_shared.dir/doc/PdfPagesTree.cpp.o
  407. cd /var/tmp/portage/app-text/podofo-0.9.6_pre20170508-r1/work/podofo-0.9.6_pre20170508_build/src && /usr/bin/x86_64-pc-linux-gnu-g++ -Dpodofo_shared_EXPORTS -I/var/tmp/portage/app-text/podofo-0.9.6_pre20170508-r1/work/podofo-0.9.6_pre20170508_build -I/var/tmp/portage/app-text/podofo-0.9.6_pre20170508-r1/work/podofo-0.9.6_pre20170508 -I/var/tmp/portage/app-text/podofo-0.9.6_pre20170508-r1/work/podofo-0.9.6_pre20170508/src -I/usr/include/freetype2   -DNDEBUG -march=native -O2 -pipe -Wall -Woverloaded-virtual -Wswitch-enum -Wcast-qual -Wwrite-strings -Wredundant-decls -Wreorder -Wno-deprecated-declarations -fPIC   -W -DBUILDING_PODOFO -o CMakeFiles/podofo_shared.dir/doc/PdfPagesTree.cpp.o -c /var/tmp/portage/app-text/podofo-0.9.6_pre20170508-r1/work/podofo-0.9.6_pre20170508/src/doc/PdfPagesTree.cpp
  408. [ 46%] Building CXX object src/CMakeFiles/podofo_shared.dir/doc/PdfPagesTreeCache.cpp.o
  409. cd /var/tmp/portage/app-text/podofo-0.9.6_pre20170508-r1/work/podofo-0.9.6_pre20170508_build/src && /usr/bin/x86_64-pc-linux-gnu-g++ -Dpodofo_shared_EXPORTS -I/var/tmp/portage/app-text/podofo-0.9.6_pre20170508-r1/work/podofo-0.9.6_pre20170508_build -I/var/tmp/portage/app-text/podofo-0.9.6_pre20170508-r1/work/podofo-0.9.6_pre20170508 -I/var/tmp/portage/app-text/podofo-0.9.6_pre20170508-r1/work/podofo-0.9.6_pre20170508/src -I/usr/include/freetype2   -DNDEBUG -march=native -O2 -pipe -Wall -Woverloaded-virtual -Wswitch-enum -Wcast-qual -Wwrite-strings -Wredundant-decls -Wreorder -Wno-deprecated-declarations -fPIC   -W -DBUILDING_PODOFO -o CMakeFiles/podofo_shared.dir/doc/PdfPagesTreeCache.cpp.o -c /var/tmp/portage/app-text/podofo-0.9.6_pre20170508-r1/work/podofo-0.9.6_pre20170508/src/doc/PdfPagesTreeCache.cpp
  410. [ 47%] Building CXX object src/CMakeFiles/podofo_shared.dir/doc/PdfPainter.cpp.o
  411. cd /var/tmp/portage/app-text/podofo-0.9.6_pre20170508-r1/work/podofo-0.9.6_pre20170508_build/src && /usr/bin/x86_64-pc-linux-gnu-g++ -Dpodofo_shared_EXPORTS -I/var/tmp/portage/app-text/podofo-0.9.6_pre20170508-r1/work/podofo-0.9.6_pre20170508_build -I/var/tmp/portage/app-text/podofo-0.9.6_pre20170508-r1/work/podofo-0.9.6_pre20170508 -I/var/tmp/portage/app-text/podofo-0.9.6_pre20170508-r1/work/podofo-0.9.6_pre20170508/src -I/usr/include/freetype2   -DNDEBUG -march=native -O2 -pipe -Wall -Woverloaded-virtual -Wswitch-enum -Wcast-qual -Wwrite-strings -Wredundant-decls -Wreorder -Wno-deprecated-declarations -fPIC   -W -DBUILDING_PODOFO -o CMakeFiles/podofo_shared.dir/doc/PdfPainter.cpp.o -c /var/tmp/portage/app-text/podofo-0.9.6_pre20170508-r1/work/podofo-0.9.6_pre20170508/src/doc/PdfPainter.cpp
  412. [ 47%] Building CXX object src/CMakeFiles/podofo_shared.dir/doc/PdfPainterMM.cpp.o
  413. cd /var/tmp/portage/app-text/podofo-0.9.6_pre20170508-r1/work/podofo-0.9.6_pre20170508_build/src && /usr/bin/x86_64-pc-linux-gnu-g++ -Dpodofo_shared_EXPORTS -I/var/tmp/portage/app-text/podofo-0.9.6_pre20170508-r1/work/podofo-0.9.6_pre20170508_build -I/var/tmp/portage/app-text/podofo-0.9.6_pre20170508-r1/work/podofo-0.9.6_pre20170508 -I/var/tmp/portage/app-text/podofo-0.9.6_pre20170508-r1/work/podofo-0.9.6_pre20170508/src -I/usr/include/freetype2   -DNDEBUG -march=native -O2 -pipe -Wall -Woverloaded-virtual -Wswitch-enum -Wcast-qual -Wwrite-strings -Wredundant-decls -Wreorder -Wno-deprecated-declarations -fPIC   -W -DBUILDING_PODOFO -o CMakeFiles/podofo_shared.dir/doc/PdfPainterMM.cpp.o -c /var/tmp/portage/app-text/podofo-0.9.6_pre20170508-r1/work/podofo-0.9.6_pre20170508/src/doc/PdfPainterMM.cpp
  414. In file included from /var/tmp/portage/app-text/podofo-0.9.6_pre20170508-r1/work/podofo-0.9.6_pre20170508/podofo/base/../../src/base/PdfDefines.h:116,
  415.                  from /var/tmp/portage/app-text/podofo-0.9.6_pre20170508-r1/work/podofo-0.9.6_pre20170508/podofo/base/PdfDefines.h:11,
  416.                  from /var/tmp/portage/app-text/podofo-0.9.6_pre20170508-r1/work/podofo-0.9.6_pre20170508/src/doc/PdfPainter.h:37,
  417.                  from /var/tmp/portage/app-text/podofo-0.9.6_pre20170508-r1/work/podofo-0.9.6_pre20170508/src/doc/PdfPainter.cpp:42:
  418. /var/tmp/portage/app-text/podofo-0.9.6_pre20170508-r1/work/podofo-0.9.6_pre20170508/src/doc/PdfPainter.cpp: In destructor ‘virtual PoDoFo::PdfPainter::~PdfPainter()’:
  419. /var/tmp/portage/app-text/podofo-0.9.6_pre20170508-r1/work/podofo-0.9.6_pre20170508/podofo/base/../../src/base/PdfError.h:164:92: warning: throw will always call terminate() [-Wterminate]
  420.  #define PODOFO_RAISE_ERROR_INFO( x, y ) throw ::PoDoFo::PdfError( x, __FILE__, __LINE__, y );
  421.                                                                                             ^
  422. /var/tmp/portage/app-text/podofo-0.9.6_pre20170508-r1/work/podofo-0.9.6_pre20170508/podofo/base/../../src/base/PdfDefines.h:128:43: note: in expansion of macro ‘PODOFO_RAISE_ERROR_INFO’
  423.  #define PODOFO_ASSERT( x ) do { if (!(x)) PODOFO_RAISE_ERROR_INFO(ePdfError_InternalLogic, #x); } while (false)
  424.                                            ^~~~~~~~~~~~~~~~~~~~~~~
  425. /var/tmp/portage/app-text/podofo-0.9.6_pre20170508-r1/work/podofo-0.9.6_pre20170508/src/doc/PdfPainter.cpp:149:5: note: in expansion of macro ‘PODOFO_ASSERT’
  426.      PODOFO_ASSERT( !m_pCanvas );
  427.      ^~~~~~~~~~~~~
  428. /var/tmp/portage/app-text/podofo-0.9.6_pre20170508-r1/work/podofo-0.9.6_pre20170508/podofo/base/../../src/base/PdfError.h:164:92: note: in C++11 destructors default to noexcept
  429.  #define PODOFO_RAISE_ERROR_INFO( x, y ) throw ::PoDoFo::PdfError( x, __FILE__, __LINE__, y );
  430.                                                                                             ^
  431. /var/tmp/portage/app-text/podofo-0.9.6_pre20170508-r1/work/podofo-0.9.6_pre20170508/podofo/base/../../src/base/PdfDefines.h:128:43: note: in expansion of macro ‘PODOFO_RAISE_ERROR_INFO’
  432.  #define PODOFO_ASSERT( x ) do { if (!(x)) PODOFO_RAISE_ERROR_INFO(ePdfError_InternalLogic, #x); } while (false)
  433.                                            ^~~~~~~~~~~~~~~~~~~~~~~
  434. /var/tmp/portage/app-text/podofo-0.9.6_pre20170508-r1/work/podofo-0.9.6_pre20170508/src/doc/PdfPainter.cpp:149:5: note: in expansion of macro ‘PODOFO_ASSERT’
  435.      PODOFO_ASSERT( !m_pCanvas );
  436.      ^~~~~~~~~~~~~
  437. [ 48%] Building CXX object src/CMakeFiles/podofo_shared.dir/doc/PdfShadingPattern.cpp.o
  438. cd /var/tmp/portage/app-text/podofo-0.9.6_pre20170508-r1/work/podofo-0.9.6_pre20170508_build/src && /usr/bin/x86_64-pc-linux-gnu-g++ -Dpodofo_shared_EXPORTS -I/var/tmp/portage/app-text/podofo-0.9.6_pre20170508-r1/work/podofo-0.9.6_pre20170508_build -I/var/tmp/portage/app-text/podofo-0.9.6_pre20170508-r1/work/podofo-0.9.6_pre20170508 -I/var/tmp/portage/app-text/podofo-0.9.6_pre20170508-r1/work/podofo-0.9.6_pre20170508/src -I/usr/include/freetype2   -DNDEBUG -march=native -O2 -pipe -Wall -Woverloaded-virtual -Wswitch-enum -Wcast-qual -Wwrite-strings -Wredundant-decls -Wreorder -Wno-deprecated-declarations -fPIC   -W -DBUILDING_PODOFO -o CMakeFiles/podofo_shared.dir/doc/PdfShadingPattern.cpp.o -c /var/tmp/portage/app-text/podofo-0.9.6_pre20170508-r1/work/podofo-0.9.6_pre20170508/src/doc/PdfShadingPattern.cpp
  439. [ 48%] Building CXX object src/CMakeFiles/podofo_shared.dir/doc/PdfSignOutputDevice.cpp.o
  440. cd /var/tmp/portage/app-text/podofo-0.9.6_pre20170508-r1/work/podofo-0.9.6_pre20170508_build/src && /usr/bin/x86_64-pc-linux-gnu-g++ -Dpodofo_shared_EXPORTS -I/var/tmp/portage/app-text/podofo-0.9.6_pre20170508-r1/work/podofo-0.9.6_pre20170508_build -I/var/tmp/portage/app-text/podofo-0.9.6_pre20170508-r1/work/podofo-0.9.6_pre20170508 -I/var/tmp/portage/app-text/podofo-0.9.6_pre20170508-r1/work/podofo-0.9.6_pre20170508/src -I/usr/include/freetype2   -DNDEBUG -march=native -O2 -pipe -Wall -Woverloaded-virtual -Wswitch-enum -Wcast-qual -Wwrite-strings -Wredundant-decls -Wreorder -Wno-deprecated-declarations -fPIC   -W -DBUILDING_PODOFO -o CMakeFiles/podofo_shared.dir/doc/PdfSignOutputDevice.cpp.o -c /var/tmp/portage/app-text/podofo-0.9.6_pre20170508-r1/work/podofo-0.9.6_pre20170508/src/doc/PdfSignOutputDevice.cpp
  441. [ 49%] Building CXX object src/CMakeFiles/podofo_shared.dir/doc/PdfSignatureField.cpp.o
  442. cd /var/tmp/portage/app-text/podofo-0.9.6_pre20170508-r1/work/podofo-0.9.6_pre20170508_build/src && /usr/bin/x86_64-pc-linux-gnu-g++ -Dpodofo_shared_EXPORTS -I/var/tmp/portage/app-text/podofo-0.9.6_pre20170508-r1/work/podofo-0.9.6_pre20170508_build -I/var/tmp/portage/app-text/podofo-0.9.6_pre20170508-r1/work/podofo-0.9.6_pre20170508 -I/var/tmp/portage/app-text/podofo-0.9.6_pre20170508-r1/work/podofo-0.9.6_pre20170508/src -I/usr/include/freetype2   -DNDEBUG -march=native -O2 -pipe -Wall -Woverloaded-virtual -Wswitch-enum -Wcast-qual -Wwrite-strings -Wredundant-decls -Wreorder -Wno-deprecated-declarations -fPIC   -W -DBUILDING_PODOFO -o CMakeFiles/podofo_shared.dir/doc/PdfSignatureField.cpp.o -c /var/tmp/portage/app-text/podofo-0.9.6_pre20170508-r1/work/podofo-0.9.6_pre20170508/src/doc/PdfSignatureField.cpp
  443. [ 50%] Building CXX object src/CMakeFiles/podofo_shared.dir/doc/PdfStreamedDocument.cpp.o
  444. cd /var/tmp/portage/app-text/podofo-0.9.6_pre20170508-r1/work/podofo-0.9.6_pre20170508_build/src && /usr/bin/x86_64-pc-linux-gnu-g++ -Dpodofo_shared_EXPORTS -I/var/tmp/portage/app-text/podofo-0.9.6_pre20170508-r1/work/podofo-0.9.6_pre20170508_build -I/var/tmp/portage/app-text/podofo-0.9.6_pre20170508-r1/work/podofo-0.9.6_pre20170508 -I/var/tmp/portage/app-text/podofo-0.9.6_pre20170508-r1/work/podofo-0.9.6_pre20170508/src -I/usr/include/freetype2   -DNDEBUG -march=native -O2 -pipe -Wall -Woverloaded-virtual -Wswitch-enum -Wcast-qual -Wwrite-strings -Wredundant-decls -Wreorder -Wno-deprecated-declarations -fPIC   -W -DBUILDING_PODOFO -o CMakeFiles/podofo_shared.dir/doc/PdfStreamedDocument.cpp.o -c /var/tmp/portage/app-text/podofo-0.9.6_pre20170508-r1/work/podofo-0.9.6_pre20170508/src/doc/PdfStreamedDocument.cpp
  445. [ 50%] Building CXX object src/CMakeFiles/podofo_shared.dir/doc/PdfTable.cpp.o
  446. cd /var/tmp/portage/app-text/podofo-0.9.6_pre20170508-r1/work/podofo-0.9.6_pre20170508_build/src && /usr/bin/x86_64-pc-linux-gnu-g++ -Dpodofo_shared_EXPORTS -I/var/tmp/portage/app-text/podofo-0.9.6_pre20170508-r1/work/podofo-0.9.6_pre20170508_build -I/var/tmp/portage/app-text/podofo-0.9.6_pre20170508-r1/work/podofo-0.9.6_pre20170508 -I/var/tmp/portage/app-text/podofo-0.9.6_pre20170508-r1/work/podofo-0.9.6_pre20170508/src -I/usr/include/freetype2   -DNDEBUG -march=native -O2 -pipe -Wall -Woverloaded-virtual -Wswitch-enum -Wcast-qual -Wwrite-strings -Wredundant-decls -Wreorder -Wno-deprecated-declarations -fPIC   -W -DBUILDING_PODOFO -o CMakeFiles/podofo_shared.dir/doc/PdfTable.cpp.o -c /var/tmp/portage/app-text/podofo-0.9.6_pre20170508-r1/work/podofo-0.9.6_pre20170508/src/doc/PdfTable.cpp
  447. [ 51%] Building CXX object src/CMakeFiles/podofo_shared.dir/doc/PdfTilingPattern.cpp.o
  448. cd /var/tmp/portage/app-text/podofo-0.9.6_pre20170508-r1/work/podofo-0.9.6_pre20170508_build/src && /usr/bin/x86_64-pc-linux-gnu-g++ -Dpodofo_shared_EXPORTS -I/var/tmp/portage/app-text/podofo-0.9.6_pre20170508-r1/work/podofo-0.9.6_pre20170508_build -I/var/tmp/portage/app-text/podofo-0.9.6_pre20170508-r1/work/podofo-0.9.6_pre20170508 -I/var/tmp/portage/app-text/podofo-0.9.6_pre20170508-r1/work/podofo-0.9.6_pre20170508/src -I/usr/include/freetype2   -DNDEBUG -march=native -O2 -pipe -Wall -Woverloaded-virtual -Wswitch-enum -Wcast-qual -Wwrite-strings -Wredundant-decls -Wreorder -Wno-deprecated-declarations -fPIC   -W -DBUILDING_PODOFO -o CMakeFiles/podofo_shared.dir/doc/PdfTilingPattern.cpp.o -c /var/tmp/portage/app-text/podofo-0.9.6_pre20170508-r1/work/podofo-0.9.6_pre20170508/src/doc/PdfTilingPattern.cpp
  449. /var/tmp/portage/app-text/podofo-0.9.6_pre20170508-r1/work/podofo-0.9.6_pre20170508/src/doc/PdfSignOutputDevice.cpp: In member function ‘virtual void PoDoFo::PdfSignOutputDevice::AdjustByteRange()’:
  450. /var/tmp/portage/app-text/podofo-0.9.6_pre20170508-r1/work/podofo-0.9.6_pre20170508/src/doc/PdfSignOutputDevice.cpp:170:9: warning: variable ‘size’ set but not used [-Wunused-but-set-variable]
  451.   size_t size;
  452.          ^~~~
  453. [ 51%] Building CXX object src/CMakeFiles/podofo_shared.dir/doc/PdfXObject.cpp.o
  454. cd /var/tmp/portage/app-text/podofo-0.9.6_pre20170508-r1/work/podofo-0.9.6_pre20170508_build/src && /usr/bin/x86_64-pc-linux-gnu-g++ -Dpodofo_shared_EXPORTS -I/var/tmp/portage/app-text/podofo-0.9.6_pre20170508-r1/work/podofo-0.9.6_pre20170508_build -I/var/tmp/portage/app-text/podofo-0.9.6_pre20170508-r1/work/podofo-0.9.6_pre20170508 -I/var/tmp/portage/app-text/podofo-0.9.6_pre20170508-r1/work/podofo-0.9.6_pre20170508/src -I/usr/include/freetype2   -DNDEBUG -march=native -O2 -pipe -Wall -Woverloaded-virtual -Wswitch-enum -Wcast-qual -Wwrite-strings -Wredundant-decls -Wreorder -Wno-deprecated-declarations -fPIC   -W -DBUILDING_PODOFO -o CMakeFiles/podofo_shared.dir/doc/PdfXObject.cpp.o -c /var/tmp/portage/app-text/podofo-0.9.6_pre20170508-r1/work/podofo-0.9.6_pre20170508/src/doc/PdfXObject.cpp
  455. [ 52%] Linking CXX shared library libpodofo.so
  456. cd /var/tmp/portage/app-text/podofo-0.9.6_pre20170508-r1/work/podofo-0.9.6_pre20170508_build/src && /usr/bin/cmake -E cmake_link_script CMakeFiles/podofo_shared.dir/link.txt --verbose=1
  457. /usr/bin/x86_64-pc-linux-gnu-g++ -fPIC -march=native -O2 -pipe -Wall -Woverloaded-virtual -Wswitch-enum -Wcast-qual -Wwrite-strings -Wredundant-decls -Wreorder -Wno-deprecated-declarations -Wl,-O1 -Wl,--as-needed -shared -Wl,-soname,libpodofo.so.0.9.6_pre20170508 -o libpodofo.so.0.9.6_pre20170508 CMakeFiles/podofo_shared.dir/base/PdfArray.cpp.o CMakeFiles/podofo_shared.dir/base/PdfCanvas.cpp.o CMakeFiles/podofo_shared.dir/base/PdfColor.cpp.o CMakeFiles/podofo_shared.dir/base/PdfContentsTokenizer.cpp.o CMakeFiles/podofo_shared.dir/base/PdfData.cpp.o CMakeFiles/podofo_shared.dir/base/PdfDataType.cpp.o CMakeFiles/podofo_shared.dir/base/PdfDate.cpp.o CMakeFiles/podofo_shared.dir/base/PdfDictionary.cpp.o CMakeFiles/podofo_shared.dir/base/PdfEncoding.cpp.o CMakeFiles/podofo_shared.dir/base/PdfEncodingFactory.cpp.o CMakeFiles/podofo_shared.dir/base/PdfEncrypt.cpp.o CMakeFiles/podofo_shared.dir/base/PdfError.cpp.o CMakeFiles/podofo_shared.dir/base/PdfFileStream.cpp.o CMakeFiles/podofo_shared.dir/base/PdfFilter.cpp.o CMakeFiles/podofo_shared.dir/base/PdfFiltersPrivate.cpp.o CMakeFiles/podofo_shared.dir/base/PdfImmediateWriter.cpp.o CMakeFiles/podofo_shared.dir/base/PdfInputDevice.cpp.o CMakeFiles/podofo_shared.dir/base/PdfInputStream.cpp.o CMakeFiles/podofo_shared.dir/base/PdfLocale.cpp.o CMakeFiles/podofo_shared.dir/base/PdfMemStream.cpp.o CMakeFiles/podofo_shared.dir/base/PdfMemoryManagement.cpp.o CMakeFiles/podofo_shared.dir/base/PdfName.cpp.o CMakeFiles/podofo_shared.dir/base/PdfObject.cpp.o CMakeFiles/podofo_shared.dir/base/PdfObjectStreamParserObject.cpp.o CMakeFiles/podofo_shared.dir/base/PdfOutputDevice.cpp.o CMakeFiles/podofo_shared.dir/base/PdfOutputStream.cpp.o CMakeFiles/podofo_shared.dir/base/PdfParser.cpp.o CMakeFiles/podofo_shared.dir/base/PdfParserObject.cpp.o CMakeFiles/podofo_shared.dir/base/PdfRect.cpp.o CMakeFiles/podofo_shared.dir/base/PdfRefCountedBuffer.cpp.o CMakeFiles/podofo_shared.dir/base/PdfRefCountedInputDevice.cpp.o CMakeFiles/podofo_shared.dir/base/PdfReference.cpp.o CMakeFiles/podofo_shared.dir/base/PdfStream.cpp.o CMakeFiles/podofo_shared.dir/base/PdfString.cpp.o CMakeFiles/podofo_shared.dir/base/PdfTokenizer.cpp.o CMakeFiles/podofo_shared.dir/base/PdfVariant.cpp.o CMakeFiles/podofo_shared.dir/base/PdfVecObjects.cpp.o CMakeFiles/podofo_shared.dir/base/PdfWriter.cpp.o CMakeFiles/podofo_shared.dir/base/PdfXRef.cpp.o CMakeFiles/podofo_shared.dir/base/PdfXRefStream.cpp.o CMakeFiles/podofo_shared.dir/base/PdfXRefStreamParserObject.cpp.o CMakeFiles/podofo_shared.dir/doc/PdfAcroForm.cpp.o CMakeFiles/podofo_shared.dir/doc/PdfAction.cpp.o CMakeFiles/podofo_shared.dir/doc/PdfAnnotation.cpp.o CMakeFiles/podofo_shared.dir/doc/PdfCMapEncoding.cpp.o CMakeFiles/podofo_shared.dir/doc/PdfContents.cpp.o CMakeFiles/podofo_shared.dir/doc/PdfDestination.cpp.o CMakeFiles/podofo_shared.dir/doc/PdfDifferenceEncoding.cpp.o CMakeFiles/podofo_shared.dir/doc/PdfDocument.cpp.o CMakeFiles/podofo_shared.dir/doc/PdfElement.cpp.o CMakeFiles/podofo_shared.dir/doc/PdfEncodingObjectFactory.cpp.o CMakeFiles/podofo_shared.dir/doc/PdfExtGState.cpp.o CMakeFiles/podofo_shared.dir/doc/PdfField.cpp.o CMakeFiles/podofo_shared.dir/doc/PdfFileSpec.cpp.o CMakeFiles/podofo_shared.dir/doc/PdfFont.cpp.o CMakeFiles/podofo_shared.dir/doc/PdfFontCID.cpp.o CMakeFiles/podofo_shared.dir/doc/PdfFontCache.cpp.o CMakeFiles/podofo_shared.dir/doc/PdfFontConfigWrapper.cpp.o CMakeFiles/podofo_shared.dir/doc/PdfFontFactory.cpp.o CMakeFiles/podofo_shared.dir/doc/PdfFontMetrics.cpp.o CMakeFiles/podofo_shared.dir/doc/PdfFontMetricsBase14.cpp.o CMakeFiles/podofo_shared.dir/doc/PdfFontMetricsFreetype.cpp.o CMakeFiles/podofo_shared.dir/doc/PdfFontMetricsObject.cpp.o CMakeFiles/podofo_shared.dir/doc/PdfFontSimple.cpp.o CMakeFiles/podofo_shared.dir/doc/PdfFontTTFSubset.cpp.o CMakeFiles/podofo_shared.dir/doc/PdfFontTrueType.cpp.o CMakeFiles/podofo_shared.dir/doc/PdfFontType1.cpp.o CMakeFiles/podofo_shared.dir/doc/PdfFontType3.cpp.o CMakeFiles/podofo_shared.dir/doc/PdfFontType1Base14.cpp.o CMakeFiles/podofo_shared.dir/doc/PdfFunction.cpp.o CMakeFiles/podofo_shared.dir/doc/PdfHintStream.cpp.o CMakeFiles/podofo_shared.dir/doc/PdfIdentityEncoding.cpp.o CMakeFiles/podofo_shared.dir/doc/PdfImage.cpp.o CMakeFiles/podofo_shared.dir/doc/PdfInfo.cpp.o CMakeFiles/podofo_shared.dir/doc/PdfMemDocument.cpp.o CMakeFiles/podofo_shared.dir/doc/PdfNamesTree.cpp.o CMakeFiles/podofo_shared.dir/doc/PdfOutlines.cpp.o CMakeFiles/podofo_shared.dir/doc/PdfPage.cpp.o CMakeFiles/podofo_shared.dir/doc/PdfPagesTree.cpp.o CMakeFiles/podofo_shared.dir/doc/PdfPagesTreeCache.cpp.o CMakeFiles/podofo_shared.dir/doc/PdfPainter.cpp.o CMakeFiles/podofo_shared.dir/doc/PdfPainterMM.cpp.o CMakeFiles/podofo_shared.dir/doc/PdfShadingPattern.cpp.o CMakeFiles/podofo_shared.dir/doc/PdfSignOutputDevice.cpp.o CMakeFiles/podofo_shared.dir/doc/PdfSignatureField.cpp.o CMakeFiles/podofo_shared.dir/doc/PdfStreamedDocument.cpp.o CMakeFiles/podofo_shared.dir/doc/PdfTable.cpp.o CMakeFiles/podofo_shared.dir/doc/PdfTilingPattern.cpp.o CMakeFiles/podofo_shared.dir/doc/PdfXObject.cpp.o  -L/var/tmp/portage/app-text/podofo-0.9.6_pre20170508-r1/work/podofo-0.9.6_pre20170508_build/src -Wl,-rpath,/var/tmp/portage/app-text/podofo-0.9.6_pre20170508-r1/work/podofo-0.9.6_pre20170508_build/src: -lfontconfig -lfreetype -lz -lidn -lcrypto -lcrypto -ljpeg -lpthread -lfreetype -lpng -lz -ltiff -lidn -lcrypto -lcrypto -ljpeg -lpthread -lfreetype -lpng -ltiff
  458. cd /var/tmp/portage/app-text/podofo-0.9.6_pre20170508-r1/work/podofo-0.9.6_pre20170508_build/src && /usr/bin/cmake -E cmake_symlink_library libpodofo.so.0.9.6_pre20170508 libpodofo.so.0.9.6_pre20170508 libpodofo.so
  459. make[2]: Leaving directory '/var/tmp/portage/app-text/podofo-0.9.6_pre20170508-r1/work/podofo-0.9.6_pre20170508_build'
  460. [ 52%] Built target podofo_shared
  461. make -f test/ContentParser/CMakeFiles/ContentParser.dir/build.make test/ContentParser/CMakeFiles/ContentParser.dir/depend
  462. make -f test/CreationTest/CMakeFiles/CreationTest.dir/build.make test/CreationTest/CMakeFiles/CreationTest.dir/depend
  463. make -f test/FilterTest/CMakeFiles/FilterTest.dir/build.make test/FilterTest/CMakeFiles/FilterTest.dir/depend
  464. make -f test/FormTest/CMakeFiles/FormTest.dir/build.make test/FormTest/CMakeFiles/FormTest.dir/depend
  465. make[2]: Entering directory '/var/tmp/portage/app-text/podofo-0.9.6_pre20170508-r1/work/podofo-0.9.6_pre20170508_build'
  466. cd /var/tmp/portage/app-text/podofo-0.9.6_pre20170508-r1/work/podofo-0.9.6_pre20170508_build && /usr/bin/cmake -E cmake_depends "Unix Makefiles" /var/tmp/portage/app-text/podofo-0.9.6_pre20170508-r1/work/podofo-0.9.6_pre20170508 /var/tmp/portage/app-text/podofo-0.9.6_pre20170508-r1/work/podofo-0.9.6_pre20170508/test/ContentParser /var/tmp/portage/app-text/podofo-0.9.6_pre20170508-r1/work/podofo-0.9.6_pre20170508_build /var/tmp/portage/app-text/podofo-0.9.6_pre20170508-r1/work/podofo-0.9.6_pre20170508_build/test/ContentParser /var/tmp/portage/app-text/podofo-0.9.6_pre20170508-r1/work/podofo-0.9.6_pre20170508_build/test/ContentParser/CMakeFiles/ContentParser.dir/DependInfo.cmake --color=
  467. make[2]: Entering directory '/var/tmp/portage/app-text/podofo-0.9.6_pre20170508-r1/work/podofo-0.9.6_pre20170508_build'
  468. cd /var/tmp/portage/app-text/podofo-0.9.6_pre20170508-r1/work/podofo-0.9.6_pre20170508_build && /usr/bin/cmake -E cmake_depends "Unix Makefiles" /var/tmp/portage/app-text/podofo-0.9.6_pre20170508-r1/work/podofo-0.9.6_pre20170508 /var/tmp/portage/app-text/podofo-0.9.6_pre20170508-r1/work/podofo-0.9.6_pre20170508/test/CreationTest /var/tmp/portage/app-text/podofo-0.9.6_pre20170508-r1/work/podofo-0.9.6_pre20170508_build /var/tmp/portage/app-text/podofo-0.9.6_pre20170508-r1/work/podofo-0.9.6_pre20170508_build/test/CreationTest /var/tmp/portage/app-text/podofo-0.9.6_pre20170508-r1/work/podofo-0.9.6_pre20170508_build/test/CreationTest/CMakeFiles/CreationTest.dir/DependInfo.cmake --color=
  469. make[2]: Entering directory '/var/tmp/portage/app-text/podofo-0.9.6_pre20170508-r1/work/podofo-0.9.6_pre20170508_build'
  470. cd /var/tmp/portage/app-text/podofo-0.9.6_pre20170508-r1/work/podofo-0.9.6_pre20170508_build && /usr/bin/cmake -E cmake_depends "Unix Makefiles" /var/tmp/portage/app-text/podofo-0.9.6_pre20170508-r1/work/podofo-0.9.6_pre20170508 /var/tmp/portage/app-text/podofo-0.9.6_pre20170508-r1/work/podofo-0.9.6_pre20170508/test/FilterTest /var/tmp/portage/app-text/podofo-0.9.6_pre20170508-r1/work/podofo-0.9.6_pre20170508_build /var/tmp/portage/app-text/podofo-0.9.6_pre20170508-r1/work/podofo-0.9.6_pre20170508_build/test/FilterTest /var/tmp/portage/app-text/podofo-0.9.6_pre20170508-r1/work/podofo-0.9.6_pre20170508_build/test/FilterTest/CMakeFiles/FilterTest.dir/DependInfo.cmake --color=
  471. make -f test/LargeTest/CMakeFiles/LargeTest.dir/build.make test/LargeTest/CMakeFiles/LargeTest.dir/depend
  472. make -f test/ObjectParserTest/CMakeFiles/ObjectParserTest.dir/build.make test/ObjectParserTest/CMakeFiles/ObjectParserTest.dir/depend
  473. make[2]: Entering directory '/var/tmp/portage/app-text/podofo-0.9.6_pre20170508-r1/work/podofo-0.9.6_pre20170508_build'
  474. cd /var/tmp/portage/app-text/podofo-0.9.6_pre20170508-r1/work/podofo-0.9.6_pre20170508_build && /usr/bin/cmake -E cmake_depends "Unix Makefiles" /var/tmp/portage/app-text/podofo-0.9.6_pre20170508-r1/work/podofo-0.9.6_pre20170508 /var/tmp/portage/app-text/podofo-0.9.6_pre20170508-r1/work/podofo-0.9.6_pre20170508/test/FormTest /var/tmp/portage/app-text/podofo-0.9.6_pre20170508-r1/work/podofo-0.9.6_pre20170508_build /var/tmp/portage/app-text/podofo-0.9.6_pre20170508-r1/work/podofo-0.9.6_pre20170508_build/test/FormTest /var/tmp/portage/app-text/podofo-0.9.6_pre20170508-r1/work/podofo-0.9.6_pre20170508_build/test/FormTest/CMakeFiles/FormTest.dir/DependInfo.cmake --color=
  475. make[2]: Entering directory '/var/tmp/portage/app-text/podofo-0.9.6_pre20170508-r1/work/podofo-0.9.6_pre20170508_build'
  476. cd /var/tmp/portage/app-text/podofo-0.9.6_pre20170508-r1/work/podofo-0.9.6_pre20170508_build && /usr/bin/cmake -E cmake_depends "Unix Makefiles" /var/tmp/portage/app-text/podofo-0.9.6_pre20170508-r1/work/podofo-0.9.6_pre20170508 /var/tmp/portage/app-text/podofo-0.9.6_pre20170508-r1/work/podofo-0.9.6_pre20170508/test/LargeTest /var/tmp/portage/app-text/podofo-0.9.6_pre20170508-r1/work/podofo-0.9.6_pre20170508_build /var/tmp/portage/app-text/podofo-0.9.6_pre20170508-r1/work/podofo-0.9.6_pre20170508_build/test/LargeTest /var/tmp/portage/app-text/podofo-0.9.6_pre20170508-r1/work/podofo-0.9.6_pre20170508_build/test/LargeTest/CMakeFiles/LargeTest.dir/DependInfo.cmake --color=
  477. make -f test/ParserTest/CMakeFiles/ParserTest.dir/build.make test/ParserTest/CMakeFiles/ParserTest.dir/depend
  478. make -f test/SignatureTest/CMakeFiles/SignatureTest.dir/build.make test/SignatureTest/CMakeFiles/SignatureTest.dir/depend
  479. make[2]: Entering directory '/var/tmp/portage/app-text/podofo-0.9.6_pre20170508-r1/work/podofo-0.9.6_pre20170508_build'
  480. cd /var/tmp/portage/app-text/podofo-0.9.6_pre20170508-r1/work/podofo-0.9.6_pre20170508_build && /usr/bin/cmake -E cmake_depends "Unix Makefiles" /var/tmp/portage/app-text/podofo-0.9.6_pre20170508-r1/work/podofo-0.9.6_pre20170508 /var/tmp/portage/app-text/podofo-0.9.6_pre20170508-r1/work/podofo-0.9.6_pre20170508/test/ObjectParserTest /var/tmp/portage/app-text/podofo-0.9.6_pre20170508-r1/work/podofo-0.9.6_pre20170508_build /var/tmp/portage/app-text/podofo-0.9.6_pre20170508-r1/work/podofo-0.9.6_pre20170508_build/test/ObjectParserTest /var/tmp/portage/app-text/podofo-0.9.6_pre20170508-r1/work/podofo-0.9.6_pre20170508_build/test/ObjectParserTest/CMakeFiles/ObjectParserTest.dir/DependInfo.cmake --color=
  481. Dependee "/var/tmp/portage/app-text/podofo-0.9.6_pre20170508-r1/work/podofo-0.9.6_pre20170508_build/test/FilterTest/CMakeFiles/FilterTest.dir/DependInfo.cmake" is newer than depender "/var/tmp/portage/app-text/podofo-0.9.6_pre20170508-r1/work/podofo-0.9.6_pre20170508_build/test/FilterTest/CMakeFiles/FilterTest.dir/depend.internal".
  482. Dependee "/var/tmp/portage/app-text/podofo-0.9.6_pre20170508-r1/work/podofo-0.9.6_pre20170508_build/test/FilterTest/CMakeFiles/CMakeDirectoryInformation.cmake" is newer than depender "/var/tmp/portage/app-text/podofo-0.9.6_pre20170508-r1/work/podofo-0.9.6_pre20170508_build/test/FilterTest/CMakeFiles/FilterTest.dir/depend.internal".
  483. Scanning dependencies of target FilterTest
  484. make[2]: Entering directory '/var/tmp/portage/app-text/podofo-0.9.6_pre20170508-r1/work/podofo-0.9.6_pre20170508_build'
  485. cd /var/tmp/portage/app-text/podofo-0.9.6_pre20170508-r1/work/podofo-0.9.6_pre20170508_build && /usr/bin/cmake -E cmake_depends "Unix Makefiles" /var/tmp/portage/app-text/podofo-0.9.6_pre20170508-r1/work/podofo-0.9.6_pre20170508 /var/tmp/portage/app-text/podofo-0.9.6_pre20170508-r1/work/podofo-0.9.6_pre20170508/test/ParserTest /var/tmp/portage/app-text/podofo-0.9.6_pre20170508-r1/work/podofo-0.9.6_pre20170508_build /var/tmp/portage/app-text/podofo-0.9.6_pre20170508-r1/work/podofo-0.9.6_pre20170508_build/test/ParserTest /var/tmp/portage/app-text/podofo-0.9.6_pre20170508-r1/work/podofo-0.9.6_pre20170508_build/test/ParserTest/CMakeFiles/ParserTest.dir/DependInfo.cmake --color=
  486. Dependee "/var/tmp/portage/app-text/podofo-0.9.6_pre20170508-r1/work/podofo-0.9.6_pre20170508_build/test/ContentParser/CMakeFiles/ContentParser.dir/DependInfo.cmake" is newer than depender "/var/tmp/portage/app-text/podofo-0.9.6_pre20170508-r1/work/podofo-0.9.6_pre20170508_build/test/ContentParser/CMakeFiles/ContentParser.dir/depend.internal".
  487. Dependee "/var/tmp/portage/app-text/podofo-0.9.6_pre20170508-r1/work/podofo-0.9.6_pre20170508_build/test/ContentParser/CMakeFiles/CMakeDirectoryInformation.cmake" is newer than depender "/var/tmp/portage/app-text/podofo-0.9.6_pre20170508-r1/work/podofo-0.9.6_pre20170508_build/test/ContentParser/CMakeFiles/ContentParser.dir/depend.internal".
  488. Scanning dependencies of target ContentParser
  489. Dependee "/var/tmp/portage/app-text/podofo-0.9.6_pre20170508-r1/work/podofo-0.9.6_pre20170508_build/test/CreationTest/CMakeFiles/CreationTest.dir/DependInfo.cmake" is newer than depender "/var/tmp/portage/app-text/podofo-0.9.6_pre20170508-r1/work/podofo-0.9.6_pre20170508_build/test/CreationTest/CMakeFiles/CreationTest.dir/depend.internal".
  490. make[2]: Entering directory '/var/tmp/portage/app-text/podofo-0.9.6_pre20170508-r1/work/podofo-0.9.6_pre20170508_build'
  491. cd /var/tmp/portage/app-text/podofo-0.9.6_pre20170508-r1/work/podofo-0.9.6_pre20170508_build && /usr/bin/cmake -E cmake_depends "Unix Makefiles" /var/tmp/portage/app-text/podofo-0.9.6_pre20170508-r1/work/podofo-0.9.6_pre20170508 /var/tmp/portage/app-text/podofo-0.9.6_pre20170508-r1/work/podofo-0.9.6_pre20170508/test/SignatureTest /var/tmp/portage/app-text/podofo-0.9.6_pre20170508-r1/work/podofo-0.9.6_pre20170508_build /var/tmp/portage/app-text/podofo-0.9.6_pre20170508-r1/work/podofo-0.9.6_pre20170508_build/test/SignatureTest /var/tmp/portage/app-text/podofo-0.9.6_pre20170508-r1/work/podofo-0.9.6_pre20170508_build/test/SignatureTest/CMakeFiles/SignatureTest.dir/DependInfo.cmake --color=
  492. Dependee "/var/tmp/portage/app-text/podofo-0.9.6_pre20170508-r1/work/podofo-0.9.6_pre20170508_build/test/CreationTest/CMakeFiles/CMakeDirectoryInformation.cmake" is newer than depender "/var/tmp/portage/app-text/podofo-0.9.6_pre20170508-r1/work/podofo-0.9.6_pre20170508_build/test/CreationTest/CMakeFiles/CreationTest.dir/depend.internal".
  493. Scanning dependencies of target CreationTest
  494. Dependee "/var/tmp/portage/app-text/podofo-0.9.6_pre20170508-r1/work/podofo-0.9.6_pre20170508_build/test/LargeTest/CMakeFiles/LargeTest.dir/DependInfo.cmake" is newer than depender "/var/tmp/portage/app-text/podofo-0.9.6_pre20170508-r1/work/podofo-0.9.6_pre20170508_build/test/LargeTest/CMakeFiles/LargeTest.dir/depend.internal".
  495. Dependee "/var/tmp/portage/app-text/podofo-0.9.6_pre20170508-r1/work/podofo-0.9.6_pre20170508_build/test/LargeTest/CMakeFiles/CMakeDirectoryInformation.cmake" is newer than depender "/var/tmp/portage/app-text/podofo-0.9.6_pre20170508-r1/work/podofo-0.9.6_pre20170508_build/test/LargeTest/CMakeFiles/LargeTest.dir/depend.internal".
  496. Scanning dependencies of target LargeTest
  497. Dependee "/var/tmp/portage/app-text/podofo-0.9.6_pre20170508-r1/work/podofo-0.9.6_pre20170508_build/test/FormTest/CMakeFiles/FormTest.dir/DependInfo.cmake" is newer than depender "/var/tmp/portage/app-text/podofo-0.9.6_pre20170508-r1/work/podofo-0.9.6_pre20170508_build/test/FormTest/CMakeFiles/FormTest.dir/depend.internal".
  498. Dependee "/var/tmp/portage/app-text/podofo-0.9.6_pre20170508-r1/work/podofo-0.9.6_pre20170508_build/test/FormTest/CMakeFiles/CMakeDirectoryInformation.cmake" is newer than depender "/var/tmp/portage/app-text/podofo-0.9.6_pre20170508-r1/work/podofo-0.9.6_pre20170508_build/test/FormTest/CMakeFiles/FormTest.dir/depend.internal".
  499. Scanning dependencies of target FormTest
  500. Dependee "/var/tmp/portage/app-text/podofo-0.9.6_pre20170508-r1/work/podofo-0.9.6_pre20170508_build/test/ParserTest/CMakeFiles/ParserTest.dir/DependInfo.cmake" is newer than depender "/var/tmp/portage/app-text/podofo-0.9.6_pre20170508-r1/work/podofo-0.9.6_pre20170508_build/test/ParserTest/CMakeFiles/ParserTest.dir/depend.internal".
  501. Dependee "/var/tmp/portage/app-text/podofo-0.9.6_pre20170508-r1/work/podofo-0.9.6_pre20170508_build/test/ParserTest/CMakeFiles/CMakeDirectoryInformation.cmake" is newer than depender "/var/tmp/portage/app-text/podofo-0.9.6_pre20170508-r1/work/podofo-0.9.6_pre20170508_build/test/ParserTest/CMakeFiles/ParserTest.dir/depend.internal".
  502. Scanning dependencies of target ParserTest
  503. Dependee "/var/tmp/portage/app-text/podofo-0.9.6_pre20170508-r1/work/podofo-0.9.6_pre20170508_build/test/ObjectParserTest/CMakeFiles/ObjectParserTest.dir/DependInfo.cmake" is newer than depender "/var/tmp/portage/app-text/podofo-0.9.6_pre20170508-r1/work/podofo-0.9.6_pre20170508_build/test/ObjectParserTest/CMakeFiles/ObjectParserTest.dir/depend.internal".
  504. Dependee "/var/tmp/portage/app-text/podofo-0.9.6_pre20170508-r1/work/podofo-0.9.6_pre20170508_build/test/ObjectParserTest/CMakeFiles/CMakeDirectoryInformation.cmake" is newer than depender "/var/tmp/portage/app-text/podofo-0.9.6_pre20170508-r1/work/podofo-0.9.6_pre20170508_build/test/ObjectParserTest/CMakeFiles/ObjectParserTest.dir/depend.internal".
  505. Scanning dependencies of target ObjectParserTest
  506. Dependee "/var/tmp/portage/app-text/podofo-0.9.6_pre20170508-r1/work/podofo-0.9.6_pre20170508_build/test/SignatureTest/CMakeFiles/SignatureTest.dir/DependInfo.cmake" is newer than depender "/var/tmp/portage/app-text/podofo-0.9.6_pre20170508-r1/work/podofo-0.9.6_pre20170508_build/test/SignatureTest/CMakeFiles/SignatureTest.dir/depend.internal".
  507. Dependee "/var/tmp/portage/app-text/podofo-0.9.6_pre20170508-r1/work/podofo-0.9.6_pre20170508_build/test/SignatureTest/CMakeFiles/CMakeDirectoryInformation.cmake" is newer than depender "/var/tmp/portage/app-text/podofo-0.9.6_pre20170508-r1/work/podofo-0.9.6_pre20170508_build/test/SignatureTest/CMakeFiles/SignatureTest.dir/depend.internal".
  508. Scanning dependencies of target SignatureTest
  509. make[2]: Leaving directory '/var/tmp/portage/app-text/podofo-0.9.6_pre20170508-r1/work/podofo-0.9.6_pre20170508_build'
  510. make -f test/FilterTest/CMakeFiles/FilterTest.dir/build.make test/FilterTest/CMakeFiles/FilterTest.dir/build
  511. make[2]: Leaving directory '/var/tmp/portage/app-text/podofo-0.9.6_pre20170508-r1/work/podofo-0.9.6_pre20170508_build'
  512. make -f test/ParserTest/CMakeFiles/ParserTest.dir/build.make test/ParserTest/CMakeFiles/ParserTest.dir/build
  513. make[2]: Leaving directory '/var/tmp/portage/app-text/podofo-0.9.6_pre20170508-r1/work/podofo-0.9.6_pre20170508_build'
  514. make -f test/FormTest/CMakeFiles/FormTest.dir/build.make test/FormTest/CMakeFiles/FormTest.dir/build
  515. make[2]: Leaving directory '/var/tmp/portage/app-text/podofo-0.9.6_pre20170508-r1/work/podofo-0.9.6_pre20170508_build'
  516. make[2]: Entering directory '/var/tmp/portage/app-text/podofo-0.9.6_pre20170508-r1/work/podofo-0.9.6_pre20170508_build'
  517. make -f test/ContentParser/CMakeFiles/ContentParser.dir/build.make test/ContentParser/CMakeFiles/ContentParser.dir/build
  518. make[2]: Leaving directory '/var/tmp/portage/app-text/podofo-0.9.6_pre20170508-r1/work/podofo-0.9.6_pre20170508_build'
  519. make[2]: Entering directory '/var/tmp/portage/app-text/podofo-0.9.6_pre20170508-r1/work/podofo-0.9.6_pre20170508_build'
  520. make[2]: Entering directory '/var/tmp/portage/app-text/podofo-0.9.6_pre20170508-r1/work/podofo-0.9.6_pre20170508_build'
  521. make -f test/CreationTest/CMakeFiles/CreationTest.dir/build.make test/CreationTest/CMakeFiles/CreationTest.dir/build
  522. make[2]: Leaving directory '/var/tmp/portage/app-text/podofo-0.9.6_pre20170508-r1/work/podofo-0.9.6_pre20170508_build'
  523. make[2]: Leaving directory '/var/tmp/portage/app-text/podofo-0.9.6_pre20170508-r1/work/podofo-0.9.6_pre20170508_build'
  524. make[2]: Entering directory '/var/tmp/portage/app-text/podofo-0.9.6_pre20170508-r1/work/podofo-0.9.6_pre20170508_build'
  525. [ 53%] Building CXX object test/ParserTest/CMakeFiles/ParserTest.dir/ParserTest.cpp.o
  526. cd /var/tmp/portage/app-text/podofo-0.9.6_pre20170508-r1/work/podofo-0.9.6_pre20170508_build/test/ParserTest && /usr/bin/x86_64-pc-linux-gnu-g++  -I/var/tmp/portage/app-text/podofo-0.9.6_pre20170508-r1/work/podofo-0.9.6_pre20170508_build -I/var/tmp/portage/app-text/podofo-0.9.6_pre20170508-r1/work/podofo-0.9.6_pre20170508 -I/var/tmp/portage/app-text/podofo-0.9.6_pre20170508-r1/work/podofo-0.9.6_pre20170508/src -I/usr/include/freetype2   -DNDEBUG -march=native -O2 -pipe -Wall -Woverloaded-virtual -Wswitch-enum -Wcast-qual -Wwrite-strings -Wredundant-decls -Wreorder -Wno-deprecated-declarations   -W -o CMakeFiles/ParserTest.dir/ParserTest.cpp.o -c /var/tmp/portage/app-text/podofo-0.9.6_pre20170508-r1/work/podofo-0.9.6_pre20170508/test/ParserTest/ParserTest.cpp
  527. make[2]: Leaving directory '/var/tmp/portage/app-text/podofo-0.9.6_pre20170508-r1/work/podofo-0.9.6_pre20170508_build'
  528. make -f test/LargeTest/CMakeFiles/LargeTest.dir/build.make test/LargeTest/CMakeFiles/LargeTest.dir/build
  529. [ 54%] Building CXX object test/FormTest/CMakeFiles/FormTest.dir/FormTest.cpp.o
  530. cd /var/tmp/portage/app-text/podofo-0.9.6_pre20170508-r1/work/podofo-0.9.6_pre20170508_build/test/FormTest && /usr/bin/x86_64-pc-linux-gnu-g++  -I/var/tmp/portage/app-text/podofo-0.9.6_pre20170508-r1/work/podofo-0.9.6_pre20170508_build -I/var/tmp/portage/app-text/podofo-0.9.6_pre20170508-r1/work/podofo-0.9.6_pre20170508 -I/var/tmp/portage/app-text/podofo-0.9.6_pre20170508-r1/work/podofo-0.9.6_pre20170508/src -I/usr/include/freetype2   -DNDEBUG -march=native -O2 -pipe -Wall -Woverloaded-virtual -Wswitch-enum -Wcast-qual -Wwrite-strings -Wredundant-decls -Wreorder -Wno-deprecated-declarations   -W -o CMakeFiles/FormTest.dir/FormTest.cpp.o -c /var/tmp/portage/app-text/podofo-0.9.6_pre20170508-r1/work/podofo-0.9.6_pre20170508/test/FormTest/FormTest.cpp
  531. make -f test/ObjectParserTest/CMakeFiles/ObjectParserTest.dir/build.make test/ObjectParserTest/CMakeFiles/ObjectParserTest.dir/build
  532. make -f test/SignatureTest/CMakeFiles/SignatureTest.dir/build.make test/SignatureTest/CMakeFiles/SignatureTest.dir/build
  533. [ 54%] Building CXX object test/FilterTest/CMakeFiles/FilterTest.dir/FilterTest.cpp.o
  534. cd /var/tmp/portage/app-text/podofo-0.9.6_pre20170508-r1/work/podofo-0.9.6_pre20170508_build/test/FilterTest && /usr/bin/x86_64-pc-linux-gnu-g++  -I/var/tmp/portage/app-text/podofo-0.9.6_pre20170508-r1/work/podofo-0.9.6_pre20170508_build -I/var/tmp/portage/app-text/podofo-0.9.6_pre20170508-r1/work/podofo-0.9.6_pre20170508 -I/var/tmp/portage/app-text/podofo-0.9.6_pre20170508-r1/work/podofo-0.9.6_pre20170508/src -I/usr/include/freetype2   -DNDEBUG -march=native -O2 -pipe -Wall -Woverloaded-virtual -Wswitch-enum -Wcast-qual -Wwrite-strings -Wredundant-decls -Wreorder -Wno-deprecated-declarations   -W -o CMakeFiles/FilterTest.dir/FilterTest.cpp.o -c /var/tmp/portage/app-text/podofo-0.9.6_pre20170508-r1/work/podofo-0.9.6_pre20170508/test/FilterTest/FilterTest.cpp
  535. make[2]: Entering directory '/var/tmp/portage/app-text/podofo-0.9.6_pre20170508-r1/work/podofo-0.9.6_pre20170508_build'
  536. make[2]: Entering directory '/var/tmp/portage/app-text/podofo-0.9.6_pre20170508-r1/work/podofo-0.9.6_pre20170508_build'
  537. make[2]: Entering directory '/var/tmp/portage/app-text/podofo-0.9.6_pre20170508-r1/work/podofo-0.9.6_pre20170508_build'
  538. [ 54%] Building CXX object test/ContentParser/CMakeFiles/ContentParser.dir/main.cpp.o
  539. cd /var/tmp/portage/app-text/podofo-0.9.6_pre20170508-r1/work/podofo-0.9.6_pre20170508_build/test/ContentParser && /usr/bin/x86_64-pc-linux-gnu-g++  -I/var/tmp/portage/app-text/podofo-0.9.6_pre20170508-r1/work/podofo-0.9.6_pre20170508_build -I/var/tmp/portage/app-text/podofo-0.9.6_pre20170508-r1/work/podofo-0.9.6_pre20170508 -I/var/tmp/portage/app-text/podofo-0.9.6_pre20170508-r1/work/podofo-0.9.6_pre20170508/src -I/usr/include/freetype2   -DNDEBUG -march=native -O2 -pipe -Wall -Woverloaded-virtual -Wswitch-enum -Wcast-qual -Wwrite-strings -Wredundant-decls -Wreorder -Wno-deprecated-declarations   -W -o CMakeFiles/ContentParser.dir/main.cpp.o -c /var/tmp/portage/app-text/podofo-0.9.6_pre20170508-r1/work/podofo-0.9.6_pre20170508/test/ContentParser/main.cpp
  540. make[2]: Entering directory '/var/tmp/portage/app-text/podofo-0.9.6_pre20170508-r1/work/podofo-0.9.6_pre20170508_build'
  541. [ 55%] Building CXX object test/LargeTest/CMakeFiles/LargeTest.dir/LargeTest.cpp.o
  542. cd /var/tmp/portage/app-text/podofo-0.9.6_pre20170508-r1/work/podofo-0.9.6_pre20170508_build/test/LargeTest && /usr/bin/x86_64-pc-linux-gnu-g++  -I/var/tmp/portage/app-text/podofo-0.9.6_pre20170508-r1/work/podofo-0.9.6_pre20170508_build -I/var/tmp/portage/app-text/podofo-0.9.6_pre20170508-r1/work/podofo-0.9.6_pre20170508 -I/var/tmp/portage/app-text/podofo-0.9.6_pre20170508-r1/work/podofo-0.9.6_pre20170508/src -I/usr/include/freetype2   -DNDEBUG -march=native -O2 -pipe -Wall -Woverloaded-virtual -Wswitch-enum -Wcast-qual -Wwrite-strings -Wredundant-decls -Wreorder -Wno-deprecated-declarations   -W -o CMakeFiles/LargeTest.dir/LargeTest.cpp.o -c /var/tmp/portage/app-text/podofo-0.9.6_pre20170508-r1/work/podofo-0.9.6_pre20170508/test/LargeTest/LargeTest.cpp
  543. [ 55%] Building CXX object test/CreationTest/CMakeFiles/CreationTest.dir/CreationTest.cpp.o
  544. [ 55%] Building CXX object test/SignatureTest/CMakeFiles/SignatureTest.dir/SignTest.cpp.o
  545. cd /var/tmp/portage/app-text/podofo-0.9.6_pre20170508-r1/work/podofo-0.9.6_pre20170508_build/test/CreationTest && /usr/bin/x86_64-pc-linux-gnu-g++  -I/var/tmp/portage/app-text/podofo-0.9.6_pre20170508-r1/work/podofo-0.9.6_pre20170508_build -I/var/tmp/portage/app-text/podofo-0.9.6_pre20170508-r1/work/podofo-0.9.6_pre20170508 -I/var/tmp/portage/app-text/podofo-0.9.6_pre20170508-r1/work/podofo-0.9.6_pre20170508/src -I/usr/include/freetype2   -DNDEBUG -march=native -O2 -pipe -Wall -Woverloaded-virtual -Wswitch-enum -Wcast-qual -Wwrite-strings -Wredundant-decls -Wreorder -Wno-deprecated-declarations   -W -o CMakeFiles/CreationTest.dir/CreationTest.cpp.o -c /var/tmp/portage/app-text/podofo-0.9.6_pre20170508-r1/work/podofo-0.9.6_pre20170508/test/CreationTest/CreationTest.cpp
  546. cd /var/tmp/portage/app-text/podofo-0.9.6_pre20170508-r1/work/podofo-0.9.6_pre20170508_build/test/SignatureTest && /usr/bin/x86_64-pc-linux-gnu-g++  -I/var/tmp/portage/app-text/podofo-0.9.6_pre20170508-r1/work/podofo-0.9.6_pre20170508_build -I/var/tmp/portage/app-text/podofo-0.9.6_pre20170508-r1/work/podofo-0.9.6_pre20170508 -I/var/tmp/portage/app-text/podofo-0.9.6_pre20170508-r1/work/podofo-0.9.6_pre20170508/src -I/usr/include/freetype2   -DNDEBUG -march=native -O2 -pipe -Wall -Woverloaded-virtual -Wswitch-enum -Wcast-qual -Wwrite-strings -Wredundant-decls -Wreorder -Wno-deprecated-declarations   -W -o CMakeFiles/SignatureTest.dir/SignTest.cpp.o -c /var/tmp/portage/app-text/podofo-0.9.6_pre20170508-r1/work/podofo-0.9.6_pre20170508/test/SignatureTest/SignTest.cpp
  547. [ 56%] Building CXX object test/ObjectParserTest/CMakeFiles/ObjectParserTest.dir/ObjectParserTest.cpp.o
  548. cd /var/tmp/portage/app-text/podofo-0.9.6_pre20170508-r1/work/podofo-0.9.6_pre20170508_build/test/ObjectParserTest && /usr/bin/x86_64-pc-linux-gnu-g++  -I/var/tmp/portage/app-text/podofo-0.9.6_pre20170508-r1/work/podofo-0.9.6_pre20170508_build -I/var/tmp/portage/app-text/podofo-0.9.6_pre20170508-r1/work/podofo-0.9.6_pre20170508 -I/var/tmp/portage/app-text/podofo-0.9.6_pre20170508-r1/work/podofo-0.9.6_pre20170508/src -I/usr/include/freetype2   -DNDEBUG -march=native -O2 -pipe -Wall -Woverloaded-virtual -Wswitch-enum -Wcast-qual -Wwrite-strings -Wredundant-decls -Wreorder -Wno-deprecated-declarations   -W -o CMakeFiles/ObjectParserTest.dir/ObjectParserTest.cpp.o -c /var/tmp/portage/app-text/podofo-0.9.6_pre20170508-r1/work/podofo-0.9.6_pre20170508/test/ObjectParserTest/ObjectParserTest.cpp
  549. [ 57%] Linking CXX executable ParserTest
  550. cd /var/tmp/portage/app-text/podofo-0.9.6_pre20170508-r1/work/podofo-0.9.6_pre20170508_build/test/ParserTest && /usr/bin/cmake -E cmake_link_script CMakeFiles/ParserTest.dir/link.txt --verbose=1
  551. /usr/bin/x86_64-pc-linux-gnu-g++  -march=native -O2 -pipe -Wall -Woverloaded-virtual -Wswitch-enum -Wcast-qual -Wwrite-strings -Wredundant-decls -Wreorder -Wno-deprecated-declarations  -Wl,-O1 -Wl,--as-needed -rdynamic CMakeFiles/ParserTest.dir/ParserTest.cpp.o  -o ParserTest  -L/var/tmp/portage/app-text/podofo-0.9.6_pre20170508-r1/work/podofo-0.9.6_pre20170508_build/src -Wl,-rpath,/var/tmp/portage/app-text/podofo-0.9.6_pre20170508-r1/work/podofo-0.9.6_pre20170508_build/src -lpodofo -lfontconfig -lfreetype -lz -lidn -lcrypto -lcrypto -ljpeg -lpthread -lfreetype -lpng -lz -ltiff -lidn -lcrypto -lcrypto -ljpeg -lpthread -lfreetype -lpng -ltiff
  552. make[2]: Leaving directory '/var/tmp/portage/app-text/podofo-0.9.6_pre20170508-r1/work/podofo-0.9.6_pre20170508_build'
  553. [ 57%] Built target ParserTest
  554. make -f test/TokenizerTest/CMakeFiles/TokenizerTest.dir/build.make test/TokenizerTest/CMakeFiles/TokenizerTest.dir/depend
  555. make[2]: Entering directory '/var/tmp/portage/app-text/podofo-0.9.6_pre20170508-r1/work/podofo-0.9.6_pre20170508_build'
  556. cd /var/tmp/portage/app-text/podofo-0.9.6_pre20170508-r1/work/podofo-0.9.6_pre20170508_build && /usr/bin/cmake -E cmake_depends "Unix Makefiles" /var/tmp/portage/app-text/podofo-0.9.6_pre20170508-r1/work/podofo-0.9.6_pre20170508 /var/tmp/portage/app-text/podofo-0.9.6_pre20170508-r1/work/podofo-0.9.6_pre20170508/test/TokenizerTest /var/tmp/portage/app-text/podofo-0.9.6_pre20170508-r1/work/podofo-0.9.6_pre20170508_build /var/tmp/portage/app-text/podofo-0.9.6_pre20170508-r1/work/podofo-0.9.6_pre20170508_build/test/TokenizerTest /var/tmp/portage/app-text/podofo-0.9.6_pre20170508-r1/work/podofo-0.9.6_pre20170508_build/test/TokenizerTest/CMakeFiles/TokenizerTest.dir/DependInfo.cmake --color=
  557. Dependee "/var/tmp/portage/app-text/podofo-0.9.6_pre20170508-r1/work/podofo-0.9.6_pre20170508_build/test/TokenizerTest/CMakeFiles/TokenizerTest.dir/DependInfo.cmake" is newer than depender "/var/tmp/portage/app-text/podofo-0.9.6_pre20170508-r1/work/podofo-0.9.6_pre20170508_build/test/TokenizerTest/CMakeFiles/TokenizerTest.dir/depend.internal".
  558. Dependee "/var/tmp/portage/app-text/podofo-0.9.6_pre20170508-r1/work/podofo-0.9.6_pre20170508_build/test/TokenizerTest/CMakeFiles/CMakeDirectoryInformation.cmake" is newer than depender "/var/tmp/portage/app-text/podofo-0.9.6_pre20170508-r1/work/podofo-0.9.6_pre20170508_build/test/TokenizerTest/CMakeFiles/TokenizerTest.dir/depend.internal".
  559. Scanning dependencies of target TokenizerTest
  560. make[2]: Leaving directory '/var/tmp/portage/app-text/podofo-0.9.6_pre20170508-r1/work/podofo-0.9.6_pre20170508_build'
  561. make -f test/TokenizerTest/CMakeFiles/TokenizerTest.dir/build.make test/TokenizerTest/CMakeFiles/TokenizerTest.dir/build
  562. make[2]: Entering directory '/var/tmp/portage/app-text/podofo-0.9.6_pre20170508-r1/work/podofo-0.9.6_pre20170508_build'
  563. [ 57%] Building CXX object test/TokenizerTest/CMakeFiles/TokenizerTest.dir/TokenizerTest.cpp.o
  564. cd /var/tmp/portage/app-text/podofo-0.9.6_pre20170508-r1/work/podofo-0.9.6_pre20170508_build/test/TokenizerTest && /usr/bin/x86_64-pc-linux-gnu-g++  -I/var/tmp/portage/app-text/podofo-0.9.6_pre20170508-r1/work/podofo-0.9.6_pre20170508_build -I/var/tmp/portage/app-text/podofo-0.9.6_pre20170508-r1/work/podofo-0.9.6_pre20170508 -I/var/tmp/portage/app-text/podofo-0.9.6_pre20170508-r1/work/podofo-0.9.6_pre20170508/src -I/usr/include/freetype2   -DNDEBUG -march=native -O2 -pipe -Wall -Woverloaded-virtual -Wswitch-enum -Wcast-qual -Wwrite-strings -Wredundant-decls -Wreorder -Wno-deprecated-declarations   -W -o CMakeFiles/TokenizerTest.dir/TokenizerTest.cpp.o -c /var/tmp/portage/app-text/podofo-0.9.6_pre20170508-r1/work/podofo-0.9.6_pre20170508/test/TokenizerTest/TokenizerTest.cpp
  565. [ 57%] Linking CXX executable LargeTest
  566. cd /var/tmp/portage/app-text/podofo-0.9.6_pre20170508-r1/work/podofo-0.9.6_pre20170508_build/test/LargeTest && /usr/bin/cmake -E cmake_link_script CMakeFiles/LargeTest.dir/link.txt --verbose=1
  567. [ 58%] Linking CXX executable FilterTest
  568. cd /var/tmp/portage/app-text/podofo-0.9.6_pre20170508-r1/work/podofo-0.9.6_pre20170508_build/test/FilterTest && /usr/bin/cmake -E cmake_link_script CMakeFiles/FilterTest.dir/link.txt --verbose=1
  569. /usr/bin/x86_64-pc-linux-gnu-g++  -march=native -O2 -pipe -Wall -Woverloaded-virtual -Wswitch-enum -Wcast-qual -Wwrite-strings -Wredundant-decls -Wreorder -Wno-deprecated-declarations  -Wl,-O1 -Wl,--as-needed -rdynamic CMakeFiles/LargeTest.dir/LargeTest.cpp.o  -o LargeTest  -L/var/tmp/portage/app-text/podofo-0.9.6_pre20170508-r1/work/podofo-0.9.6_pre20170508_build/src -Wl,-rpath,/var/tmp/portage/app-text/podofo-0.9.6_pre20170508-r1/work/podofo-0.9.6_pre20170508_build/src -lpodofo -lfontconfig -lfreetype -lz -lidn -lcrypto -lcrypto -ljpeg -lpthread -lfreetype -lpng -lz -ltiff -lfontconfig -lfreetype -lz -lidn -lcrypto -lcrypto -ljpeg -lpthread -lfreetype -lpng -lz -ltiff
  570. [ 59%] Linking CXX executable SignatureTest
  571. cd /var/tmp/portage/app-text/podofo-0.9.6_pre20170508-r1/work/podofo-0.9.6_pre20170508_build/test/SignatureTest && /usr/bin/cmake -E cmake_link_script CMakeFiles/SignatureTest.dir/link.txt --verbose=1
  572. /usr/bin/x86_64-pc-linux-gnu-g++  -march=native -O2 -pipe -Wall -Woverloaded-virtual -Wswitch-enum -Wcast-qual -Wwrite-strings -Wredundant-decls -Wreorder -Wno-deprecated-declarations  -Wl,-O1 -Wl,--as-needed -rdynamic CMakeFiles/FilterTest.dir/FilterTest.cpp.o  -o FilterTest  -L/var/tmp/portage/app-text/podofo-0.9.6_pre20170508-r1/work/podofo-0.9.6_pre20170508_build/src -Wl,-rpath,/var/tmp/portage/app-text/podofo-0.9.6_pre20170508-r1/work/podofo-0.9.6_pre20170508_build/src -lpodofo -lfontconfig -lfreetype -lz -lidn -lcrypto -lcrypto -ljpeg -lpthread -lfreetype -lpng -lz -ltiff -lfontconfig -lfreetype -lz -lidn -lcrypto -lcrypto -ljpeg -lpthread -lfreetype -lpng -lz -ltiff
  573. /usr/bin/x86_64-pc-linux-gnu-g++  -march=native -O2 -pipe -Wall -Woverloaded-virtual -Wswitch-enum -Wcast-qual -Wwrite-strings -Wredundant-decls -Wreorder -Wno-deprecated-declarations  -Wl,-O1 -Wl,--as-needed -rdynamic CMakeFiles/SignatureTest.dir/SignTest.cpp.o  -o SignatureTest  -L/var/tmp/portage/app-text/podofo-0.9.6_pre20170508-r1/work/podofo-0.9.6_pre20170508_build/src -Wl,-rpath,/var/tmp/portage/app-text/podofo-0.9.6_pre20170508-r1/work/podofo-0.9.6_pre20170508_build/src -lpodofo -lfontconfig -lfreetype -lz -lidn -lcrypto -lcrypto -ljpeg -lpthread -lfreetype -lpng -lz -ltiff -lfontconfig -lfreetype -lz -lidn -lcrypto -lcrypto -ljpeg -lpthread -lfreetype -lpng -lz -ltiff
  574. make[2]: Leaving directory '/var/tmp/portage/app-text/podofo-0.9.6_pre20170508-r1/work/podofo-0.9.6_pre20170508_build'
  575. make[2]: Leaving directory '/var/tmp/portage/app-text/podofo-0.9.6_pre20170508-r1/work/podofo-0.9.6_pre20170508_build'
  576. make[2]: Leaving directory '/var/tmp/portage/app-text/podofo-0.9.6_pre20170508-r1/work/podofo-0.9.6_pre20170508_build'
  577. [ 59%] Built target LargeTest
  578. make -f test/VariantTest/CMakeFiles/VariantTest.dir/build.make test/VariantTest/CMakeFiles/VariantTest.dir/depend
  579. make[2]: Entering directory '/var/tmp/portage/app-text/podofo-0.9.6_pre20170508-r1/work/podofo-0.9.6_pre20170508_build'
  580. cd /var/tmp/portage/app-text/podofo-0.9.6_pre20170508-r1/work/podofo-0.9.6_pre20170508_build && /usr/bin/cmake -E cmake_depends "Unix Makefiles" /var/tmp/portage/app-text/podofo-0.9.6_pre20170508-r1/work/podofo-0.9.6_pre20170508 /var/tmp/portage/app-text/podofo-0.9.6_pre20170508-r1/work/podofo-0.9.6_pre20170508/test/VariantTest /var/tmp/portage/app-text/podofo-0.9.6_pre20170508-r1/work/podofo-0.9.6_pre20170508_build /var/tmp/portage/app-text/podofo-0.9.6_pre20170508-r1/work/podofo-0.9.6_pre20170508_build/test/VariantTest /var/tmp/portage/app-text/podofo-0.9.6_pre20170508-r1/work/podofo-0.9.6_pre20170508_build/test/VariantTest/CMakeFiles/VariantTest.dir/DependInfo.cmake --color=
  581. [ 59%] Built target SignatureTest
  582. make -f test/WatermarkTest/CMakeFiles/WatermarkTest.dir/build.make test/WatermarkTest/CMakeFiles/WatermarkTest.dir/depend
  583. [ 59%] Built target FilterTest
  584. make -f tools/podofobox/CMakeFiles/podofobox.dir/build.make tools/podofobox/CMakeFiles/podofobox.dir/depend
  585. make[2]: Entering directory '/var/tmp/portage/app-text/podofo-0.9.6_pre20170508-r1/work/podofo-0.9.6_pre20170508_build'
  586. cd /var/tmp/portage/app-text/podofo-0.9.6_pre20170508-r1/work/podofo-0.9.6_pre20170508_build && /usr/bin/cmake -E cmake_depends "Unix Makefiles" /var/tmp/portage/app-text/podofo-0.9.6_pre20170508-r1/work/podofo-0.9.6_pre20170508 /var/tmp/portage/app-text/podofo-0.9.6_pre20170508-r1/work/podofo-0.9.6_pre20170508/test/WatermarkTest /var/tmp/portage/app-text/podofo-0.9.6_pre20170508-r1/work/podofo-0.9.6_pre20170508_build /var/tmp/portage/app-text/podofo-0.9.6_pre20170508-r1/work/podofo-0.9.6_pre20170508_build/test/WatermarkTest /var/tmp/portage/app-text/podofo-0.9.6_pre20170508-r1/work/podofo-0.9.6_pre20170508_build/test/WatermarkTest/CMakeFiles/WatermarkTest.dir/DependInfo.cmake --color=
  587. Dependee "/var/tmp/portage/app-text/podofo-0.9.6_pre20170508-r1/work/podofo-0.9.6_pre20170508_build/test/VariantTest/CMakeFiles/VariantTest.dir/DependInfo.cmake" is newer than depender "/var/tmp/portage/app-text/podofo-0.9.6_pre20170508-r1/work/podofo-0.9.6_pre20170508_build/test/VariantTest/CMakeFiles/VariantTest.dir/depend.internal".
  588. make[2]: Entering directory '/var/tmp/portage/app-text/podofo-0.9.6_pre20170508-r1/work/podofo-0.9.6_pre20170508_build'
  589. cd /var/tmp/portage/app-text/podofo-0.9.6_pre20170508-r1/work/podofo-0.9.6_pre20170508_build && /usr/bin/cmake -E cmake_depends "Unix Makefiles" /var/tmp/portage/app-text/podofo-0.9.6_pre20170508-r1/work/podofo-0.9.6_pre20170508 /var/tmp/portage/app-text/podofo-0.9.6_pre20170508-r1/work/podofo-0.9.6_pre20170508/tools/podofobox /var/tmp/portage/app-text/podofo-0.9.6_pre20170508-r1/work/podofo-0.9.6_pre20170508_build /var/tmp/portage/app-text/podofo-0.9.6_pre20170508-r1/work/podofo-0.9.6_pre20170508_build/tools/podofobox /var/tmp/portage/app-text/podofo-0.9.6_pre20170508-r1/work/podofo-0.9.6_pre20170508_build/tools/podofobox/CMakeFiles/podofobox.dir/DependInfo.cmake --color=
  590. Dependee "/var/tmp/portage/app-text/podofo-0.9.6_pre20170508-r1/work/podofo-0.9.6_pre20170508_build/test/VariantTest/CMakeFiles/CMakeDirectoryInformation.cmake" is newer than depender "/var/tmp/portage/app-text/podofo-0.9.6_pre20170508-r1/work/podofo-0.9.6_pre20170508_build/test/VariantTest/CMakeFiles/VariantTest.dir/depend.internal".
  591. Scanning dependencies of target VariantTest
  592. Dependee "/var/tmp/portage/app-text/podofo-0.9.6_pre20170508-r1/work/podofo-0.9.6_pre20170508_build/test/WatermarkTest/CMakeFiles/WatermarkTest.dir/DependInfo.cmake" is newer than depender "/var/tmp/portage/app-text/podofo-0.9.6_pre20170508-r1/work/podofo-0.9.6_pre20170508_build/test/WatermarkTest/CMakeFiles/WatermarkTest.dir/depend.internal".
  593. Dependee "/var/tmp/portage/app-text/podofo-0.9.6_pre20170508-r1/work/podofo-0.9.6_pre20170508_build/test/WatermarkTest/CMakeFiles/CMakeDirectoryInformation.cmake" is newer than depender "/var/tmp/portage/app-text/podofo-0.9.6_pre20170508-r1/work/podofo-0.9.6_pre20170508_build/test/WatermarkTest/CMakeFiles/WatermarkTest.dir/depend.internal".
  594. Scanning dependencies of target WatermarkTest
  595. Dependee "/var/tmp/portage/app-text/podofo-0.9.6_pre20170508-r1/work/podofo-0.9.6_pre20170508_build/tools/podofobox/CMakeFiles/podofobox.dir/DependInfo.cmake" is newer than depender "/var/tmp/portage/app-text/podofo-0.9.6_pre20170508-r1/work/podofo-0.9.6_pre20170508_build/tools/podofobox/CMakeFiles/podofobox.dir/depend.internal".
  596. Dependee "/var/tmp/portage/app-text/podofo-0.9.6_pre20170508-r1/work/podofo-0.9.6_pre20170508_build/tools/podofobox/CMakeFiles/CMakeDirectoryInformation.cmake" is newer than depender "/var/tmp/portage/app-text/podofo-0.9.6_pre20170508-r1/work/podofo-0.9.6_pre20170508_build/tools/podofobox/CMakeFiles/podofobox.dir/depend.internal".
  597. Scanning dependencies of target podofobox
  598. make[2]: Leaving directory '/var/tmp/portage/app-text/podofo-0.9.6_pre20170508-r1/work/podofo-0.9.6_pre20170508_build'
  599. make -f test/VariantTest/CMakeFiles/VariantTest.dir/build.make test/VariantTest/CMakeFiles/VariantTest.dir/build
  600. make[2]: Entering directory '/var/tmp/portage/app-text/podofo-0.9.6_pre20170508-r1/work/podofo-0.9.6_pre20170508_build'
  601. make[2]: Leaving directory '/var/tmp/portage/app-text/podofo-0.9.6_pre20170508-r1/work/podofo-0.9.6_pre20170508_build'
  602. make -f test/WatermarkTest/CMakeFiles/WatermarkTest.dir/build.make test/WatermarkTest/CMakeFiles/WatermarkTest.dir/build
  603. [ 59%] Building CXX object test/VariantTest/CMakeFiles/VariantTest.dir/VariantTest.cpp.o
  604. make[2]: Entering directory '/var/tmp/portage/app-text/podofo-0.9.6_pre20170508-r1/work/podofo-0.9.6_pre20170508_build'
  605. cd /var/tmp/portage/app-text/podofo-0.9.6_pre20170508-r1/work/podofo-0.9.6_pre20170508_build/test/VariantTest && /usr/bin/x86_64-pc-linux-gnu-g++  -I/var/tmp/portage/app-text/podofo-0.9.6_pre20170508-r1/work/podofo-0.9.6_pre20170508_build -I/var/tmp/portage/app-text/podofo-0.9.6_pre20170508-r1/work/podofo-0.9.6_pre20170508 -I/var/tmp/portage/app-text/podofo-0.9.6_pre20170508-r1/work/podofo-0.9.6_pre20170508/src -I/usr/include/freetype2   -DNDEBUG -march=native -O2 -pipe -Wall -Woverloaded-virtual -Wswitch-enum -Wcast-qual -Wwrite-strings -Wredundant-decls -Wreorder -Wno-deprecated-declarations   -W -o CMakeFiles/VariantTest.dir/VariantTest.cpp.o -c /var/tmp/portage/app-text/podofo-0.9.6_pre20170508-r1/work/podofo-0.9.6_pre20170508/test/VariantTest/VariantTest.cpp
  606. make[2]: Leaving directory '/var/tmp/portage/app-text/podofo-0.9.6_pre20170508-r1/work/podofo-0.9.6_pre20170508_build'
  607. make -f tools/podofobox/CMakeFiles/podofobox.dir/build.make tools/podofobox/CMakeFiles/podofobox.dir/build
  608. [ 60%] Building CXX object test/WatermarkTest/CMakeFiles/WatermarkTest.dir/WatermarkTest.cpp.o
  609. cd /var/tmp/portage/app-text/podofo-0.9.6_pre20170508-r1/work/podofo-0.9.6_pre20170508_build/test/WatermarkTest && /usr/bin/x86_64-pc-linux-gnu-g++  -I/var/tmp/portage/app-text/podofo-0.9.6_pre20170508-r1/work/podofo-0.9.6_pre20170508_build -I/var/tmp/portage/app-text/podofo-0.9.6_pre20170508-r1/work/podofo-0.9.6_pre20170508 -I/var/tmp/portage/app-text/podofo-0.9.6_pre20170508-r1/work/podofo-0.9.6_pre20170508/src -I/usr/include/freetype2   -DNDEBUG -march=native -O2 -pipe -Wall -Woverloaded-virtual -Wswitch-enum -Wcast-qual -Wwrite-strings -Wredundant-decls -Wreorder -Wno-deprecated-declarations   -W -o CMakeFiles/WatermarkTest.dir/WatermarkTest.cpp.o -c /var/tmp/portage/app-text/podofo-0.9.6_pre20170508-r1/work/podofo-0.9.6_pre20170508/test/WatermarkTest/WatermarkTest.cpp
  610. make[2]: Entering directory '/var/tmp/portage/app-text/podofo-0.9.6_pre20170508-r1/work/podofo-0.9.6_pre20170508_build'
  611. [ 60%] Building CXX object tools/podofobox/CMakeFiles/podofobox.dir/podofobox.cpp.o
  612. cd /var/tmp/portage/app-text/podofo-0.9.6_pre20170508-r1/work/podofo-0.9.6_pre20170508_build/tools/podofobox && /usr/bin/x86_64-pc-linux-gnu-g++  -I/var/tmp/portage/app-text/podofo-0.9.6_pre20170508-r1/work/podofo-0.9.6_pre20170508_build -I/var/tmp/portage/app-text/podofo-0.9.6_pre20170508-r1/work/podofo-0.9.6_pre20170508 -I/var/tmp/portage/app-text/podofo-0.9.6_pre20170508-r1/work/podofo-0.9.6_pre20170508/src -I/usr/include/freetype2   -DNDEBUG -march=native -O2 -pipe -Wall -Woverloaded-virtual -Wswitch-enum -Wcast-qual -Wwrite-strings -Wredundant-decls -Wreorder -Wno-deprecated-declarations   -W -o CMakeFiles/podofobox.dir/podofobox.cpp.o -c /var/tmp/portage/app-text/podofo-0.9.6_pre20170508-r1/work/podofo-0.9.6_pre20170508/tools/podofobox/podofobox.cpp
  613. [ 60%] Linking CXX executable FormTest
  614. cd /var/tmp/portage/app-text/podofo-0.9.6_pre20170508-r1/work/podofo-0.9.6_pre20170508_build/test/FormTest && /usr/bin/cmake -E cmake_link_script CMakeFiles/FormTest.dir/link.txt --verbose=1
  615. /usr/bin/x86_64-pc-linux-gnu-g++  -march=native -O2 -pipe -Wall -Woverloaded-virtual -Wswitch-enum -Wcast-qual -Wwrite-strings -Wredundant-decls -Wreorder -Wno-deprecated-declarations  -Wl,-O1 -Wl,--as-needed -rdynamic CMakeFiles/FormTest.dir/FormTest.cpp.o  -o FormTest  -L/var/tmp/portage/app-text/podofo-0.9.6_pre20170508-r1/work/podofo-0.9.6_pre20170508_build/src -Wl,-rpath,/var/tmp/portage/app-text/podofo-0.9.6_pre20170508-r1/work/podofo-0.9.6_pre20170508_build/src -lpodofo -lfontconfig -lfreetype -lz -lidn -lcrypto -lcrypto -ljpeg -lpthread -lfreetype -lpng -lz -ltiff -lfontconfig -lfreetype -lz -lidn -lcrypto -lcrypto -ljpeg -lpthread -lfreetype -lpng -lz -ltiff
  616. make[2]: Leaving directory '/var/tmp/portage/app-text/podofo-0.9.6_pre20170508-r1/work/podofo-0.9.6_pre20170508_build'
  617. [ 60%] Built target FormTest
  618. make -f tools/podofocolor/CMakeFiles/podofocolor.dir/build.make tools/podofocolor/CMakeFiles/podofocolor.dir/depend
  619. make[2]: Entering directory '/var/tmp/portage/app-text/podofo-0.9.6_pre20170508-r1/work/podofo-0.9.6_pre20170508_build'
  620. cd /var/tmp/portage/app-text/podofo-0.9.6_pre20170508-r1/work/podofo-0.9.6_pre20170508_build && /usr/bin/cmake -E cmake_depends "Unix Makefiles" /var/tmp/portage/app-text/podofo-0.9.6_pre20170508-r1/work/podofo-0.9.6_pre20170508 /var/tmp/portage/app-text/podofo-0.9.6_pre20170508-r1/work/podofo-0.9.6_pre20170508/tools/podofocolor /var/tmp/portage/app-text/podofo-0.9.6_pre20170508-r1/work/podofo-0.9.6_pre20170508_build /var/tmp/portage/app-text/podofo-0.9.6_pre20170508-r1/work/podofo-0.9.6_pre20170508_build/tools/podofocolor /var/tmp/portage/app-text/podofo-0.9.6_pre20170508-r1/work/podofo-0.9.6_pre20170508_build/tools/podofocolor/CMakeFiles/podofocolor.dir/DependInfo.cmake --color=
  621. Dependee "/var/tmp/portage/app-text/podofo-0.9.6_pre20170508-r1/work/podofo-0.9.6_pre20170508_build/tools/podofocolor/CMakeFiles/podofocolor.dir/DependInfo.cmake" is newer than depender "/var/tmp/portage/app-text/podofo-0.9.6_pre20170508-r1/work/podofo-0.9.6_pre20170508_build/tools/podofocolor/CMakeFiles/podofocolor.dir/depend.internal".
  622. Dependee "/var/tmp/portage/app-text/podofo-0.9.6_pre20170508-r1/work/podofo-0.9.6_pre20170508_build/tools/podofocolor/CMakeFiles/CMakeDirectoryInformation.cmake" is newer than depender "/var/tmp/portage/app-text/podofo-0.9.6_pre20170508-r1/work/podofo-0.9.6_pre20170508_build/tools/podofocolor/CMakeFiles/podofocolor.dir/depend.internal".
  623. Scanning dependencies of target podofocolor
  624. [ 61%] Linking CXX executable ContentParser
  625. cd /var/tmp/portage/app-text/podofo-0.9.6_pre20170508-r1/work/podofo-0.9.6_pre20170508_build/test/ContentParser && /usr/bin/cmake -E cmake_link_script CMakeFiles/ContentParser.dir/link.txt --verbose=1
  626. make[2]: Leaving directory '/var/tmp/portage/app-text/podofo-0.9.6_pre20170508-r1/work/podofo-0.9.6_pre20170508_build'
  627. make -f tools/podofocolor/CMakeFiles/podofocolor.dir/build.make tools/podofocolor/CMakeFiles/podofocolor.dir/build
  628. /usr/bin/x86_64-pc-linux-gnu-g++  -march=native -O2 -pipe -Wall -Woverloaded-virtual -Wswitch-enum -Wcast-qual -Wwrite-strings -Wredundant-decls -Wreorder -Wno-deprecated-declarations  -Wl,-O1 -Wl,--as-needed -rdynamic CMakeFiles/ContentParser.dir/main.cpp.o  -o ContentParser  -L/var/tmp/portage/app-text/podofo-0.9.6_pre20170508-r1/work/podofo-0.9.6_pre20170508_build/src -Wl,-rpath,/var/tmp/portage/app-text/podofo-0.9.6_pre20170508-r1/work/podofo-0.9.6_pre20170508_build/src -lpodofo -lfontconfig -lfreetype -lz -lidn -lcrypto -lcrypto -ljpeg -lpthread -lfreetype -lpng -lz -ltiff -lfontconfig -lfreetype -lz -lidn -lcrypto -lcrypto -ljpeg -lpthread -lfreetype -lpng -lz -ltiff
  629. make[2]: Entering directory '/var/tmp/portage/app-text/podofo-0.9.6_pre20170508-r1/work/podofo-0.9.6_pre20170508_build'
  630. [ 61%] Building CXX object tools/podofocolor/CMakeFiles/podofocolor.dir/podofocolor.cpp.o
  631. cd /var/tmp/portage/app-text/podofo-0.9.6_pre20170508-r1/work/podofo-0.9.6_pre20170508_build/tools/podofocolor && /usr/bin/x86_64-pc-linux-gnu-g++  -I/var/tmp/portage/app-text/podofo-0.9.6_pre20170508-r1/work/podofo-0.9.6_pre20170508_build -I/var/tmp/portage/app-text/podofo-0.9.6_pre20170508-r1/work/podofo-0.9.6_pre20170508 -I/var/tmp/portage/app-text/podofo-0.9.6_pre20170508-r1/work/podofo-0.9.6_pre20170508/src -I/usr/include/freetype2   -DNDEBUG -march=native -O2 -pipe -Wall -Woverloaded-virtual -Wswitch-enum -Wcast-qual -Wwrite-strings -Wredundant-decls -Wreorder -Wno-deprecated-declarations   -W -o CMakeFiles/podofocolor.dir/podofocolor.cpp.o -c /var/tmp/portage/app-text/podofo-0.9.6_pre20170508-r1/work/podofo-0.9.6_pre20170508/tools/podofocolor/podofocolor.cpp
  632. [ 61%] Linking CXX executable ObjectParserTest
  633. cd /var/tmp/portage/app-text/podofo-0.9.6_pre20170508-r1/work/podofo-0.9.6_pre20170508_build/test/ObjectParserTest && /usr/bin/cmake -E cmake_link_script CMakeFiles/ObjectParserTest.dir/link.txt --verbose=1
  634. /usr/bin/x86_64-pc-linux-gnu-g++  -march=native -O2 -pipe -Wall -Woverloaded-virtual -Wswitch-enum -Wcast-qual -Wwrite-strings -Wredundant-decls -Wreorder -Wno-deprecated-declarations  -Wl,-O1 -Wl,--as-needed -rdynamic CMakeFiles/ObjectParserTest.dir/ObjectParserTest.cpp.o  -o ObjectParserTest  -L/var/tmp/portage/app-text/podofo-0.9.6_pre20170508-r1/work/podofo-0.9.6_pre20170508_build/src -Wl,-rpath,/var/tmp/portage/app-text/podofo-0.9.6_pre20170508-r1/work/podofo-0.9.6_pre20170508_build/src -lpodofo -lfontconfig -lfreetype -lz -lidn -lcrypto -lcrypto -ljpeg -lpthread -lfreetype -lpng -lz -ltiff -lfontconfig -lfreetype -lz -lidn -lcrypto -lcrypto -ljpeg -lpthread -lfreetype -lpng -lz -ltiff
  635. make[2]: Leaving directory '/var/tmp/portage/app-text/podofo-0.9.6_pre20170508-r1/work/podofo-0.9.6_pre20170508_build'
  636. [ 61%] Built target ContentParser
  637. make -f tools/podofocountpages/CMakeFiles/podofocountpages.dir/build.make tools/podofocountpages/CMakeFiles/podofocountpages.dir/depend
  638. make[2]: Entering directory '/var/tmp/portage/app-text/podofo-0.9.6_pre20170508-r1/work/podofo-0.9.6_pre20170508_build'
  639. cd /var/tmp/portage/app-text/podofo-0.9.6_pre20170508-r1/work/podofo-0.9.6_pre20170508_build && /usr/bin/cmake -E cmake_depends "Unix Makefiles" /var/tmp/portage/app-text/podofo-0.9.6_pre20170508-r1/work/podofo-0.9.6_pre20170508 /var/tmp/portage/app-text/podofo-0.9.6_pre20170508-r1/work/podofo-0.9.6_pre20170508/tools/podofocountpages /var/tmp/portage/app-text/podofo-0.9.6_pre20170508-r1/work/podofo-0.9.6_pre20170508_build /var/tmp/portage/app-text/podofo-0.9.6_pre20170508-r1/work/podofo-0.9.6_pre20170508_build/tools/podofocountpages /var/tmp/portage/app-text/podofo-0.9.6_pre20170508-r1/work/podofo-0.9.6_pre20170508_build/tools/podofocountpages/CMakeFiles/podofocountpages.dir/DependInfo.cmake --color=
  640. Dependee "/var/tmp/portage/app-text/podofo-0.9.6_pre20170508-r1/work/podofo-0.9.6_pre20170508_build/tools/podofocountpages/CMakeFiles/podofocountpages.dir/DependInfo.cmake" is newer than depender "/var/tmp/portage/app-text/podofo-0.9.6_pre20170508-r1/work/podofo-0.9.6_pre20170508_build/tools/podofocountpages/CMakeFiles/podofocountpages.dir/depend.internal".
  641. Dependee "/var/tmp/portage/app-text/podofo-0.9.6_pre20170508-r1/work/podofo-0.9.6_pre20170508_build/tools/podofocountpages/CMakeFiles/CMakeDirectoryInformation.cmake" is newer than depender "/var/tmp/portage/app-text/podofo-0.9.6_pre20170508-r1/work/podofo-0.9.6_pre20170508_build/tools/podofocountpages/CMakeFiles/podofocountpages.dir/depend.internal".
  642. Scanning dependencies of target podofocountpages
  643. make[2]: Leaving directory '/var/tmp/portage/app-text/podofo-0.9.6_pre20170508-r1/work/podofo-0.9.6_pre20170508_build'
  644. make -f tools/podofocountpages/CMakeFiles/podofocountpages.dir/build.make tools/podofocountpages/CMakeFiles/podofocountpages.dir/build
  645. make[2]: Entering directory '/var/tmp/portage/app-text/podofo-0.9.6_pre20170508-r1/work/podofo-0.9.6_pre20170508_build'
  646. [ 61%] Building CXX object tools/podofocountpages/CMakeFiles/podofocountpages.dir/countpages.cpp.o
  647. cd /var/tmp/portage/app-text/podofo-0.9.6_pre20170508-r1/work/podofo-0.9.6_pre20170508_build/tools/podofocountpages && /usr/bin/x86_64-pc-linux-gnu-g++  -I/var/tmp/portage/app-text/podofo-0.9.6_pre20170508-r1/work/podofo-0.9.6_pre20170508_build -I/var/tmp/portage/app-text/podofo-0.9.6_pre20170508-r1/work/podofo-0.9.6_pre20170508 -I/var/tmp/portage/app-text/podofo-0.9.6_pre20170508-r1/work/podofo-0.9.6_pre20170508/src -I/usr/include/freetype2   -DNDEBUG -march=native -O2 -pipe -Wall -Woverloaded-virtual -Wswitch-enum -Wcast-qual -Wwrite-strings -Wredundant-decls -Wreorder -Wno-deprecated-declarations   -W -o CMakeFiles/podofocountpages.dir/countpages.cpp.o -c /var/tmp/portage/app-text/podofo-0.9.6_pre20170508-r1/work/podofo-0.9.6_pre20170508/tools/podofocountpages/countpages.cpp
  648. cd /var/tmp/portage/app-text/podofo-0.9.6_pre20170508-r1/work/podofo-0.9.6_pre20170508_build/test/ObjectParserTest && /usr/bin/cmake -E copy_directory /var/tmp/portage/app-text/podofo-0.9.6_pre20170508-r1/work/podofo-0.9.6_pre20170508/test/ObjectParserTest/objects /var/tmp/portage/app-text/podofo-0.9.6_pre20170508-r1/work/podofo-0.9.6_pre20170508_build/test/ObjectParserTest/objects
  649. make[2]: Leaving directory '/var/tmp/portage/app-text/podofo-0.9.6_pre20170508-r1/work/podofo-0.9.6_pre20170508_build'
  650. [ 61%] Built target ObjectParserTest
  651. make -f tools/podofocrop/CMakeFiles/podofocrop.dir/build.make tools/podofocrop/CMakeFiles/podofocrop.dir/depend
  652. make[2]: Entering directory '/var/tmp/portage/app-text/podofo-0.9.6_pre20170508-r1/work/podofo-0.9.6_pre20170508_build'
  653. cd /var/tmp/portage/app-text/podofo-0.9.6_pre20170508-r1/work/podofo-0.9.6_pre20170508_build && /usr/bin/cmake -E cmake_depends "Unix Makefiles" /var/tmp/portage/app-text/podofo-0.9.6_pre20170508-r1/work/podofo-0.9.6_pre20170508 /var/tmp/portage/app-text/podofo-0.9.6_pre20170508-r1/work/podofo-0.9.6_pre20170508/tools/podofocrop /var/tmp/portage/app-text/podofo-0.9.6_pre20170508-r1/work/podofo-0.9.6_pre20170508_build /var/tmp/portage/app-text/podofo-0.9.6_pre20170508-r1/work/podofo-0.9.6_pre20170508_build/tools/podofocrop /var/tmp/portage/app-text/podofo-0.9.6_pre20170508-r1/work/podofo-0.9.6_pre20170508_build/tools/podofocrop/CMakeFiles/podofocrop.dir/DependInfo.cmake --color=
  654. Dependee "/var/tmp/portage/app-text/podofo-0.9.6_pre20170508-r1/work/podofo-0.9.6_pre20170508_build/tools/podofocrop/CMakeFiles/podofocrop.dir/DependInfo.cmake" is newer than depender "/var/tmp/portage/app-text/podofo-0.9.6_pre20170508-r1/work/podofo-0.9.6_pre20170508_build/tools/podofocrop/CMakeFiles/podofocrop.dir/depend.internal".
  655. Dependee "/var/tmp/portage/app-text/podofo-0.9.6_pre20170508-r1/work/podofo-0.9.6_pre20170508_build/tools/podofocrop/CMakeFiles/CMakeDirectoryInformation.cmake" is newer than depender "/var/tmp/portage/app-text/podofo-0.9.6_pre20170508-r1/work/podofo-0.9.6_pre20170508_build/tools/podofocrop/CMakeFiles/podofocrop.dir/depend.internal".
  656. Scanning dependencies of target podofocrop
  657. make[2]: Leaving directory '/var/tmp/portage/app-text/podofo-0.9.6_pre20170508-r1/work/podofo-0.9.6_pre20170508_build'
  658. make -f tools/podofocrop/CMakeFiles/podofocrop.dir/build.make tools/podofocrop/CMakeFiles/podofocrop.dir/build
  659. make[2]: Entering directory '/var/tmp/portage/app-text/podofo-0.9.6_pre20170508-r1/work/podofo-0.9.6_pre20170508_build'
  660. [ 62%] Building CXX object tools/podofocrop/CMakeFiles/podofocrop.dir/podofocrop.cpp.o
  661. cd /var/tmp/portage/app-text/podofo-0.9.6_pre20170508-r1/work/podofo-0.9.6_pre20170508_build/tools/podofocrop && /usr/bin/x86_64-pc-linux-gnu-g++  -I/var/tmp/portage/app-text/podofo-0.9.6_pre20170508-r1/work/podofo-0.9.6_pre20170508_build -I/var/tmp/portage/app-text/podofo-0.9.6_pre20170508-r1/work/podofo-0.9.6_pre20170508 -I/var/tmp/portage/app-text/podofo-0.9.6_pre20170508-r1/work/podofo-0.9.6_pre20170508/src -I/usr/include/freetype2   -DNDEBUG -march=native -O2 -pipe -Wall -Woverloaded-virtual -Wswitch-enum -Wcast-qual -Wwrite-strings -Wredundant-decls -Wreorder -Wno-deprecated-declarations   -W -o CMakeFiles/podofocrop.dir/podofocrop.cpp.o -c /var/tmp/portage/app-text/podofo-0.9.6_pre20170508-r1/work/podofo-0.9.6_pre20170508/tools/podofocrop/podofocrop.cpp
  662. [ 63%] Linking CXX executable CreationTest
  663. cd /var/tmp/portage/app-text/podofo-0.9.6_pre20170508-r1/work/podofo-0.9.6_pre20170508_build/test/CreationTest && /usr/bin/cmake -E cmake_link_script CMakeFiles/CreationTest.dir/link.txt --verbose=1
  664. /usr/bin/x86_64-pc-linux-gnu-g++  -march=native -O2 -pipe -Wall -Woverloaded-virtual -Wswitch-enum -Wcast-qual -Wwrite-strings -Wredundant-decls -Wreorder -Wno-deprecated-declarations  -Wl,-O1 -Wl,--as-needed -rdynamic CMakeFiles/CreationTest.dir/CreationTest.cpp.o  -o CreationTest  -L/var/tmp/portage/app-text/podofo-0.9.6_pre20170508-r1/work/podofo-0.9.6_pre20170508_build/src -Wl,-rpath,/var/tmp/portage/app-text/podofo-0.9.6_pre20170508-r1/work/podofo-0.9.6_pre20170508_build/src -lpodofo -lfontconfig -lfreetype -lz -lidn -lcrypto -lcrypto -ljpeg -lpthread -lfreetype -lpng -lz -ltiff -lfontconfig -lfreetype -lz -lidn -lcrypto -lcrypto -ljpeg -lpthread -lfreetype -lpng -lz -ltiff
  665. [ 64%] Linking CXX executable TokenizerTest
  666. cd /var/tmp/portage/app-text/podofo-0.9.6_pre20170508-r1/work/podofo-0.9.6_pre20170508_build/test/TokenizerTest && /usr/bin/cmake -E cmake_link_script CMakeFiles/TokenizerTest.dir/link.txt --verbose=1
  667. /usr/bin/x86_64-pc-linux-gnu-g++  -march=native -O2 -pipe -Wall -Woverloaded-virtual -Wswitch-enum -Wcast-qual -Wwrite-strings -Wredundant-decls -Wreorder -Wno-deprecated-declarations  -Wl,-O1 -Wl,--as-needed -rdynamic CMakeFiles/TokenizerTest.dir/TokenizerTest.cpp.o  -o TokenizerTest  -L/var/tmp/portage/app-text/podofo-0.9.6_pre20170508-r1/work/podofo-0.9.6_pre20170508_build/src -Wl,-rpath,/var/tmp/portage/app-text/podofo-0.9.6_pre20170508-r1/work/podofo-0.9.6_pre20170508_build/src -lpodofo -lfontconfig -lfreetype -lz -lidn -lcrypto -lcrypto -ljpeg -lpthread -lfreetype -lpng -lz -ltiff -lfontconfig -lfreetype -lz -lidn -lcrypto -lcrypto -ljpeg -lpthread -lfreetype -lpng -lz -ltiff
  668. cd /var/tmp/portage/app-text/podofo-0.9.6_pre20170508-r1/work/podofo-0.9.6_pre20170508_build/test/CreationTest && /usr/bin/cmake -E copy_directory /var/tmp/portage/app-text/podofo-0.9.6_pre20170508-r1/work/podofo-0.9.6_pre20170508/test/CreationTest/resources /var/tmp/portage/app-text/podofo-0.9.6_pre20170508-r1/work/podofo-0.9.6_pre20170508_build/test/CreationTest/resources
  669. make[2]: Leaving directory '/var/tmp/portage/app-text/podofo-0.9.6_pre20170508-r1/work/podofo-0.9.6_pre20170508_build'
  670. [ 64%] Built target CreationTest
  671. make -f tools/podofoencrypt/CMakeFiles/podofoencrypt.dir/build.make tools/podofoencrypt/CMakeFiles/podofoencrypt.dir/depend
  672. make[2]: Entering directory '/var/tmp/portage/app-text/podofo-0.9.6_pre20170508-r1/work/podofo-0.9.6_pre20170508_build'
  673. cd /var/tmp/portage/app-text/podofo-0.9.6_pre20170508-r1/work/podofo-0.9.6_pre20170508_build && /usr/bin/cmake -E cmake_depends "Unix Makefiles" /var/tmp/portage/app-text/podofo-0.9.6_pre20170508-r1/work/podofo-0.9.6_pre20170508 /var/tmp/portage/app-text/podofo-0.9.6_pre20170508-r1/work/podofo-0.9.6_pre20170508/tools/podofoencrypt /var/tmp/portage/app-text/podofo-0.9.6_pre20170508-r1/work/podofo-0.9.6_pre20170508_build /var/tmp/portage/app-text/podofo-0.9.6_pre20170508-r1/work/podofo-0.9.6_pre20170508_build/tools/podofoencrypt /var/tmp/portage/app-text/podofo-0.9.6_pre20170508-r1/work/podofo-0.9.6_pre20170508_build/tools/podofoencrypt/CMakeFiles/podofoencrypt.dir/DependInfo.cmake --color=
  674. Dependee "/var/tmp/portage/app-text/podofo-0.9.6_pre20170508-r1/work/podofo-0.9.6_pre20170508_build/tools/podofoencrypt/CMakeFiles/podofoencrypt.dir/DependInfo.cmake" is newer than depender "/var/tmp/portage/app-text/podofo-0.9.6_pre20170508-r1/work/podofo-0.9.6_pre20170508_build/tools/podofoencrypt/CMakeFiles/podofoencrypt.dir/depend.internal".
  675. Dependee "/var/tmp/portage/app-text/podofo-0.9.6_pre20170508-r1/work/podofo-0.9.6_pre20170508_build/tools/podofoencrypt/CMakeFiles/CMakeDirectoryInformation.cmake" is newer than depender "/var/tmp/portage/app-text/podofo-0.9.6_pre20170508-r1/work/podofo-0.9.6_pre20170508_build/tools/podofoencrypt/CMakeFiles/podofoencrypt.dir/depend.internal".
  676. Scanning dependencies of target podofoencrypt
  677. make[2]: Leaving directory '/var/tmp/portage/app-text/podofo-0.9.6_pre20170508-r1/work/podofo-0.9.6_pre20170508_build'
  678. make -f tools/podofoencrypt/CMakeFiles/podofoencrypt.dir/build.make tools/podofoencrypt/CMakeFiles/podofoencrypt.dir/build
  679. make[2]: Entering directory '/var/tmp/portage/app-text/podofo-0.9.6_pre20170508-r1/work/podofo-0.9.6_pre20170508_build'
  680. [ 65%] Building CXX object tools/podofoencrypt/CMakeFiles/podofoencrypt.dir/podofoencrypt.cpp.o
  681. cd /var/tmp/portage/app-text/podofo-0.9.6_pre20170508-r1/work/podofo-0.9.6_pre20170508_build/tools/podofoencrypt && /usr/bin/x86_64-pc-linux-gnu-g++  -I/var/tmp/portage/app-text/podofo-0.9.6_pre20170508-r1/work/podofo-0.9.6_pre20170508_build -I/var/tmp/portage/app-text/podofo-0.9.6_pre20170508-r1/work/podofo-0.9.6_pre20170508 -I/var/tmp/portage/app-text/podofo-0.9.6_pre20170508-r1/work/podofo-0.9.6_pre20170508/src -I/usr/include/freetype2   -DNDEBUG -march=native -O2 -pipe -Wall -Woverloaded-virtual -Wswitch-enum -Wcast-qual -Wwrite-strings -Wredundant-decls -Wreorder -Wno-deprecated-declarations   -W -o CMakeFiles/podofoencrypt.dir/podofoencrypt.cpp.o -c /var/tmp/portage/app-text/podofo-0.9.6_pre20170508-r1/work/podofo-0.9.6_pre20170508/tools/podofoencrypt/podofoencrypt.cpp
  682. [ 65%] Linking CXX executable WatermarkTest
  683. cd /var/tmp/portage/app-text/podofo-0.9.6_pre20170508-r1/work/podofo-0.9.6_pre20170508_build/test/WatermarkTest && /usr/bin/cmake -E cmake_link_script CMakeFiles/WatermarkTest.dir/link.txt --verbose=1
  684. cd /var/tmp/portage/app-text/podofo-0.9.6_pre20170508-r1/work/podofo-0.9.6_pre20170508_build/test/TokenizerTest && /usr/bin/cmake -E copy_directory /var/tmp/portage/app-text/podofo-0.9.6_pre20170508-r1/work/podofo-0.9.6_pre20170508/test/TokenizerTest/objects /var/tmp/portage/app-text/podofo-0.9.6_pre20170508-r1/work/podofo-0.9.6_pre20170508_build/test/TokenizerTest/objects
  685. /usr/bin/x86_64-pc-linux-gnu-g++  -march=native -O2 -pipe -Wall -Woverloaded-virtual -Wswitch-enum -Wcast-qual -Wwrite-strings -Wredundant-decls -Wreorder -Wno-deprecated-declarations  -Wl,-O1 -Wl,--as-needed -rdynamic CMakeFiles/WatermarkTest.dir/WatermarkTest.cpp.o  -o WatermarkTest  -L/var/tmp/portage/app-text/podofo-0.9.6_pre20170508-r1/work/podofo-0.9.6_pre20170508_build/src -Wl,-rpath,/var/tmp/portage/app-text/podofo-0.9.6_pre20170508-r1/work/podofo-0.9.6_pre20170508_build/src -lpodofo -lfontconfig -lfreetype -lz -lidn -lcrypto -lcrypto -ljpeg -lpthread -lfreetype -lpng -lz -ltiff -lfontconfig -lfreetype -lz -lidn -lcrypto -lcrypto -ljpeg -lpthread -lfreetype -lpng -lz -ltiff
  686. [ 66%] Building CXX object tools/podofobox/CMakeFiles/podofobox.dir/boxsetter.cpp.o
  687. cd /var/tmp/portage/app-text/podofo-0.9.6_pre20170508-r1/work/podofo-0.9.6_pre20170508_build/tools/podofobox && /usr/bin/x86_64-pc-linux-gnu-g++  -I/var/tmp/portage/app-text/podofo-0.9.6_pre20170508-r1/work/podofo-0.9.6_pre20170508_build -I/var/tmp/portage/app-text/podofo-0.9.6_pre20170508-r1/work/podofo-0.9.6_pre20170508 -I/var/tmp/portage/app-text/podofo-0.9.6_pre20170508-r1/work/podofo-0.9.6_pre20170508/src -I/usr/include/freetype2   -DNDEBUG -march=native -O2 -pipe -Wall -Woverloaded-virtual -Wswitch-enum -Wcast-qual -Wwrite-strings -Wredundant-decls -Wreorder -Wno-deprecated-declarations   -W -o CMakeFiles/podofobox.dir/boxsetter.cpp.o -c /var/tmp/portage/app-text/podofo-0.9.6_pre20170508-r1/work/podofo-0.9.6_pre20170508/tools/podofobox/boxsetter.cpp
  688. Error copying directory from "/var/tmp/portage/app-text/podofo-0.9.6_pre20170508-r1/work/podofo-0.9.6_pre20170508/test/TokenizerTest/objects" to "/var/tmp/portage/app-text/podofo-0.9.6_pre20170508-r1/work/podofo-0.9.6_pre20170508_build/test/TokenizerTest/objects".
  689. make[2]: *** [test/TokenizerTest/CMakeFiles/TokenizerTest.dir/build.make:101: test/TokenizerTest/TokenizerTest] Error 1
  690. make[2]: *** Deleting file 'test/TokenizerTest/TokenizerTest'
  691. make[2]: Leaving directory '/var/tmp/portage/app-text/podofo-0.9.6_pre20170508-r1/work/podofo-0.9.6_pre20170508_build'
  692. make[1]: *** [CMakeFiles/Makefile2:669: test/TokenizerTest/CMakeFiles/TokenizerTest.dir/all] Error 2
  693. make[1]: *** Waiting for unfinished jobs....
  694. [ 67%] Building CXX object tools/podofocolor/CMakeFiles/podofocolor.dir/colorchanger.cpp.o
  695. cd /var/tmp/portage/app-text/podofo-0.9.6_pre20170508-r1/work/podofo-0.9.6_pre20170508_build/tools/podofocolor && /usr/bin/x86_64-pc-linux-gnu-g++  -I/var/tmp/portage/app-text/podofo-0.9.6_pre20170508-r1/work/podofo-0.9.6_pre20170508_build -I/var/tmp/portage/app-text/podofo-0.9.6_pre20170508-r1/work/podofo-0.9.6_pre20170508 -I/var/tmp/portage/app-text/podofo-0.9.6_pre20170508-r1/work/podofo-0.9.6_pre20170508/src -I/usr/include/freetype2   -DNDEBUG -march=native -O2 -pipe -Wall -Woverloaded-virtual -Wswitch-enum -Wcast-qual -Wwrite-strings -Wredundant-decls -Wreorder -Wno-deprecated-declarations   -W -o CMakeFiles/podofocolor.dir/colorchanger.cpp.o -c /var/tmp/portage/app-text/podofo-0.9.6_pre20170508-r1/work/podofo-0.9.6_pre20170508/tools/podofocolor/colorchanger.cpp
  696. make[2]: Leaving directory '/var/tmp/portage/app-text/podofo-0.9.6_pre20170508-r1/work/podofo-0.9.6_pre20170508_build'
  697. [ 67%] Built target WatermarkTest
  698. [ 67%] Building CXX object tools/podofocolor/CMakeFiles/podofocolor.dir/colorspace.cpp.o
  699. cd /var/tmp/portage/app-text/podofo-0.9.6_pre20170508-r1/work/podofo-0.9.6_pre20170508_build/tools/podofocolor && /usr/bin/x86_64-pc-linux-gnu-g++  -I/var/tmp/portage/app-text/podofo-0.9.6_pre20170508-r1/work/podofo-0.9.6_pre20170508_build -I/var/tmp/portage/app-text/podofo-0.9.6_pre20170508-r1/work/podofo-0.9.6_pre20170508 -I/var/tmp/portage/app-text/podofo-0.9.6_pre20170508-r1/work/podofo-0.9.6_pre20170508/src -I/usr/include/freetype2   -DNDEBUG -march=native -O2 -pipe -Wall -Woverloaded-virtual -Wswitch-enum -Wcast-qual -Wwrite-strings -Wredundant-decls -Wreorder -Wno-deprecated-declarations   -W -o CMakeFiles/podofocolor.dir/colorspace.cpp.o -c /var/tmp/portage/app-text/podofo-0.9.6_pre20170508-r1/work/podofo-0.9.6_pre20170508/tools/podofocolor/colorspace.cpp
  700. [ 68%] Building CXX object tools/podofocolor/CMakeFiles/podofocolor.dir/graphicsstack.cpp.o
  701. cd /var/tmp/portage/app-text/podofo-0.9.6_pre20170508-r1/work/podofo-0.9.6_pre20170508_build/tools/podofocolor && /usr/bin/x86_64-pc-linux-gnu-g++  -I/var/tmp/portage/app-text/podofo-0.9.6_pre20170508-r1/work/podofo-0.9.6_pre20170508_build -I/var/tmp/portage/app-text/podofo-0.9.6_pre20170508-r1/work/podofo-0.9.6_pre20170508 -I/var/tmp/portage/app-text/podofo-0.9.6_pre20170508-r1/work/podofo-0.9.6_pre20170508/src -I/usr/include/freetype2   -DNDEBUG -march=native -O2 -pipe -Wall -Woverloaded-virtual -Wswitch-enum -Wcast-qual -Wwrite-strings -Wredundant-decls -Wreorder -Wno-deprecated-declarations   -W -o CMakeFiles/podofocolor.dir/graphicsstack.cpp.o -c /var/tmp/portage/app-text/podofo-0.9.6_pre20170508-r1/work/podofo-0.9.6_pre20170508/tools/podofocolor/graphicsstack.cpp
  702. [ 69%] Linking CXX executable VariantTest
  703. cd /var/tmp/portage/app-text/podofo-0.9.6_pre20170508-r1/work/podofo-0.9.6_pre20170508_build/test/VariantTest && /usr/bin/cmake -E cmake_link_script CMakeFiles/VariantTest.dir/link.txt --verbose=1
  704. /usr/bin/x86_64-pc-linux-gnu-g++  -march=native -O2 -pipe -Wall -Woverloaded-virtual -Wswitch-enum -Wcast-qual -Wwrite-strings -Wredundant-decls -Wreorder -Wno-deprecated-declarations  -Wl,-O1 -Wl,--as-needed -rdynamic CMakeFiles/VariantTest.dir/VariantTest.cpp.o  -o VariantTest  -L/var/tmp/portage/app-text/podofo-0.9.6_pre20170508-r1/work/podofo-0.9.6_pre20170508_build/src -Wl,-rpath,/var/tmp/portage/app-text/podofo-0.9.6_pre20170508-r1/work/podofo-0.9.6_pre20170508_build/src -lpodofo -lfontconfig -lfreetype -lz -lidn -lcrypto -lcrypto -ljpeg -lpthread -lfreetype -lpng -lz -ltiff -lfontconfig -lfreetype -lz -lidn -lcrypto -lcrypto -ljpeg -lpthread -lfreetype -lpng -lz -ltiff
  705. make[2]: Leaving directory '/var/tmp/portage/app-text/podofo-0.9.6_pre20170508-r1/work/podofo-0.9.6_pre20170508_build'
  706. [ 69%] Built target VariantTest
  707. [ 69%] Building CXX object tools/podofocolor/CMakeFiles/podofocolor.dir/iconverter.cpp.o
  708. cd /var/tmp/portage/app-text/podofo-0.9.6_pre20170508-r1/work/podofo-0.9.6_pre20170508_build/tools/podofocolor && /usr/bin/x86_64-pc-linux-gnu-g++  -I/var/tmp/portage/app-text/podofo-0.9.6_pre20170508-r1/work/podofo-0.9.6_pre20170508_build -I/var/tmp/portage/app-text/podofo-0.9.6_pre20170508-r1/work/podofo-0.9.6_pre20170508 -I/var/tmp/portage/app-text/podofo-0.9.6_pre20170508-r1/work/podofo-0.9.6_pre20170508/src -I/usr/include/freetype2   -DNDEBUG -march=native -O2 -pipe -Wall -Woverloaded-virtual -Wswitch-enum -Wcast-qual -Wwrite-strings -Wredundant-decls -Wreorder -Wno-deprecated-declarations   -W -o CMakeFiles/podofocolor.dir/iconverter.cpp.o -c /var/tmp/portage/app-text/podofo-0.9.6_pre20170508-r1/work/podofo-0.9.6_pre20170508/tools/podofocolor/iconverter.cpp
  709. [ 70%] Linking CXX executable podofocountpages
  710. cd /var/tmp/portage/app-text/podofo-0.9.6_pre20170508-r1/work/podofo-0.9.6_pre20170508_build/tools/podofocountpages && /usr/bin/cmake -E cmake_link_script CMakeFiles/podofocountpages.dir/link.txt --verbose=1
  711. /usr/bin/x86_64-pc-linux-gnu-g++  -march=native -O2 -pipe -Wall -Woverloaded-virtual -Wswitch-enum -Wcast-qual -Wwrite-strings -Wredundant-decls -Wreorder -Wno-deprecated-declarations  -Wl,-O1 -Wl,--as-needed -rdynamic CMakeFiles/podofocountpages.dir/countpages.cpp.o  -o podofocountpages  -L/var/tmp/portage/app-text/podofo-0.9.6_pre20170508-r1/work/podofo-0.9.6_pre20170508_build/src -Wl,-rpath,/var/tmp/portage/app-text/podofo-0.9.6_pre20170508-r1/work/podofo-0.9.6_pre20170508_build/src: -lpodofo -lfontconfig -lfreetype -lz -lidn -lcrypto -lcrypto -ljpeg -lpthread -lfreetype -lpng -lz -ltiff -lidn -lcrypto -lcrypto -ljpeg -lpthread -lfreetype -lpng -ltiff
  712. /var/tmp/portage/app-text/podofo-0.9.6_pre20170508-r1/work/podofo-0.9.6_pre20170508/tools/podofocrop/podofocrop.cpp: In function ‘std::__cxx11::string get_ghostscript_output(const char*)’:
  713. /var/tmp/portage/app-text/podofo-0.9.6_pre20170508-r1/work/podofo-0.9.6_pre20170508/tools/podofocrop/podofocrop.cpp:119:9: warning: ignoring return value of ‘int pipe(int*)’, declared with attribute warn_unused_result [-Wunused-result]
  714.      pipe( p );
  715.      ~~~~^~~~~
  716. make[2]: Leaving directory '/var/tmp/portage/app-text/podofo-0.9.6_pre20170508-r1/work/podofo-0.9.6_pre20170508_build'
  717. [ 70%] Built target podofocountpages
  718. [ 71%] Building CXX object tools/podofocolor/CMakeFiles/podofocolor.dir/dummyconverter.cpp.o
  719. cd /var/tmp/portage/app-text/podofo-0.9.6_pre20170508-r1/work/podofo-0.9.6_pre20170508_build/tools/podofocolor && /usr/bin/x86_64-pc-linux-gnu-g++  -I/var/tmp/portage/app-text/podofo-0.9.6_pre20170508-r1/work/podofo-0.9.6_pre20170508_build -I/var/tmp/portage/app-text/podofo-0.9.6_pre20170508-r1/work/podofo-0.9.6_pre20170508 -I/var/tmp/portage/app-text/podofo-0.9.6_pre20170508-r1/work/podofo-0.9.6_pre20170508/src -I/usr/include/freetype2   -DNDEBUG -march=native -O2 -pipe -Wall -Woverloaded-virtual -Wswitch-enum -Wcast-qual -Wwrite-strings -Wredundant-decls -Wreorder -Wno-deprecated-declarations   -W -o CMakeFiles/podofocolor.dir/dummyconverter.cpp.o -c /var/tmp/portage/app-text/podofo-0.9.6_pre20170508-r1/work/podofo-0.9.6_pre20170508/tools/podofocolor/dummyconverter.cpp
  720. [ 71%] Linking CXX executable podofocrop
  721. cd /var/tmp/portage/app-text/podofo-0.9.6_pre20170508-r1/work/podofo-0.9.6_pre20170508_build/tools/podofocrop && /usr/bin/cmake -E cmake_link_script CMakeFiles/podofocrop.dir/link.txt --verbose=1
  722. /usr/bin/x86_64-pc-linux-gnu-g++  -march=native -O2 -pipe -Wall -Woverloaded-virtual -Wswitch-enum -Wcast-qual -Wwrite-strings -Wredundant-decls -Wreorder -Wno-deprecated-declarations  -Wl,-O1 -Wl,--as-needed -rdynamic CMakeFiles/podofocrop.dir/podofocrop.cpp.o  -o podofocrop  -L/var/tmp/portage/app-text/podofo-0.9.6_pre20170508-r1/work/podofo-0.9.6_pre20170508_build/src -Wl,-rpath,/var/tmp/portage/app-text/podofo-0.9.6_pre20170508-r1/work/podofo-0.9.6_pre20170508_build/src: -lpodofo -lfontconfig -lfreetype -lz -lidn -lcrypto -lcrypto -ljpeg -lpthread -lfreetype -lpng -lz -ltiff -lidn -lcrypto -lcrypto -ljpeg -lpthread -lfreetype -lpng -ltiff
  723. [ 71%] Linking CXX executable podofoencrypt
  724. cd /var/tmp/portage/app-text/podofo-0.9.6_pre20170508-r1/work/podofo-0.9.6_pre20170508_build/tools/podofoencrypt && /usr/bin/cmake -E cmake_link_script CMakeFiles/podofoencrypt.dir/link.txt --verbose=1
  725. /usr/bin/x86_64-pc-linux-gnu-g++  -march=native -O2 -pipe -Wall -Woverloaded-virtual -Wswitch-enum -Wcast-qual -Wwrite-strings -Wredundant-decls -Wreorder -Wno-deprecated-declarations  -Wl,-O1 -Wl,--as-needed -rdynamic CMakeFiles/podofoencrypt.dir/podofoencrypt.cpp.o  -o podofoencrypt  -L/var/tmp/portage/app-text/podofo-0.9.6_pre20170508-r1/work/podofo-0.9.6_pre20170508_build/src -Wl,-rpath,/var/tmp/portage/app-text/podofo-0.9.6_pre20170508-r1/work/podofo-0.9.6_pre20170508_build/src: -lpodofo -lfontconfig -lfreetype -lz -lidn -lcrypto -lcrypto -ljpeg -lpthread -lfreetype -lpng -lz -ltiff -lidn -lcrypto -lcrypto -ljpeg -lpthread -lfreetype -lpng -ltiff
  726. make[2]: Leaving directory '/var/tmp/portage/app-text/podofo-0.9.6_pre20170508-r1/work/podofo-0.9.6_pre20170508_build'
  727. [ 71%] Built target podofocrop
  728. [ 72%] Building CXX object tools/podofocolor/CMakeFiles/podofocolor.dir/grayscaleconverter.cpp.o
  729. cd /var/tmp/portage/app-text/podofo-0.9.6_pre20170508-r1/work/podofo-0.9.6_pre20170508_build/tools/podofocolor && /usr/bin/x86_64-pc-linux-gnu-g++  -I/var/tmp/portage/app-text/podofo-0.9.6_pre20170508-r1/work/podofo-0.9.6_pre20170508_build -I/var/tmp/portage/app-text/podofo-0.9.6_pre20170508-r1/work/podofo-0.9.6_pre20170508 -I/var/tmp/portage/app-text/podofo-0.9.6_pre20170508-r1/work/podofo-0.9.6_pre20170508/src -I/usr/include/freetype2   -DNDEBUG -march=native -O2 -pipe -Wall -Woverloaded-virtual -Wswitch-enum -Wcast-qual -Wwrite-strings -Wredundant-decls -Wreorder -Wno-deprecated-declarations   -W -o CMakeFiles/podofocolor.dir/grayscaleconverter.cpp.o -c /var/tmp/portage/app-text/podofo-0.9.6_pre20170508-r1/work/podofo-0.9.6_pre20170508/tools/podofocolor/grayscaleconverter.cpp
  730. make[2]: Leaving directory '/var/tmp/portage/app-text/podofo-0.9.6_pre20170508-r1/work/podofo-0.9.6_pre20170508_build'
  731. [ 72%] Built target podofoencrypt
  732. [ 72%] Building CXX object tools/podofocolor/CMakeFiles/podofocolor.dir/luaconverter.cpp.o
  733. cd /var/tmp/portage/app-text/podofo-0.9.6_pre20170508-r1/work/podofo-0.9.6_pre20170508_build/tools/podofocolor && /usr/bin/x86_64-pc-linux-gnu-g++  -I/var/tmp/portage/app-text/podofo-0.9.6_pre20170508-r1/work/podofo-0.9.6_pre20170508_build -I/var/tmp/portage/app-text/podofo-0.9.6_pre20170508-r1/work/podofo-0.9.6_pre20170508 -I/var/tmp/portage/app-text/podofo-0.9.6_pre20170508-r1/work/podofo-0.9.6_pre20170508/src -I/usr/include/freetype2   -DNDEBUG -march=native -O2 -pipe -Wall -Woverloaded-virtual -Wswitch-enum -Wcast-qual -Wwrite-strings -Wredundant-decls -Wreorder -Wno-deprecated-declarations   -W -o CMakeFiles/podofocolor.dir/luaconverter.cpp.o -c /var/tmp/portage/app-text/podofo-0.9.6_pre20170508-r1/work/podofo-0.9.6_pre20170508/tools/podofocolor/luaconverter.cpp
  734. [ 73%] Linking CXX executable podofobox
  735. cd /var/tmp/portage/app-text/podofo-0.9.6_pre20170508-r1/work/podofo-0.9.6_pre20170508_build/tools/podofobox && /usr/bin/cmake -E cmake_link_script CMakeFiles/podofobox.dir/link.txt --verbose=1
  736. /usr/bin/x86_64-pc-linux-gnu-g++  -march=native -O2 -pipe -Wall -Woverloaded-virtual -Wswitch-enum -Wcast-qual -Wwrite-strings -Wredundant-decls -Wreorder -Wno-deprecated-declarations  -Wl,-O1 -Wl,--as-needed -rdynamic CMakeFiles/podofobox.dir/podofobox.cpp.o CMakeFiles/podofobox.dir/boxsetter.cpp.o  -o podofobox  -L/var/tmp/portage/app-text/podofo-0.9.6_pre20170508-r1/work/podofo-0.9.6_pre20170508_build/src -Wl,-rpath,/var/tmp/portage/app-text/podofo-0.9.6_pre20170508-r1/work/podofo-0.9.6_pre20170508_build/src: -lpodofo -lfontconfig -lfreetype -lz -lidn -lcrypto -lcrypto -ljpeg -lpthread -lfreetype -lpng -lz -ltiff -lidn -lcrypto -lcrypto -ljpeg -lpthread -lfreetype -lpng -ltiff
  737. make[2]: Leaving directory '/var/tmp/portage/app-text/podofo-0.9.6_pre20170508-r1/work/podofo-0.9.6_pre20170508_build'
  738. [ 73%] Built target podofobox
  739. [ 74%] Linking CXX executable podofocolor
  740. cd /var/tmp/portage/app-text/podofo-0.9.6_pre20170508-r1/work/podofo-0.9.6_pre20170508_build/tools/podofocolor && /usr/bin/cmake -E cmake_link_script CMakeFiles/podofocolor.dir/link.txt --verbose=1
  741. /usr/bin/x86_64-pc-linux-gnu-g++  -march=native -O2 -pipe -Wall -Woverloaded-virtual -Wswitch-enum -Wcast-qual -Wwrite-strings -Wredundant-decls -Wreorder -Wno-deprecated-declarations  -Wl,-O1 -Wl,--as-needed -rdynamic CMakeFiles/podofocolor.dir/podofocolor.cpp.o CMakeFiles/podofocolor.dir/colorchanger.cpp.o CMakeFiles/podofocolor.dir/colorspace.cpp.o CMakeFiles/podofocolor.dir/graphicsstack.cpp.o CMakeFiles/podofocolor.dir/iconverter.cpp.o CMakeFiles/podofocolor.dir/dummyconverter.cpp.o CMakeFiles/podofocolor.dir/grayscaleconverter.cpp.o CMakeFiles/podofocolor.dir/luaconverter.cpp.o  -o podofocolor  -L/var/tmp/portage/app-text/podofo-0.9.6_pre20170508-r1/work/podofo-0.9.6_pre20170508_build/src -Wl,-rpath,/var/tmp/portage/app-text/podofo-0.9.6_pre20170508-r1/work/podofo-0.9.6_pre20170508_build/src: -lpodofo -lfontconfig -lfreetype -lz -lidn -lcrypto -lcrypto -ljpeg -lpthread -lfreetype -lpng -lz -ltiff -llua -lm -lidn -lcrypto -lcrypto -ljpeg -lpthread -lfreetype -lpng -ltiff -llua -lm
  742. make[2]: Leaving directory '/var/tmp/portage/app-text/podofo-0.9.6_pre20170508-r1/work/podofo-0.9.6_pre20170508_build'
  743. [ 74%] Built target podofocolor
  744. make[1]: Leaving directory '/var/tmp/portage/app-text/podofo-0.9.6_pre20170508-r1/work/podofo-0.9.6_pre20170508_build'
  745. make: *** [Makefile:130: all] Error 2
  746.  * ERROR: app-text/podofo-0.9.6_pre20170508-r1::gentoo failed (compile phase):
  747.  *   emake failed
  748.  *
  749.  * If you need support, post the output of `emerge --info '=app-text/podofo-0.9.6_pre20170508-r1::gentoo'`,
  750.  * the complete build log and the output of `emerge -pqv '=app-text/podofo-0.9.6_pre20170508-r1::gentoo'`.
  751.  * The complete build log is located at '/var/tmp/portage/app-text/podofo-0.9.6_pre20170508-r1/temp/build.log'.
  752.  * The ebuild environment file is located at '/var/tmp/portage/app-text/podofo-0.9.6_pre20170508-r1/temp/environment'.
  753.  * Working directory: '/var/tmp/portage/app-text/podofo-0.9.6_pre20170508-r1/work/podofo-0.9.6_pre20170508_build'
  754.  * S: '/var/tmp/portage/app-text/podofo-0.9.6_pre20170508-r1/work/podofo-0.9.6_pre20170508'
RAW Paste Data
We use cookies for various purposes including analytics. By continuing to use Pastebin, you agree to our use of cookies as described in the Cookies Policy. OK, I Understand
 
Top