G2A Many GEOs
SHARE
TWEET

yay -S kubelet

a guest Sep 18th, 2019 198 in 113 days
Not a member of Pastebin yet? Sign Up, it unlocks many cool features!
  1. $ yay -S kubelet
  2. :: There are 2 providers available for kubelet:
  3. :: Repository AUR
  4.     1) kubelet 2) kubelet-bin
  5.  
  6. Enter a number (default=1):
  7. :: Checking for conflicts...
  8. :: Checking for inner conflicts...
  9.  
  10. ==> Package conflicts found:
  11.  -> Installing go-pie will remove: go
  12.  
  13. ==> Conflicting packages will have to be confirmed manually
  14.  
  15. [Repo: 5]  libnetfilter_cttimeout-1.0.0-5  libnetfilter_cthelper-1.0.0-3  libnetfilter_queue-1.0.3-1  conntrack-tools-1.4.5-1  cni-plugins-0.8.2-1
  16. [Repo Make: 1]  go-pie-2:1.13-1
  17. [Aur: 1]  kubernetes-1.15.3-1 (kubelet)
  18.  
  19. ==> Remove make dependencies after install? [y/N]
  20. :: Downloaded PKGBUILD (1/1): kubernetes (kubelet)
  21.   1 kubernetes (kubelet)                     (Build Files Exist)
  22. ==> Diffs to show?
  23. ==> [N]one [A]ll [Ab]ort [I]nstalled [No]tInstalled or (1 2 3, 1-3, ^4)
  24. ==>
  25. :: Parsing SRCINFO (1/1): kubernetes (kubelet)
  26. [sudo] password for martin:
  27. Sorry, try again.
  28. [sudo] password for martin:
  29. resolving dependencies...
  30. looking for conflicting packages...
  31. :: go-pie and go are in conflict. Remove go? [y/N] y
  32.  
  33. Packages (7) go-2:1.13-1 [removal]  cni-plugins-0.8.2-1  conntrack-tools-1.4.5-1  go-pie-2:1.13-1
  34.              libnetfilter_cthelper-1.0.0-3  libnetfilter_cttimeout-1.0.0-5  libnetfilter_queue-1.0.3-1
  35.  
  36. Total Download Size:   154.45 MiB
  37. Total Installed Size:  694.61 MiB
  38. Net Upgrade Size:      215.86 MiB
  39.  
  40. :: Proceed with installation? [Y/n]
  41. :: Retrieving packages...
  42.  libnetfilter_cttimeout-1.0.0-5-x86_64     7.3 KiB   318K/s 00:00 [####################################] 100%
  43.  libnetfilter_cthelper-1.0.0-3-x86_64      6.8 KiB  0.00B/s 00:00 [####################################] 100%
  44.  libnetfilter_queue-1.0.3-1-x86_64        14.3 KiB  4.67M/s 00:00 [####################################] 100%
  45.  conntrack-tools-1.4.5-1-x86_64          131.9 KiB   608K/s 00:00 [####################################] 100%
  46.  cni-plugins-0.8.2-1-x86_64                8.8 MiB  13.3M/s 00:01 [####################################] 100%
  47.  go-pie-2:1.13-1-x86_64                  145.5 MiB  13.1M/s 00:11 [####################################] 100%
  48. (6/6) checking keys in keyring                                    [####################################] 100%
  49. (6/6) checking package integrity                                  [####################################] 100%
  50. (6/6) loading package files                                       [####################################] 100%
  51. (6/6) checking for file conflicts                                 [####################################] 100%
  52. (7/7) checking available disk space                               [####################################] 100%
  53. :: Processing package changes...
  54. (1/1) removing go                                                 [####################################] 100%
  55. (1/6) installing libnetfilter_cttimeout                           [####################################] 100%
  56. (2/6) installing libnetfilter_cthelper                            [####################################] 100%
  57. (3/6) installing libnetfilter_queue                               [####################################] 100%
  58. (4/6) installing conntrack-tools                                  [####################################] 100%
  59. (5/6) installing cni-plugins                                      [####################################] 100%
  60. (6/6) installing go-pie                                           [####################################] 100%
  61. :: Running post-transaction hooks...
  62. (1/2) Reloading system manager configuration...
  63. (2/2) Arming ConditionNeedsUpdate...
  64. ==> Making package: kubernetes 1.15.3-1 (Thu 19 Sep 2019 03:18:42 AM CEST)
  65. ==> Retrieving sources...
  66.   -> Downloading kubernetes-1.15.3.tar.gz...
  67.   % Total    % Received % Xferd  Average Speed   Time    Time     Time  Current
  68.                                  Dload  Upload   Total   Spent    Left  Speed
  69. 100   161  100   161    0     0    394      0 --:--:-- --:--:-- --:--:--   395
  70. 100 25.4M  100 25.4M    0     0  8252k      0  0:00:03  0:00:03 --:--:-- 9609k
  71.   -> Found kubelet.default
  72. ==> Validating source files with sha512sums...
  73.     kubernetes-1.15.3.tar.gz ... Passed
  74.     kubelet.default ... Passed
  75. ==> Cleaning up...
  76. ==> Making package: kubernetes 1.15.3-1 (Thu 19 Sep 2019 03:18:48 AM CEST)
  77. ==> Checking runtime dependencies...
  78. ==> Checking buildtime dependencies...
  79. ==> Retrieving sources...
  80.   -> Found kubernetes-1.15.3.tar.gz
  81.   -> Found kubelet.default
  82. ==> Validating source files with sha512sums...
  83.     kubernetes-1.15.3.tar.gz ... Passed
  84.     kubelet.default ... Passed
  85. ==> Removing existing $srcdir/ directory...
  86. ==> Extracting sources...
  87.   -> Extracting kubernetes-1.15.3.tar.gz with bsdtar
  88. ==> Sources are ready.
  89. ==> Making package: kubernetes 1.15.3-1 (Thu 19 Sep 2019 03:18:52 AM CEST)
  90. ==> Checking runtime dependencies...
  91. ==> Checking buildtime dependencies...
  92. ==> WARNING: Using existing $srcdir/ tree
  93. ==> Starting build()...
  94. go: downloading github.com/spf13/pflag v1.0.1
  95. go: extracting github.com/spf13/pflag v1.0.1
  96. go: finding github.com/spf13/pflag v1.0.1
  97. go/build: importGo k8s.io/kubernetes: exit status 1
  98. can't load package: package k8s.io/kubernetes: cannot find module providing package k8s.io/kubernetes
  99.  
  100.  
  101. +++ [0919 03:19:00] Building go targets for linux/amd64:
  102.     ./vendor/k8s.io/kube-openapi/cmd/openapi-gen
  103. +++ [0919 03:19:00] Building go targets for linux/amd64:
  104.     ./vendor/k8s.io/code-generator/cmd/defaulter-gen
  105. +++ [0919 03:19:00] Building go targets for linux/amd64:
  106.     ./vendor/k8s.io/code-generator/cmd/conversion-gen
  107. +++ [0919 03:19:00] Building go targets for linux/amd64:
  108.     ./vendor/k8s.io/code-generator/cmd/deepcopy-gen
  109. go: downloading k8s.io/kube-openapi v0.0.0-20190228160746-b3a7cee44a30
  110. go: downloading k8s.io/klog v0.3.1
  111. go: extracting k8s.io/klog v0.3.1
  112. go: extracting k8s.io/kube-openapi v0.0.0-20190228160746-b3a7cee44a30
  113. go: downloading k8s.io/gengo v0.0.0-20190116091435-f8a0810f38af
  114. go: downloading github.com/go-openapi/spec v0.17.2
  115. go: downloading github.com/emicklei/go-restful v0.0.0-20170410110728-ff4f55a20633
  116. go: extracting k8s.io/gengo v0.0.0-20190116091435-f8a0810f38af
  117. go: downloading golang.org/x/tools v0.0.0-20190313210603-aa82965741a9
  118. go: extracting github.com/emicklei/go-restful v0.0.0-20170410110728-ff4f55a20633
  119. go: extracting github.com/go-openapi/spec v0.17.2
  120. go: downloading github.com/go-openapi/swag v0.17.2
  121. go: downloading github.com/go-openapi/jsonreference v0.19.0
  122. go: downloading github.com/go-openapi/jsonpointer v0.19.0
  123. go: extracting github.com/go-openapi/swag v0.17.2
  124. go: downloading github.com/mailru/easyjson v0.0.0-20180823135443-60711f1a8329
  125. go: downloading gopkg.in/yaml.v2 v2.2.1
  126. go: extracting github.com/go-openapi/jsonreference v0.19.0
  127. go: downloading github.com/PuerkitoBio/purell v1.1.0
  128. go: extracting github.com/go-openapi/jsonpointer v0.19.0
  129. go: extracting gopkg.in/yaml.v2 v2.2.1
  130. go: extracting github.com/PuerkitoBio/purell v1.1.0
  131. go: downloading golang.org/x/text v0.3.1-0.20181227161524-e6919f6577db
  132. go: downloading github.com/PuerkitoBio/urlesc v0.0.0-20170810143723-de5bf2ad4578
  133. go: downloading golang.org/x/net v0.0.0-20190812203447-cdfb69ac37fc
  134. go: extracting github.com/mailru/easyjson v0.0.0-20180823135443-60711f1a8329
  135. go: extracting github.com/PuerkitoBio/urlesc v0.0.0-20170810143723-de5bf2ad4578
  136. go: extracting golang.org/x/tools v0.0.0-20190313210603-aa82965741a9
  137. go: extracting golang.org/x/net v0.0.0-20190812203447-cdfb69ac37fc
  138. go: finding k8s.io/kubernetes/vendor latest
  139. go: finding k8s.io/kubernetes/vendor/k8s.io/code-generator latest
  140. go: finding k8s.io/kubernetes/vendor/k8s.io latest
  141. go: finding k8s.io/kubernetes/vendor/k8s.io/code-generator/cmd/deepcopy-gen latest
  142. go: finding k8s.io/kubernetes/vendor/k8s.io/code-generator/cmd latest
  143. go: extracting golang.org/x/text v0.3.1-0.20181227161524-e6919f6577db
  144. go: finding k8s.io/kube-openapi v0.0.0-20190228160746-b3a7cee44a30
  145. go: finding k8s.io/klog v0.3.1
  146. go: finding k8s.io/gengo v0.0.0-20190116091435-f8a0810f38af
  147. go: finding golang.org/x/tools v0.0.0-20190313210603-aa82965741a9
  148. go: finding github.com/emicklei/go-restful v0.0.0-20170410110728-ff4f55a20633
  149. go: finding github.com/go-openapi/spec v0.17.2
  150. go: finding github.com/go-openapi/jsonreference v0.19.0
  151. go: finding github.com/go-openapi/jsonpointer v0.19.0
  152. go: finding github.com/go-openapi/swag v0.17.2
  153. go: finding github.com/PuerkitoBio/purell v1.1.0
  154. can't load package: package k8s.io/kubernetes/vendor/k8s.io/code-generator/cmd/deepcopy-gen: no matching versions for query "latest"
  155. go: finding github.com/mailru/easyjson v0.0.0-20180823135443-60711f1a8329
  156. go: finding gopkg.in/yaml.v2 v2.2.1
  157. go: finding github.com/PuerkitoBio/urlesc v0.0.0-20170810143723-de5bf2ad4578
  158. !!! [0919 03:19:53] Call tree:
  159. !!! [0919 03:19:53]  1: /home/martin/.cache/yay/kubernetes/src/hack/lib/golang.sh:715 kube::golang::build_some_binaries(...)
  160. !!! [0919 03:19:53]  2: /home/martin/.cache/yay/kubernetes/src/hack/lib/golang.sh:854 kube::golang::build_binaries_for_platform(...)
  161. !!! [0919 03:19:53]  3: hack/make-rules/build.sh:27 kube::golang::build_binaries(...)
  162. !!! [0919 03:19:53] Call tree:
  163. !!! [0919 03:19:53]  1: hack/make-rules/build.sh:27 kube::golang::build_binaries(...)
  164. !!! [0919 03:19:53] Call tree:
  165. !!! [0919 03:19:53]  1: hack/make-rules/build.sh:27 kube::golang::build_binaries(...)
  166. make[1]: *** [Makefile.generated_files:200: _output/bin/deepcopy-gen] Error 1
  167. make[1]: *** Waiting for unfinished jobs....
  168. go: finding golang.org/x/net v0.0.0-20190812203447-cdfb69ac37fc
  169. go: finding golang.org/x/text v0.3.1-0.20181227161524-e6919f6577db
  170. go: finding k8s.io/kubernetes/vendor/k8s.io/code-generator/cmd/defaulter-gen latest
  171. go: finding k8s.io/kubernetes/vendor/k8s.io/code-generator/cmd latest
  172. go: finding k8s.io/kubernetes/vendor latest
  173. go: finding k8s.io/kubernetes/vendor/k8s.io/code-generator latest
  174. go: finding k8s.io/kubernetes/vendor/k8s.io latest
  175. go: finding k8s.io/kubernetes/vendor/k8s.io/code-generator/cmd/conversion-gen latest
  176. go: finding k8s.io/kubernetes/vendor/k8s.io/code-generator/cmd latest
  177. go: finding k8s.io/kubernetes/vendor/k8s.io/code-generator latest
  178. go: finding k8s.io/kubernetes/vendor/k8s.io latest
  179. go: finding k8s.io/kubernetes/vendor latest
  180. can't load package: package k8s.io/kubernetes/vendor/k8s.io/code-generator/cmd/defaulter-gen: no matching versions for query "latest"
  181. !!! [0919 03:19:56] Call tree:
  182. !!! [0919 03:19:56]  1: /home/martin/.cache/yay/kubernetes/src/hack/lib/golang.sh:715 kube::golang::build_some_binaries(...)
  183. !!! [0919 03:19:56]  2: /home/martin/.cache/yay/kubernetes/src/hack/lib/golang.sh:854 kube::golang::build_binaries_for_platform(...)
  184. can't load package: package k8s.io/kubernetes/vendor/k8s.io/code-generator/cmd/conversion-gen: no matching versions for query "latest"
  185. !!! [0919 03:19:56]  3: hack/make-rules/build.sh:27 kube::golang::build_binaries(...)
  186. !!! [0919 03:19:56] Call tree:
  187. !!! [0919 03:19:56]  1: /home/martin/.cache/yay/kubernetes/src/hack/lib/golang.sh:715 kube::golang::build_some_binaries(...)
  188. !!! [0919 03:19:56]  2: /home/martin/.cache/yay/kubernetes/src/hack/lib/golang.sh:854 kube::golang::build_binaries_for_platform(...)
  189. !!! [0919 03:19:56]  3: hack/make-rules/build.sh:27 kube::golang::build_binaries(...)
  190. !!! [0919 03:19:56] Call tree:
  191. !!! [0919 03:19:56]  1: hack/make-rules/build.sh:27 kube::golang::build_binaries(...)
  192. !!! [0919 03:19:56] Call tree:
  193. !!! [0919 03:19:56]  1: hack/make-rules/build.sh:27 kube::golang::build_binaries(...)
  194. !!! [0919 03:19:56] Call tree:
  195. !!! [0919 03:19:56] Call tree:
  196. !!! [0919 03:19:56]  1: hack/make-rules/build.sh:27 kube::golang::build_binaries(...)
  197. make[1]: *** [Makefile.generated_files:294: _output/bin/defaulter-gen] Error 1
  198. !!! [0919 03:19:56]  1: hack/make-rules/build.sh:27 kube::golang::build_binaries(...)
  199. make[1]: *** [Makefile.generated_files:398: _output/bin/conversion-gen] Error 1
  200. make: *** [Makefile:557: generated_files] Error 2
  201. ==> ERROR: A failure occurred in build().
  202.     Aborting...
  203. Error making: kubernetes (kubelet)
RAW Paste Data
Ledger Nano X - The secure hardware wallet
We use cookies for various purposes including analytics. By continuing to use Pastebin, you agree to our use of cookies as described in the Cookies Policy. OK, I Understand
Top