Advertisement
Guest User

Untitled

a guest
Apr 3rd, 2022
9
Never
Not a member of Pastebin yet? Sign Up, it unlocks many cool features!
  1. 5:48:10 PM: Build ready to start
  2. 5:48:12 PM: build-image version: ac716c5be7f79fe384a0f3759e8ef612cb821a37 (xenial)
  3. 5:48:12 PM: build-image tag: v3.13.0
  4. 5:48:12 PM: buildbot version: 0475eccc4c4863180929fe6d58b546f8277ad384
  5. 5:48:12 PM: Fetching cached dependencies
  6. 5:48:12 PM: Starting to download cache of 273.5MB
  7. 5:48:15 PM: Finished downloading cache in 3.001957779s
  8. 5:48:15 PM: Starting to extract cache
  9. 5:48:22 PM: Finished extracting cache in 7.262887207s
  10. 5:48:23 PM: Finished fetching cache in 10.299854032s
  11. 5:48:23 PM: Starting to prepare the repo for build
  12. 5:48:23 PM: Preparing Git Reference refs/heads/master
  13. 5:48:24 PM: Parsing package.json dependencies
  14. 5:48:24 PM: Different build command detected, going to use the one specified in the Netlify configuration file: 'npm run build' versus 'npm install bundler install' in the Netlify UI
  15. 5:48:25 PM: Starting build script
  16. 5:48:25 PM: Installing dependencies
  17. 5:48:25 PM: Python version set to 2.7
  18. 5:48:25 PM: Started restoring cached node version
  19. 5:48:27 PM: Finished restoring cached node version
  20. 5:48:27 PM: Attempting node version 'v14.18.0' from .nvmrc
  21. 5:48:28 PM: v14.18.0 is already installed.
  22. 5:48:28 PM: Now using node v14.18.0 (npm v6.14.15)
  23. 5:48:28 PM: Started restoring cached build plugins
  24. 5:48:28 PM: Finished restoring cached build plugins
  25. 5:48:28 PM: Attempting ruby version 2.7.2, read from environment
  26. 5:48:29 PM: Using ruby version 2.7.2
  27. 5:48:30 PM: Using PHP version 5.6
  28. 5:48:30 PM: Started restoring cached ruby gems
  29. 5:48:30 PM: Finished restoring cached ruby gems
  30. 5:48:30 PM: Installing gem bundle
  31. 5:48:30 PM: [DEPRECATED] The `--path` flag is deprecated because it relies on being remembered across bundler invocations, which bundler will no longer do in future versions. Instead please use `bundle config set --local path '/opt/build/cache/bundle'`, and stop using this flag
  32. 5:48:30 PM: [DEPRECATED] The --binstubs option will be removed in favor of `bundle binstubs --all`
  33. 5:48:32 PM: Fetching gem metadata from https://rubygems.org/..........
  34. 5:48:33 PM: Resolving dependencies....
  35. 5:48:33 PM: Fetching ffi 1.15.5
  36. 5:48:33 PM: Using public_suffix 4.0.6
  37. 5:48:33 PM: Using colorator 1.1.0
  38. 5:48:33 PM: Using eventmachine 1.2.7
  39. 5:48:33 PM: Fetching http_parser.rb 0.8.0
  40. 5:48:33 PM: Fetching rb-fsevent 0.11.1
  41. 5:48:33 PM: Fetching fastimage 2.2.6
  42. 5:48:33 PM: Fetching concurrent-ruby 1.1.10
  43. 5:48:33 PM: Using rexml 3.2.5
  44. 5:48:33 PM: Using liquid 4.0.3
  45. 5:48:33 PM: Using mercenary 0.4.0
  46. 5:48:33 PM: Using forwardable-extended 2.6.0
  47. 5:48:33 PM: Fetching rouge 3.28.0
  48. 5:48:33 PM: Using safe_yaml 1.0.5
  49. 5:48:33 PM: Using unicode-display_width 1.8.0
  50. 5:48:33 PM: Fetching racc 1.6.0
  51. 5:48:33 PM: Using bundler 2.3.10
  52. 5:48:33 PM: Using csspool-st 3.1.2
  53. 5:48:33 PM: Fetching json 2.6.1
  54. 5:48:33 PM: Installing fastimage 2.2.6
  55. 5:48:33 PM: Installing rb-fsevent 0.11.1
  56. 5:48:33 PM: Installing racc 1.6.0 with native extensions
  57. 5:48:33 PM: Installing json 2.6.1 with native extensions
  58. 5:48:33 PM: Using execjs 2.8.1
  59. 5:48:33 PM: Using htmlentities 4.3.4
  60. 5:48:33 PM: Using addressable 2.8.0
  61. 5:48:33 PM: Installing http_parser.rb 0.8.0 with native extensions
  62. 5:48:33 PM: Fetching kramdown 2.3.2
  63. 5:48:33 PM: Installing concurrent-ruby 1.1.10
  64. 5:48:33 PM: Installing kramdown 2.3.2
  65. 5:48:33 PM: Installing ffi 1.15.5 with native extensions
  66. 5:48:33 PM: Installing rouge 3.28.0
  67. 5:48:36 PM: Using pathutil 0.16.2
  68. 5:48:37 PM: Using terminal-table 2.0.0
  69. 5:48:37 PM: Using kramdown-parser-gfm 1.1.0
  70. 5:48:37 PM: Fetching i18n 1.10.0
  71. 5:48:37 PM: Installing i18n 1.10.0
  72. 5:48:44 PM: Fetching nokogiri 1.13.3 (x86_64-linux)
  73. 5:48:44 PM: Installing nokogiri 1.13.3 (x86_64-linux)
  74. 5:48:45 PM: Fetching em-websocket 0.5.3
  75. 5:48:45 PM: Using sassc 2.4.0
  76. 5:48:45 PM: Using rb-inotify 0.10.1
  77. 5:48:45 PM: Installing em-websocket 0.5.3
  78. 5:48:45 PM: Fetching listen 3.7.1
  79. 5:48:45 PM: Fetching jekyll-sass-converter 2.2.0
  80. 5:48:45 PM: Using css_press 0.3.2
  81. 5:48:45 PM: Using uglifier 2.7.2
  82. 5:48:45 PM: Using multi_css 0.1.0
  83. 5:48:45 PM: Using multi_js 0.1.0
  84. 5:48:45 PM: Using html_press 0.8.2
  85. 5:48:45 PM: Installing listen 3.7.1
  86. 5:48:46 PM: Installing jekyll-sass-converter 2.2.0
  87. 5:48:46 PM: Using jekyll-watch 2.2.1
  88. 5:48:46 PM: Using jekyll 4.2.1
  89. 5:48:46 PM: Using amp-jekyll 1.0.3
  90. 5:48:46 PM: Using octopress-hooks 2.6.2
  91. 5:48:46 PM: Using jekyll-sitemap 1.4.0
  92. 5:48:46 PM: Fetching jekyll-feed 0.16.0
  93. 5:48:46 PM: Fetching jekyll-seo-tag 2.8.0
  94. 5:48:46 PM: Using octopress-minify-html 1.3.1
  95. 5:48:46 PM: Installing jekyll-feed 0.16.0
  96. 5:48:46 PM: Installing jekyll-seo-tag 2.8.0
  97. 5:48:46 PM: Bundle complete! 7 Gemfile dependencies, 46 gems now installed.
  98. 5:48:46 PM: Bundled gems are installed into `/opt/build/cache/bundle`
  99. 5:48:46 PM: Gem bundle installed
  100. 5:48:46 PM: No npm workspaces detected
  101. 5:48:46 PM: Started restoring cached node modules
  102. 5:48:46 PM: Finished restoring cached node modules
  103. 5:48:46 PM: Started restoring cached go cache
  104. 5:48:46 PM: Finished restoring cached go cache
  105. 5:48:46 PM: go version go1.14.4 linux/amd64
  106. 5:48:46 PM: go version go1.14.4 linux/amd64
  107. 5:48:46 PM: Installing missing commands
  108. 5:48:46 PM: Verify run directory
  109. 5:48:48 PM: ​
  110. 5:48:48 PM: ────────────────────────────────────────────────────────────────
  111. 5:48:48 PM: Netlify Build
  112. 5:48:48 PM: ────────────────────────────────────────────────────────────────
  113. 5:48:48 PM: ​
  114. 5:48:48 PM: ❯ Version
  115. 5:48:48 PM: @netlify/build 26.5.1
  116. 5:48:48 PM: ​
  117. 5:48:48 PM: ❯ Flags
  118. 5:48:48 PM: baseRelDir: true
  119. 5:48:48 PM: buildId: 6249c1bada0f8f000889f458
  120. 5:48:48 PM: deployId: 6249c1bada0f8f000889f45a
  121. 5:48:48 PM: ​
  122. 5:48:48 PM: ❯ Current directory
  123. 5:48:48 PM: /opt/build/repo
  124. 5:48:48 PM: ​
  125. 5:48:48 PM: ❯ Config file
  126. 5:48:48 PM: /opt/build/repo/netlify.toml
  127. 5:48:48 PM: ​
  128. 5:48:48 PM: ❯ Context
  129. 5:48:48 PM: production
  130. 5:48:48 PM: ​
  131. 5:48:48 PM: ────────────────────────────────────────────────────────────────
  132. 5:48:48 PM: 1. build.command from netlify.toml
  133. 5:48:48 PM: ────────────────────────────────────────────────────────────────
  134. 5:48:48 PM: ​
  135. 5:48:48 PM: $ npm run build
  136. 5:48:48 PM: > mobile-app-landingpage-template@1.0.0 build /opt/build/repo
  137. 5:48:48 PM: > npm run-script clean:project && cross-env NODE_ENV=production webpack --env config=prod --progress --profile --color && cross-env JEKYLL_ENV=production bundle exec jekyll build
  138. 5:48:48 PM: > mobile-app-landingpage-template@1.0.0 clean:project /opt/build/repo
  139. 5:48:48 PM: > rimraf ./_site ./assets
  140. 5:48:50 PM: <s> [webpack.Progress] 0%
  141. 5:48:50 PM: <s> [webpack.Progress] 1% setup before run
  142. 5:48:50 PM: <s> [webpack.Progress] 1% setup before run NodeEnvironmentPlugin
  143. 5:48:50 PM: <s> [webpack.Progress] 1% setup before run
  144. 5:48:50 PM: <s> [webpack.Progress] 2% setup run
  145. 5:48:50 PM: <s> [webpack.Progress] 2% setup run webpack-cli
  146. 5:48:50 PM: <s> [webpack.Progress] 2% setup run
  147. 5:48:50 PM: <s> [webpack.Progress] 4% setup normal module factory
  148. 5:48:50 PM: <s> [webpack.Progress] 4% setup normal module factory
  149. 5:48:50 PM: <s> [webpack.Progress] 5% setup context module factory
  150. 5:48:50 PM: <s> [webpack.Progress] 5% setup context module factory
  151. 5:48:50 PM: <s> [webpack.Progress] 6% setup before compile
  152. 5:48:50 PM: <s> [webpack.Progress] 6% setup before compile ProgressPlugin
  153. 5:48:50 PM: <s> [webpack.Progress] 6% setup before compile
  154. 5:48:50 PM: <s> [webpack.Progress] 7% setup compile
  155. 5:48:50 PM: <s> [webpack.Progress] 7% setup compile ExternalsPlugin
  156. 5:48:50 PM: <s> [webpack.Progress] 7% setup compile
  157. 5:48:50 PM: <s> [webpack.Progress] 8% setup compilation
  158. 5:48:50 PM: <s> [webpack.Progress] 8% setup compilation mini-css-extract-plugin
  159. 5:48:50 PM: <s> [webpack.Progress] 8% setup compilation CopyPlugin
  160. 5:48:50 PM: <s> [webpack.Progress] 8% setup compilation ArrayPushCallbackChunkFormatPlugin
  161. 5:48:50 PM: <s> [webpack.Progress] 8% setup compilation JsonpChunkLoadingPlugin
  162. 5:48:50 PM: <s> [webpack.Progress] 8% setup compilation StartupChunkDependenciesPlugin
  163. 5:48:50 PM: <s> [webpack.Progress] 8% setup compilation ImportScriptsChunkLoadingPlugin
  164. 5:48:50 PM: <s> [webpack.Progress] 8% setup compilation FetchCompileWasmPlugin
  165. 5:48:50 PM: <s> [webpack.Progress] 8% setup compilation FetchCompileAsyncWasmPlugin
  166. 5:48:50 PM: <s> [webpack.Progress] 8% setup compilation WorkerPlugin
  167. 5:48:50 PM: <s> [webpack.Progress] 8% setup compilation SplitChunksPlugin
  168. 5:48:50 PM: <s> [webpack.Progress] 8% setup compilation ResolverCachePlugin
  169. 5:48:50 PM: <s> [webpack.Progress] 8% setup compilation FaviconsWebpackPlugin
  170. 5:48:50 PM: <s> [webpack.Progress] 8% setup compilation HtmlWebpackPlugin
  171. 5:48:50 PM: <s> [webpack.Progress] 8% setup compilation
  172. 5:48:50 PM: <s> [webpack.Progress] 9% setup compilation
  173. 5:48:50 PM: <s> [webpack.Progress] 9% setup compilation ProgressPlugin
  174. 5:48:50 PM: <s> [webpack.Progress] 9% setup compilation mini-css-extract-plugin
  175. 5:48:50 PM: <s> [webpack.Progress] 9% setup compilation LoaderOptionsPlugin
  176. 5:48:50 PM: <s> [webpack.Progress] 9% setup compilation ChunkPrefetchPreloadPlugin
  177. 5:48:50 PM: <s> [webpack.Progress] 9% setup compilation JavascriptModulesPlugin
  178. 5:48:50 PM: <s> [webpack.Progress] 9% setup compilation JsonModulesPlugin
  179. 5:48:50 PM: <s> [webpack.Progress] 9% setup compilation AssetModulesPlugin
  180. 5:48:50 PM: <s> [webpack.Progress] 9% setup compilation EntryPlugin
  181. 5:48:50 PM: <s> [webpack.Progress] 9% setup compilation RuntimePlugin
  182. 5:48:50 PM: <s> [webpack.Progress] 9% setup compilation InferAsyncModulesPlugin
  183. 5:48:50 PM: <s> [webpack.Progress] 9% setup compilation DataUriPlugin
  184. 5:48:50 PM: <s> [webpack.Progress] 9% setup compilation FileUriPlugin
  185. 5:48:50 PM: <s> [webpack.Progress] 9% setup compilation CompatibilityPlugin
  186. 5:48:50 PM: <s> [webpack.Progress] 9% setup compilation HarmonyModulesPlugin
  187. 5:48:50 PM: <s> [webpack.Progress] 9% setup compilation AMDPlugin
  188. 5:48:50 PM: <s> [webpack.Progress] 9% setup compilation RequireJsStuffPlugin
  189. 5:48:50 PM: <s> [webpack.Progress] 9% setup compilation CommonJsPlugin
  190. 5:48:50 PM: <s> [webpack.Progress] 9% setup compilation LoaderPlugin
  191. 5:48:50 PM: <s> [webpack.Progress] 9% setup compilation LoaderPlugin
  192. 5:48:50 PM: <s> [webpack.Progress] 9% setup compilation NodeStuffPlugin
  193. 5:48:50 PM: <s> [webpack.Progress] 9% setup compilation APIPlugin
  194. 5:48:50 PM: <s> [webpack.Progress] 9% setup compilation ExportsInfoApiPlugin
  195. 5:48:50 PM: <s> [webpack.Progress] 9% setup compilation WebpackIsIncludedPlugin
  196. 5:48:50 PM: <s> [webpack.Progress] 9% setup compilation ConstPlugin
  197. 5:48:50 PM: <s> [webpack.Progress] 9% setup compilation UseStrictPlugin
  198. 5:48:50 PM: <s> [webpack.Progress] 9% setup compilation RequireIncludePlugin
  199. 5:48:50 PM: <s> [webpack.Progress] 9% setup compilation RequireEnsurePlugin
  200. 5:48:50 PM: <s> [webpack.Progress] 9% setup compilation RequireContextPlugin
  201. 5:48:50 PM: <s> [webpack.Progress] 9% setup compilation ImportPlugin
  202. 5:48:50 PM: <s> [webpack.Progress] 9% setup compilation RequireContextPlugin
  203. 5:48:50 PM: <s> [webpack.Progress] 9% setup compilation SystemPlugin
  204. 5:48:50 PM: <s> [webpack.Progress] 9% setup compilation ImportMetaPlugin
  205. 5:48:50 PM: <s> [webpack.Progress] 9% setup compilation URLPlugin
  206. 5:48:50 PM: <s> [webpack.Progress] 9% setup compilation DefaultStatsFactoryPlugin
  207. 5:48:50 PM: <s> [webpack.Progress] 9% setup compilation DefaultStatsPresetPlugin
  208. 5:48:50 PM: <s> [webpack.Progress] 9% setup compilation DefaultStatsPrinterPlugin
  209. 5:48:50 PM: <s> [webpack.Progress] 9% setup compilation JavascriptMetaInfoPlugin
  210. 5:48:50 PM: <s> [webpack.Progress] 9% setup compilation EnsureChunkConditionsPlugin
  211. 5:48:50 PM: <s> [webpack.Progress] 9% setup compilation RemoveEmptyChunksPlugin
  212. 5:48:50 PM: <s> [webpack.Progress] 9% setup compilation MergeDuplicateChunksPlugin
  213. 5:48:50 PM: <s> [webpack.Progress] 9% setup compilation FlagIncludedChunksPlugin
  214. 5:48:50 PM: <s> [webpack.Progress] 9% setup compilation SideEffectsFlagPlugin
  215. 5:48:50 PM: <s> [webpack.Progress] 9% setup compilation FlagDependencyExportsPlugin
  216. 5:48:50 PM: <s> [webpack.Progress] 9% setup compilation FlagDependencyUsagePlugin
  217. 5:48:50 PM: <s> [webpack.Progress] 9% setup compilation InnerGraphPlugin
  218. 5:48:50 PM: <s> [webpack.Progress] 9% setup compilation MangleExportsPlugin
  219. 5:48:50 PM: <s> [webpack.Progress] 9% setup compilation ModuleConcatenationPlugin
  220. 5:48:50 PM: <s> [webpack.Progress] 9% setup compilation NoEmitOnErrorsPlugin
  221. 5:48:50 PM: <s> [webpack.Progress] 9% setup compilation RealContentHashPlugin
  222. 5:48:50 PM: <s> [webpack.Progress] 9% setup compilation WasmFinalizeExportsPlugin
  223. 5:48:50 PM: <s> [webpack.Progress] 9% setup compilation DeterministicModuleIdsPlugin
  224. 5:48:50 PM: <s> [webpack.Progress] 9% setup compilation DeterministicChunkIdsPlugin
  225. 5:48:50 PM: <s> [webpack.Progress] 9% setup compilation DefinePlugin
  226. 5:48:50 PM: <s> [webpack.Progress] 9% setup compilation TerserPlugin
  227. 5:48:50 PM: <s> [webpack.Progress] 9% setup compilation TemplatedPathPlugin
  228. 5:48:50 PM: <s> [webpack.Progress] 9% setup compilation RecordIdsPlugin
  229. 5:48:50 PM: <s> [webpack.Progress] 9% setup compilation WarnCaseSensitiveModulesPlugin
  230. 5:48:50 PM: <s> [webpack.Progress] 9% setup compilation
  231. 5:48:50 PM: <s> [webpack.Progress] 10% building
  232. 5:48:50 PM: <s> [webpack.Progress] 10% building 0/1 entries 0/0 dependencies 0/0 modules
  233. 5:49:18 PM: <s> [webpack.Progress] 10% building 0/1 entries 1/1 dependencies 0/0 modules
  234. 5:49:18 PM: <s> [webpack.Progress] 10% building import loader ./node_modules/babel-loader/lib/index.js
  235. 5:49:19 PM: <s> [webpack.Progress] 10% building 0/1 entries 1/1 dependencies 0/1 modules
  236. 5:49:19 PM: <s> [webpack.Progress] 10% building 0/1 entries 1/2 dependencies 0/1 modules
  237. 5:49:19 PM: <s> [webpack.Progress] 10% building import loader ./node_modules/mini-css-extract-plugin/dist/loader.js
  238. 5:49:19 PM: <s> [webpack.Progress] 10% building import loader ./node_modules/css-loader/dist/cjs.js
  239. 5:49:19 PM: <s> [webpack.Progress] 10% building import loader ./node_modules/postcss-loader/dist/cjs.js
  240. 5:49:19 PM: <s> [webpack.Progress] 10% building import loader ./node_modules/sass-loader/dist/cjs.js
  241. 5:49:19 PM: <s> [webpack.Progress] 10% building 0/1 entries 4/5 dependencies 0/4 modules
  242. 5:49:21 PM: <s> [webpack.Progress] 10% building 0/1 entries 8/9 dependencies 3/6 modules
  243. 5:49:21 PM: <s> [webpack.Progress] 65% building 1/1 entries 13/13 dependencies 9/9 modules
  244. 5:49:21 PM: <s> [webpack.Progress] 65% building
  245. 5:49:21 PM: <s> [webpack.Progress] 69% building finish
  246. 5:49:21 PM: <s> [webpack.Progress] 69% building finish
  247. 5:49:21 PM: <s> [webpack.Progress] 70% sealing finish module graph
  248. 5:49:21 PM: <s> [webpack.Progress] 70% sealing finish module graph ResolverCachePlugin
  249. 5:49:21 PM: <s> [webpack.Progress] 70% sealing finish module graph InferAsyncModulesPlugin
  250. 5:49:21 PM: <s> [webpack.Progress] 70% sealing finish module graph FlagDependencyExportsPlugin
  251. 5:49:21 PM: <s> [webpack.Progress] 70% sealing finish module graph InnerGraphPlugin
  252. 5:49:21 PM: <s> [webpack.Progress] 70% sealing finish module graph WasmFinalizeExportsPlugin
  253. 5:49:21 PM: <s> [webpack.Progress] 70% sealing finish module graph
  254. 5:49:21 PM: <s> [webpack.Progress] 70% sealing plugins
  255. 5:49:21 PM: <s> [webpack.Progress] 70% sealing plugins WarnCaseSensitiveModulesPlugin
  256. 5:49:21 PM: <s> [webpack.Progress] 70% sealing plugins
  257. 5:49:21 PM: <s> [webpack.Progress] 71% sealing dependencies optimization
  258. 5:49:21 PM: <s> [webpack.Progress] 71% sealing dependencies optimization SideEffectsFlagPlugin
  259. 5:49:21 PM: <s> [webpack.Progress] 71% sealing dependencies optimization FlagDependencyUsagePlugin
  260. 5:49:21 PM: <s> [webpack.Progress] 71% sealing dependencies optimization
  261. 5:49:21 PM: <s> [webpack.Progress] 71% sealing after dependencies optimization
  262. 5:49:21 PM: <s> [webpack.Progress] 71% sealing after dependencies optimization
  263. 5:49:21 PM: <s> [webpack.Progress] 72% sealing chunk graph
  264. 5:49:21 PM: <s> [webpack.Progress] 72% sealing chunk graph
  265. 5:49:21 PM: <s> [webpack.Progress] 73% sealing after chunk graph
  266. 5:49:21 PM: <s> [webpack.Progress] 73% sealing after chunk graph
  267. 5:49:21 PM: <s> [webpack.Progress] 73% sealing optimizing
  268. 5:49:21 PM: <s> [webpack.Progress] 73% sealing optimizing
  269. 5:49:21 PM: <s> [webpack.Progress] 74% sealing module optimization
  270. 5:49:21 PM: <s> [webpack.Progress] 74% sealing module optimization
  271. 5:49:21 PM: <s> [webpack.Progress] 75% sealing after module optimization
  272. 5:49:21 PM: <s> [webpack.Progress] 75% sealing after module optimization
  273. 5:49:21 PM: <s> [webpack.Progress] 75% sealing chunk optimization
  274. 5:49:21 PM: <s> [webpack.Progress] 75% sealing chunk optimization EnsureChunkConditionsPlugin
  275. 5:49:21 PM: <s> [webpack.Progress] 75% sealing chunk optimization RemoveEmptyChunksPlugin
  276. 5:49:21 PM: <s> [webpack.Progress] 75% sealing chunk optimization MergeDuplicateChunksPlugin
  277. 5:49:21 PM: <s> [webpack.Progress] 75% sealing chunk optimization SplitChunksPlugin
  278. 5:49:21 PM: <s> [webpack.Progress] 75% sealing chunk optimization RemoveEmptyChunksPlugin
  279. 5:49:21 PM: <s> [webpack.Progress] 75% sealing chunk optimization
  280. 5:49:21 PM: <s> [webpack.Progress] 76% sealing after chunk optimization
  281. 5:49:21 PM: <s> [webpack.Progress] 76% sealing after chunk optimization
  282. 5:49:21 PM: <s> [webpack.Progress] 77% sealing module and chunk tree optimization
  283. 5:49:21 PM: <s> [webpack.Progress] 77% sealing module and chunk tree optimization PersistentChildCompilerSingletonPlugin
  284. 5:49:21 PM: <s> [webpack.Progress] 77% sealing module and chunk tree optimization
  285. 5:49:21 PM: <s> [webpack.Progress] 77% sealing after module and chunk tree optimization
  286. 5:49:21 PM: <s> [webpack.Progress] 77% sealing after module and chunk tree optimization
  287. 5:49:21 PM: <s> [webpack.Progress] 78% sealing chunk modules optimization
  288. 5:49:21 PM: <s> [webpack.Progress] 78% sealing chunk modules optimization ModuleConcatenationPlugin
  289. 5:49:21 PM: <s> [webpack.Progress] 78% sealing chunk modules optimization
  290. 5:49:21 PM: <s> [webpack.Progress] 78% sealing after chunk modules optimization
  291. 5:49:21 PM: <s> [webpack.Progress] 78% sealing after chunk modules optimization
  292. 5:49:21 PM: <s> [webpack.Progress] 79% sealing module reviving
  293. 5:49:21 PM: <s> [webpack.Progress] 79% sealing module reviving RecordIdsPlugin
  294. 5:49:21 PM: <s> [webpack.Progress] 79% sealing module reviving
  295. 5:49:21 PM: <s> [webpack.Progress] 80% sealing before module ids
  296. 5:49:21 PM: <s> [webpack.Progress] 80% sealing before module ids
  297. 5:49:21 PM: <s> [webpack.Progress] 80% sealing module ids
  298. 5:49:21 PM: <s> [webpack.Progress] 80% sealing module ids DeterministicModuleIdsPlugin
  299. 5:49:21 PM: <s> [webpack.Progress] 80% sealing module ids
  300. 5:49:21 PM: <s> [webpack.Progress] 81% sealing module id optimization
  301. 5:49:21 PM: <s> [webpack.Progress] 81% sealing module id optimization
  302. 5:49:21 PM: <s> [webpack.Progress] 82% sealing module id optimization
  303. 5:49:21 PM: <s> [webpack.Progress] 82% sealing module id optimization
  304. 5:49:21 PM: <s> [webpack.Progress] 82% sealing chunk reviving
  305. 5:49:21 PM: <s> [webpack.Progress] 82% sealing chunk reviving RecordIdsPlugin
  306. 5:49:21 PM: <s> [webpack.Progress] 82% sealing chunk reviving
  307. 5:49:21 PM: <s> [webpack.Progress] 83% sealing before chunk ids
  308. 5:49:21 PM: <s> [webpack.Progress] 83% sealing before chunk ids
  309. 5:49:21 PM: <s> [webpack.Progress] 84% sealing chunk ids
  310. 5:49:21 PM: <s> [webpack.Progress] 84% sealing chunk ids DeterministicChunkIdsPlugin
  311. 5:49:21 PM: <s> [webpack.Progress] 84% sealing chunk ids
  312. 5:49:21 PM: <s> [webpack.Progress] 84% sealing chunk id optimization
  313. 5:49:21 PM: <s> [webpack.Progress] 84% sealing chunk id optimization FlagIncludedChunksPlugin
  314. 5:49:21 PM: <s> [webpack.Progress] 84% sealing chunk id optimization
  315. 5:49:21 PM: <s> [webpack.Progress] 85% sealing after chunk id optimization
  316. 5:49:21 PM: <s> [webpack.Progress] 85% sealing after chunk id optimization
  317. 5:49:21 PM: <s> [webpack.Progress] 86% sealing record modules
  318. 5:49:21 PM: <s> [webpack.Progress] 86% sealing record modules RecordIdsPlugin
  319. 5:49:21 PM: <s> [webpack.Progress] 86% sealing record modules
  320. 5:49:21 PM: <s> [webpack.Progress] 86% sealing record chunks
  321. 5:49:21 PM: <s> [webpack.Progress] 86% sealing record chunks RecordIdsPlugin
  322. 5:49:21 PM: <s> [webpack.Progress] 86% sealing record chunks
  323. 5:49:21 PM: <s> [webpack.Progress] 87% sealing module hashing
  324. 5:49:21 PM: <s> [webpack.Progress] 87% sealing module hashing
  325. 5:49:21 PM: <s> [webpack.Progress] 87% sealing code generation
  326. 5:49:21 PM: <s> [webpack.Progress] 87% sealing code generation
  327. 5:49:21 PM: <s> [webpack.Progress] 88% sealing runtime requirements
  328. 5:49:21 PM: <s> [webpack.Progress] 88% sealing runtime requirements
  329. 5:49:21 PM: <s> [webpack.Progress] 89% sealing hashing
  330. 5:49:21 PM: <s> [webpack.Progress] 89% sealing hashing
  331. 5:49:21 PM: <s> [webpack.Progress] 89% sealing after hashing
  332. 5:49:21 PM: <s> [webpack.Progress] 89% sealing after hashing
  333. 5:49:21 PM: <s> [webpack.Progress] 90% sealing record hash
  334. 5:49:21 PM: <s> [webpack.Progress] 90% sealing record hash
  335. 5:49:21 PM: <s> [webpack.Progress] 91% sealing module assets processing
  336. 5:49:21 PM: <s> [webpack.Progress] 91% sealing module assets processing
  337. 5:49:21 PM: <s> [webpack.Progress] 91% sealing chunk assets processing
  338. 5:49:21 PM: <s> [webpack.Progress] 91% sealing chunk assets processing
  339. 5:49:21 PM: <s> [webpack.Progress] 92% sealing asset processing
  340. 5:49:21 PM: <s> [webpack.Progress] 92% sealing asset processing copy-webpack-plugin
  341. 5:49:21 PM: (node:1693) [DEP_WEBPACK_TEMPLATE_PATH_PLUGIN_REPLACE_PATH_VARIABLES_HASH] DeprecationWarning: [hash] is now [fullhash] (also consider using [chunkhash] or [contenthash], see documentation for details)
  342. 5:49:21 PM: (Use `node --trace-deprecation ...` to show where the warning was created)
  343. 5:49:21 PM: <s> [webpack.Progress] 92% sealing asset processing PersistentChildCompilerSingletonPlugin
  344. 5:49:21 PM: <s> [webpack.Progress] 92% sealing asset processing FaviconsWebpackPlugin
  345. 5:49:21 PM: <s> [webpack.Progress] 92% sealing asset processing TerserPlugin
  346. 5:49:21 PM: <s> [webpack.Progress] 92% sealing asset processing HtmlWebpackPlugin
  347. 5:49:21 PM: <s> [webpack.Progress] 92% sealing asset processing RealContentHashPlugin
  348. 5:49:21 PM: <s> [webpack.Progress] 92% sealing asset processing
  349. 5:49:21 PM: <s> [webpack.Progress] 93% sealing after asset optimization
  350. 5:49:21 PM: <s> [webpack.Progress] 93% sealing after asset optimization
  351. 5:49:21 PM: <s> [webpack.Progress] 93% sealing recording
  352. 5:49:21 PM: <s> [webpack.Progress] 93% sealing recording
  353. 5:49:21 PM: <s> [webpack.Progress] 94% sealing after seal
  354. 5:49:21 PM: <s> [webpack.Progress] 94% sealing after seal
  355. 5:49:21 PM: <s> [webpack.Progress] 95% emitting emit
  356. 5:49:21 PM: <s> [webpack.Progress] 95% emitting emit clean-webpack-plugin
  357. 5:49:21 PM: <s> [webpack.Progress] 95% emitting emit ImageminPlugin
  358. 5:49:22 PM: (node:1693) [DEP_WEBPACK_COMPILATION_ASSETS] DeprecationWarning: Compilation.assets will be frozen in future, all modifications are deprecated.
  359. 5:49:22 PM: BREAKING CHANGE: No more changes should happen to Compilation.assets after sealing the Compilation.
  360. 5:49:22 PM: Do changes to assets earlier, e. g. in Compilation.hooks.processAssets.
  361. 5:49:22 PM: Make sure to select an appropriate stage from Compilation.PROCESS_ASSETS_STAGE_*.
  362. 5:51:13 PM: <s> [webpack.Progress] 95% emitting emit
  363. 5:51:13 PM: <s> [webpack.Progress] 98% emitting after emit
  364. 5:51:13 PM: <s> [webpack.Progress] 98% emitting after emit SizeLimitsPlugin
  365. 5:51:13 PM: <s> [webpack.Progress] 98% emitting after emit
  366. 5:51:13 PM: <s> [webpack.Progress] 99% done plugins
  367. 5:51:13 PM: <s> [webpack.Progress] 99% done plugins clean-webpack-plugin
  368. 5:51:13 PM: <s> [webpack.Progress] 99% done plugins
  369. 5:51:13 PM: <s> [webpack.Progress] 99%
  370. 5:51:13 PM: <s> [webpack.Progress] 99% cache store build dependencies
  371. 5:51:13 PM: <s> [webpack.Progress] 99% cache store build dependencies
  372. 5:51:13 PM: <s> [webpack.Progress] 99% cache begin idle
  373. 5:51:13 PM: <s> [webpack.Progress] 99% cache begin idle
  374. 5:51:13 PM: <s> [webpack.Progress] 100%
  375. 5:51:13 PM: <s> [webpack.Progress] 99% cache shutdown
  376. 5:51:13 PM: <s> [webpack.Progress] 99% cache shutdown
  377. 5:51:13 PM: <s> [webpack.Progress] 100%
  378. 5:51:14 PM: assets by path assets/*.png 3.12 MiB
  379. asset assets/apple-touch-startup-image-2732x2048.png 221 KiB [emitted]
  380. asset assets/apple-touch-startup-image-2048x2732.png 212 KiB [emitted]
  381. + 55 assets
  382. assets by path images/ 1.02 MiB 12 assets
  383. assets by chunk 45.3 KiB (name: app)
  384. asset app-49b7ad1fefeca26e122c.bundle.js 33 KiB [emitted] [immutable] [minimized] (name: app) 1 related asset
  385. asset app.css 12.3 KiB [emitted] (name: app)
  386. assets by path assets/*.json 1.66 KiB
  387. asset assets/manifest.json 1.25 KiB [emitted]
  388. asset assets/yandex-browser-manifest.json 419 bytes [emitted]
  389. asset assets/favicon.ico 32.5 KiB [emitted]
  390. asset ../_layouts/default.html 7.24 KiB [emitted]
  391. asset assets/browserconfig.xml 413 bytes [emitted]
  392. asset assets/manifest.webapp 352 bytes [emitted]
  393. Entrypoint app 45.3 KiB = app.css 12.3 KiB app-49b7ad1fefeca26e122c.bundle.js 33 KiB
  394. orphan modules 34.6 KiB (javascript) 937 bytes (runtime) [orphan] 9 modules
  395. runtime modules 663 bytes 3 modules
  396. cacheable modules 79.5 KiB (javascript) 12.2 KiB (css/mini-extract)
  397. modules by path ./_src/ 20.2 KiB (javascript) 12.2 KiB (css/mini-extract)
  398. ./_src/index.js + 1 modules 20.2 KiB [built] [code generated]
  399. css ./node_modules/css-loader/dist/cjs.js??ruleSet[1].rules[1].use[1]!./node_modules/postcss-loader/dist/cjs.js??ruleSet[1].rules[1].use[2]!./node_modules/sass-loader/dist/cjs.js!./_src/index.scss 12.2 KiB [built] [code generated]
  400. 29535 ms -> 1125 ms ->
  401. 0 ms (resolving: 0 ms, restoring: 0 ms, integration: 0 ms, building: 0 ms, storing: 0 ms)
  402. modules by path ./node_modules/ 59.3 KiB
  403. ./node_modules/producthunt-floating-prompt/lib/producthunt-floating-prompt.js 25.3 KiB [built] [code generated]
  404. 29535 ms ->
  405. 0 ms (resolving: 0 ms, restoring: 0 ms, integration: 0 ms, building: 0 ms, storing: 0 ms)
  406. ./node_modules/darkmode-js/lib/darkmode-js.js 34 KiB [built] [code generated]
  407. 29535 ms ->
  408. 0 ms (resolving: 0 ms, restoring: 0 ms, integration: 0 ms, building: 0 ms, storing: 0 ms)
  409.  
  410. LOG from webpack.Compilation.ModuleProfile
  411. <e> | 28591 ms resolve to new modules > ./_src/index.js
  412. <e> 28679 ms resolve to new modules
  413. <w> | | 944 ms build modules > ./_src/index.js
  414. <w> | 944 ms build modules > 1 x javascript/auto with ./node_modules/babel-loader/lib/index.js??ruleSet[1].rules[0].use
  415. <i> | | 490 ms (parallelism 2.3) build modules > ./_src/index.scss
  416. <i> | 490 ms build modules > 1 x javascript/auto with ./node_modules/mini-css-extract-plugin/dist/loader.js!./node_modules/css-loader/dist/cjs.js??ruleSet[1].rules[1].use[1]!./node_modules/postcss-loader/dist/cjs.js??ruleSet[1].rules[1].use[2]!./node_modules/sass-loader/dist/cjs.js
  417. <i> | | 414 ms (parallelism 2.3) build modules > ./_src/index.scss.webpack[javascript/auto]!=!./node_modules/css-loader/dist/cjs.js??ruleSet[1].rules[1].use[1]!./node_modules/postcss-loader/dist/cjs.js??ruleSet[1].rules[1].use[2]!./node_modules/sass-loader/dist/cjs.js!./_src/index.scss
  418. <i> | 414 ms build modules > 1 x javascript/auto with ./node_modules/css-loader/dist/cjs.js??ruleSet[1].rules[1].use[1]!./node_modules/postcss-loader/dist/cjs.js??ruleSet[1].rules[1].use[2]!./node_modules/sass-loader/dist/cjs.js
  419. <w> 1947 ms build modules
  420. + 5 hidden lines
  421.  
  422. WARNING in asset size limit: The following asset(s) exceed the recommended size limit (244 KiB).
  423. This can impact web performance.
  424. Assets:
  425. images/screenshots/1.png (258 KiB)
  426. images/screenshots/3.png (298 KiB)
  427. images/screenshots/4.png (301 KiB)
  428.  
  429. WARNING in webpack performance recommendations:
  430. You can limit the size of your bundles by using import() or require.ensure to lazy load some parts of your application.
  431. For more info visit https://webpack.js.org/guides/code-splitting/
  432.  
  433. webpack 5.71.0 compiled with 2 warnings in 142877 ms
  434. Configuration file: /opt/build/repo/_config.yml
  435. 5:51:14 PM: Source: /opt/build/repo
  436. 5:51:14 PM: Destination: /opt/build/repo/_site
  437. 5:51:14 PM: Incremental build: disabled. Enable with --incremental
  438. 5:51:14 PM: Generating...
  439. 5:51:14 PM: ------------------------------------------------
  440. 5:51:14 PM: Jekyll 4.2.1 Please append `--trace` to the `build` command
  441. 5:51:14 PM: for any additional information or backtrace.
  442. 5:51:14 PM: ------------------------------------------------
  443. 5:51:14 PM: /opt/build/cache/bundle/ruby/2.7.0/gems/safe_yaml-1.0.5/lib/safe_yaml/load.rb:143:in `parse': (/opt/build/repo/_data/app.yml): could not find expected ':' while scanning a simple key at line 6 column 1 (Psych::SyntaxError)
  444. from /opt/build/cache/bundle/ruby/2.7.0/gems/safe_yaml-1.0.5/lib/safe_yaml/load.rb:143:in `load'
  445. from /opt/build/cache/bundle/ruby/2.7.0/gems/safe_yaml-1.0.5/lib/safe_yaml/load.rb:157:in `block in load_file'
  446. from /opt/build/cache/bundle/ruby/2.7.0/gems/safe_yaml-1.0.5/lib/safe_yaml/load.rb:157:in `open'
  447. from /opt/build/cache/bundle/ruby/2.7.0/gems/safe_yaml-1.0.5/lib/safe_yaml/load.rb:157:in `load_file'
  448. from /opt/build/cache/bundle/ruby/2.7.0/gems/jekyll-4.2.1/lib/jekyll/readers/data_reader.rb:70:in `read_data_file'
  449. from /opt/build/cache/bundle/ruby/2.7.0/gems/jekyll-4.2.1/lib/jekyll/readers/data_reader.rb:48:in `block in read_data_to'
  450. from /opt/build/cache/bundle/ruby/2.7.0/gems/jekyll-4.2.1/lib/jekyll/readers/data_reader.rb:40:in `each'
  451. from /opt/build/cache/bundle/ruby/2.7.0/gems/jekyll-4.2.1/lib/jekyll/readers/data_reader.rb:40:in `read_data_to'
  452. from /opt/build/cache/bundle/ruby/2.7.0/gems/jekyll-4.2.1/lib/jekyll/readers/data_reader.rb:22:in `read'
  453. from /opt/build/cache/bundle/ruby/2.7.0/gems/jekyll-4.2.1/lib/jekyll/reader.rb:19:in `read'
  454. from /opt/build/cache/bundle/ruby/2.7.0/gems/jekyll-4.2.1/lib/jekyll/site.rb:181:in `read'
  455. from /opt/build/cache/bundle/ruby/2.7.0/gems/jekyll-4.2.1/lib/jekyll/site.rb:78:in `process'
  456. from /opt/build/cache/bundle/ruby/2.7.0/gems/jekyll-4.2.1/lib/jekyll/command.rb:28:in `process_site'
  457. from /opt/build/cache/bundle/ruby/2.7.0/gems/jekyll-4.2.1/lib/jekyll/commands/build.rb:65:in `build'
  458. from /opt/build/cache/bundle/ruby/2.7.0/gems/jekyll-4.2.1/lib/jekyll/commands/build.rb:36:in `process'
  459. from /opt/build/cache/bundle/ruby/2.7.0/gems/jekyll-4.2.1/lib/jekyll/command.rb:91:in `block in process_with_graceful_fail'
  460. from /opt/build/cache/bundle/ruby/2.7.0/gems/jekyll-4.2.1/lib/jekyll/command.rb:91:in `each'
  461. from /opt/build/cache/bundle/ruby/2.7.0/gems/jekyll-4.2.1/lib/jekyll/command.rb:91:in `process_with_graceful_fail'
  462. from /opt/build/cache/bundle/ruby/2.7.0/gems/jekyll-4.2.1/lib/jekyll/commands/build.rb:18:in `block (2 levels) in init_with_program'
  463. from /opt/build/cache/bundle/ruby/2.7.0/gems/mercenary-0.4.0/lib/mercenary/command.rb:221:in `block in execute'
  464. from /opt/build/cache/bundle/ruby/2.7.0/gems/mercenary-0.4.0/lib/mercenary/command.rb:221:in `each'
  465. from /opt/build/cache/bundle/ruby/2.7.0/gems/mercenary-0.4.0/lib/mercenary/command.rb:221:in `execute'
  466. from /opt/build/cache/bundle/ruby/2.7.0/gems/mercenary-0.4.0/lib/mercenary/program.rb:44:in `go'
  467. from /opt/build/cache/bundle/ruby/2.7.0/gems/mercenary-0.4.0/lib/mercenary.rb:21:in `program'
  468. from /opt/build/cache/bundle/ruby/2.7.0/gems/jekyll-4.2.1/exe/jekyll:15:in `<top (required)>'
  469. from /opt/build/cache/bundle/ruby/2.7.0/bin/jekyll:23:in `load'
  470. from /opt/build/cache/bundle/ruby/2.7.0/bin/jekyll:23:in `<main>'
  471. from /opt/build/cache/bundle/ruby/2.7.0/bin/ruby_executable_hooks:24:in `eval'
  472. from /opt/build/cache/bundle/ruby/2.7.0/bin/ruby_executable_hooks:24:in `<main>'
  473. npm ERR! code ELIFECYCLE
  474. 5:51:14 PM: npm ERR! errno 1
  475. 5:51:14 PM: npm ERR! mobile-app-landingpage-template@1.0.0 build: `npm run-script clean:project && cross-env NODE_ENV=production webpack --env config=prod --progress --profile --color && cross-env JEKYLL_ENV=production bundle exec jekyll build`
  476. 5:51:14 PM: npm ERR! Exit status 1
  477. 5:51:14 PM: npm ERR!
  478. 5:51:14 PM: npm ERR! Failed at the mobile-app-landingpage-template@1.0.0 build script.
  479. 5:51:14 PM: npm ERR! This is probably not a problem with npm. There is likely additional logging output above.
  480. 5:51:14 PM: npm ERR! A complete log of this run can be found in:
  481. 5:51:14 PM: npm ERR! /opt/buildhome/.npm/_logs/2022-04-03T15_51_14_243Z-debug.log
  482. 5:51:14 PM: ​
  483. 5:51:14 PM: ────────────────────────────────────────────────────────────────
  484. 5:51:14 PM: "build.command" failed
  485. 5:51:14 PM: Creating deploy upload records
  486. 5:51:14 PM: ────────────────────────────────────────────────────────────────
  487. 5:51:14 PM: ​
  488. 5:51:14 PM: Error message
  489. 5:51:14 PM: Command failed with exit code 1: npm run build (https://ntl.fyi/exit-code-1)
  490. 5:51:14 PM: ​
  491. 5:51:14 PM: Error location
  492. 5:51:15 PM: Failed during stage 'building site': Build script returned non-zero exit code: 2 (https://ntl.fyi/exit-code-2)
  493. 5:51:14 PM: In build.command from netlify.toml:
  494. 5:51:14 PM: npm run build
  495. 5:51:14 PM: ​
  496. 5:51:14 PM: Resolved config
  497. 5:51:14 PM: build:
  498. 5:51:14 PM: command: npm run build
  499. 5:51:14 PM: commandOrigin: config
  500. 5:51:14 PM: publish: /opt/build/repo/_site
  501. 5:51:14 PM: publishOrigin: config
  502. 5:51:14 PM: Caching artifacts
  503. 5:51:14 PM: Started saving ruby gems
  504. 5:51:14 PM: Finished saving ruby gems
  505. 5:51:14 PM: Started saving node modules
  506. 5:51:14 PM: Finished saving node modules
  507. 5:51:14 PM: Started saving build plugins
  508. 5:51:14 PM: Finished saving build plugins
  509. 5:51:14 PM: Started saving pip cache
  510. 5:51:14 PM: Finished saving pip cache
  511. 5:51:14 PM: Started saving emacs cask dependencies
  512. 5:51:14 PM: Finished saving emacs cask dependencies
  513. 5:51:14 PM: Started saving maven dependencies
  514. 5:51:14 PM: Finished saving maven dependencies
  515. 5:51:14 PM: Started saving boot dependencies
  516. 5:51:14 PM: Finished saving boot dependencies
  517. 5:51:14 PM: Started saving rust rustup cache
  518. 5:51:14 PM: Finished saving rust rustup cache
  519. 5:51:14 PM: Started saving go dependencies
  520. 5:51:14 PM: Finished saving go dependencies
  521. 5:51:14 PM: Build failed due to a user error: Build script returned non-zero exit code: 2
  522. 5:51:15 PM: Failing build: Failed to build site
  523. 5:51:15 PM: Finished processing build request in 3m2.750512843s
Advertisement
RAW Paste Data Copied
Advertisement