SHARE
TWEET

Untitled

a guest Apr 27th, 2019 77 in 305 days
Not a member of Pastebin yet? Sign Up, it unlocks many cool features!
  1. LANG=C sbopkg -i wine-nine-standalone    
  2. Both a queuefile and a package were found with the name
  3. "wine-nine-standalone".
  4.  
  5. Use (Q)ueuefile, (P)ackage, or (A)bort?: p
  6.  
  7. ###########################################
  8.        New queue process started on:
  9.        Sat Apr 27 17:59:22 CEST 2019
  10. ###########################################
  11.  
  12. +++++++++++++++++++++++++++++++++++++++++++
  13. PRE-CHECK LOG
  14. Using the SBo repository for Slackware 14.2
  15. Queue Process:  Download, build, and install
  16.  
  17. wine-nine-standalone:
  18.   Checking GPG for wine-nine-standalone.tar.gz ... OK
  19.   Processing wine-nine-standalone 0.4-1
  20.   Using original .info file
  21.   Using original SlackBuild file
  22.   No build options selected.
  23.  
  24. +++++++++++++++++++++++++++++++++++++++++++
  25.  
  26. Pre-check complete.
  27.  
  28. Do you wish to proceed based on the search results above? Packages not
  29. found will be skipped during the process.
  30.  
  31. (P)roceed or (Q)uit?: p
  32.  
  33.  
  34. Processing wine-nine-standalone
  35.  
  36. wine-nine-standalone:
  37. Found wine-nine-standalone-0.4.tar.gz in /var/cache/sbopkg.
  38. Checking MD5SUM:
  39.   MD5SUM check for wine-nine-standalone-0.4.tar.gz ... OK
  40. Building package for wine-nine-standalone...
  41. wine-nine-standalone-0.4/
  42. wine-nine-standalone-0.4/.travis.yml
  43. wine-nine-standalone-0.4/LICENSE
  44. wine-nine-standalone-0.4/README.rst
  45. wine-nine-standalone-0.4/bootstrap.sh
  46. wine-nine-standalone-0.4/common/
  47. wine-nine-standalone-0.4/common/library.c
  48. wine-nine-standalone-0.4/common/library.h
  49. wine-nine-standalone-0.4/common/meson.build
  50. wine-nine-standalone-0.4/common/registry.c
  51. wine-nine-standalone-0.4/common/registry.h
  52. wine-nine-standalone-0.4/d3d9-nine/
  53. wine-nine-standalone-0.4/d3d9-nine/backend.c
  54. wine-nine-standalone-0.4/d3d9-nine/backend.h
  55. wine-nine-standalone-0.4/d3d9-nine/d3d9.spec
  56. wine-nine-standalone-0.4/d3d9-nine/d3d9_main.c
  57. wine-nine-standalone-0.4/d3d9-nine/d3dadapter9.c
  58. wine-nine-standalone-0.4/d3d9-nine/d3dadapter9.h
  59. wine-nine-standalone-0.4/d3d9-nine/device_wrap.c
  60. wine-nine-standalone-0.4/d3d9-nine/device_wrap.h
  61. wine-nine-standalone-0.4/d3d9-nine/dri2.c
  62. wine-nine-standalone-0.4/d3d9-nine/dri3.c
  63. wine-nine-standalone-0.4/d3d9-nine/meson.build
  64. wine-nine-standalone-0.4/d3d9-nine/present.c
  65. wine-nine-standalone-0.4/d3d9-nine/present.h
  66. wine-nine-standalone-0.4/d3d9-nine/shader_validator.c
  67. wine-nine-standalone-0.4/d3d9-nine/shader_validator.h
  68. wine-nine-standalone-0.4/d3d9-nine/version.rc
  69. wine-nine-standalone-0.4/d3d9-nine/wndproc.c
  70. wine-nine-standalone-0.4/d3d9-nine/wndproc.h
  71. wine-nine-standalone-0.4/d3d9-nine/xcb_present.c
  72. wine-nine-standalone-0.4/d3d9-nine/xcb_present.h
  73. wine-nine-standalone-0.4/meson.build
  74. wine-nine-standalone-0.4/meson_options.txt
  75. wine-nine-standalone-0.4/ninewinecfg/
  76. wine-nine-standalone-0.4/ninewinecfg/main.c
  77. wine-nine-standalone-0.4/ninewinecfg/meson.build
  78. wine-nine-standalone-0.4/ninewinecfg/ninewinecfg.manifest
  79. wine-nine-standalone-0.4/ninewinecfg/ninewinecfg.rc
  80. wine-nine-standalone-0.4/ninewinecfg/nls/
  81. wine-nine-standalone-0.4/ninewinecfg/nls/deu.rc
  82. wine-nine-standalone-0.4/ninewinecfg/nls/eng.rc
  83. wine-nine-standalone-0.4/ninewinecfg/nls/fra.rc
  84. wine-nine-standalone-0.4/ninewinecfg/nls/hun.rc
  85. wine-nine-standalone-0.4/ninewinecfg/resource.h
  86. wine-nine-standalone-0.4/packaging/
  87. wine-nine-standalone-0.4/packaging/SPECS/
  88. wine-nine-standalone-0.4/packaging/SPECS/wine-nine-unstable.spec
  89. wine-nine-standalone-0.4/packaging/SPECS/wine-nine.spec
  90. wine-nine-standalone-0.4/release.sh
  91. wine-nine-standalone-0.4/tools/
  92. wine-nine-standalone-0.4/tools/.gitignore
  93. wine-nine-standalone-0.4/tools/cross-wine32.in
  94. wine-nine-standalone-0.4/tools/cross-wine64.in
  95. wine-nine-standalone-0.4/tools/get_version.sh
  96. wine-nine-standalone-0.4/tools/nine-install.sh
  97. found slackware compatible distro
  98. The Meson build system
  99. Version: 0.50.1
  100. Source dir: /tmp/SBo/wine-nine-standalone-0.4
  101. Build dir: /tmp/SBo/wine-nine-standalone-0.4/build32
  102. Build type: cross build
  103. Program tools/get_version.sh found: YES (/tmp/SBo/wine-nine-standalone-0.4/tools/get_version.sh)
  104. Project name: Gallium Nine Standalone
  105. Project version: 0.4.0.0-release
  106. Appending CFLAGS from environment: '-O2 -fPIC'
  107. Native C compiler: ccache cc (gcc 8.3.0 "cc (GCC) 8.3.0")
  108. Cross C compiler: winegcc (gcc 8.3.0)
  109. Host machine cpu family: x86
  110. Host machine cpu: i686
  111. Target machine cpu family: x86
  112. Target machine cpu: i686
  113. Build machine cpu family: x86
  114. Build machine cpu: i686
  115. Program winegcc found: YES (/usr/bin/winegcc)
  116. Checking if "winelib check" compiles: YES
  117. Library wine found: YES
  118. Has header "wine/debug.h" with dependency -lwine: YES
  119. Program wrc found: YES (/usr/bin/wrc)
  120. Checking for function "dlopen" : NO
  121. Library dl found: YES
  122. Checking for function "dlopen" with dependency -ldl: YES
  123. Checking for function "dlclose" with dependency -ldl: YES
  124. Checking for function "dlsym" with dependency -ldl: YES
  125. Checking for function "dladdr" with dependency -ldl: YES
  126. Found pkg-config: /usr/bin/32/i586-slackware-linux-gnu-pkg-config (0.29.2)
  127. Cross dependency d3d found: YES 1.0.0
  128. Cross dependency x11 found: YES 1.6.7
  129. Cross dependency x11-xcb found: YES 1.6.7
  130. Cross dependency xcb found: YES 1.13.1
  131. Cross dependency xcb-dri3 found: YES 1.13.1
  132. Cross dependency xcb-present found: YES 1.13.1
  133. Cross dependency xcb-xfixes found: YES 1.13.1
  134. Cross dependency gl found: YES 19.0.3
  135. Cross dependency egl found: YES 19.0.3
  136. Cross dependency xcb-dri2 found: YES 1.13.1
  137. Message: DRI2 support is enabled
  138. Library dxguid found: YES
  139. Library uuid found: YES
  140. Library advapi32 found: YES
  141. Library gdi32 found: YES
  142. Library user32 found: YES
  143. Library shell32 found: YES
  144. Library comctl32 found: YES
  145. Library ole32 found: YES
  146. Library shlwapi found: YES
  147. Message: d3dadapter9.so.1 default module path: /usr/lib64/d3d
  148. d3d9-nine/meson.build:53: WARNING: extract_all_objects called without setting recursive keyword argument. Meson currently defaults to non-recursive to maintain backward compatibility but the default will be changed in the future.
  149. Build targets in project: 7
  150. Option buildtype is: plain [default: debugoptimized]
  151. Found ninja-1.7.2 at /usr/bin/ninja
  152. ninja: Entering directory `build32'
  153. [1/20] Generating version.res with a custom command.
  154. [2/20] Compiling C object 'common/92a5dc0@@d3d9common@sta/library.c.o'.
  155. [3/20] Compiling C object 'common/92a5dc0@@d3d9common@sta/registry.c.o'.
  156. [4/20] Compiling C object 'd3d9-nine/97cc0d2@@d3d9-nine.dll@sha/shader_validator.c.o'.
  157. [5/20] Linking static target common/libd3d9common.a.
  158. [6/20] Compiling C object 'd3d9-nine/97cc0d2@@d3d9-nine.dll@sha/backend.c.o'.
  159. [7/20] Compiling C object 'd3d9-nine/97cc0d2@@d3d9-nine.dll@sha/dri3.c.o'.
  160. [8/20] Generating ninewinecfg.res with a custom command.
  161. [9/20] Compiling C object 'd3d9-nine/97cc0d2@@d3d9-nine.dll@sha/dri2.c.o'.
  162. [10/20] Compiling C object 'd3d9-nine/97cc0d2@@d3d9-nine.dll@sha/wndproc.c.o'.
  163. [11/20] Compiling C object 'd3d9-nine/97cc0d2@@d3d9-nine.dll@sha/d3d9_main.c.o'.
  164. [12/20] Compiling C object 'd3d9-nine/97cc0d2@@d3d9-nine.dll@sha/xcb_present.c.o'.
  165. [13/20] Compiling C object 'd3d9-nine/97cc0d2@@d3d9-nine.dll@sha/d3dadapter9.c.o'.
  166. [14/20] Compiling C object 'd3d9-nine/97cc0d2@@d3d9-nine.dll@sha/device_wrap.c.o'.
  167. [15/20] Compiling C object 'd3d9-nine/97cc0d2@@d3d9-nine.dll@sha/present.c.o'.
  168. [16/20] Linking target d3d9-nine/d3d9-nine.dll.fake.
  169. [17/20] Compiling C object 'ninewinecfg/1fc6eb9@@ninewinecfg.exe.so@exe/main.c.o'.
  170. [18/20] Linking target ninewinecfg/ninewinecfg.exe.fake.
  171. [19/20] Linking target d3d9-nine/d3d9-nine.dll.so.
  172. FAILED: d3d9-nine/d3d9-nine.dll.so
  173. winegcc  -o d3d9-nine/d3d9-nine.dll.so d3d9-nine/version.res 'd3d9-nine/97cc0d2@@d3d9-nine.dll@sha/backend.c.o' 'd3d9-nine/97cc0d2@@d3d9-nine.dll@sha/d3d9_main.c.o' 'd3d9-nine/97cc0d2@@d3d9-nine.dll@sha/d3dadapter9.c.o' 'd3d9-nine/97cc0d2@@d3d9-nine.dll@sha/device_wrap.c.o' 'd3d9-nine/97cc0d2@@d3d9-nine.dll@sha/dri2.c.o' 'd3d9-nine/97cc0d2@@d3d9-nine.dll@sha/dri3.c.o' 'd3d9-nine/97cc0d2@@d3d9-nine.dll@sha/present.c.o' 'd3d9-nine/97cc0d2@@d3d9-nine.dll@sha/shader_validator.c.o' 'd3d9-nine/97cc0d2@@d3d9-nine.dll@sha/wndproc.c.o' 'd3d9-nine/97cc0d2@@d3d9-nine.dll@sha/xcb_present.c.o' ../d3d9-nine/d3d9.spec -Wl,--no-undefined -Wl,--as-needed -shared -fPIC -Wl,--start-group -Wl,-soname,d3d9-nine.dll.so -m32 -mwindows common/libd3d9common.a -ldl /usr/lib64/libX11.so /usr/lib64/libX11-xcb.so /usr/lib64/libxcb.so /usr/lib64/libxcb-dri2.so /usr/lib64/libxcb-dri3.so /usr/lib64/libxcb-present.so /usr/lib64/libxcb-xfixes.so -ldxguid -luuid -ladvapi32 -luser32 -Wl,--end-group '-Wl,-rpath,$ORIGIN/../common' -Wl,-rpath-link,/tmp/SBo/wine-nine-standalone-0.4/build32/common
  174. /usr/bin/ld: /usr/lib64/libX11.so: error adding symbols: file in wrong format
  175. collect2: error: ld returned 1 exit status
  176. winegcc: /usr/bin/gcc failed
  177. [20/20] Linking target ninewinecfg/ninewinecfg.exe.so.
  178. ninja: build stopped: subcommand failed.
  179.  
  180. wine-nine-standalone:
  181. Would you like to continue processing the rest of the
  182. queue or would you like to abort?  If this failed
  183. package is a dependency of another package in the queue
  184. then it may not make sense to continue.
  185.  
  186. (Y)es to continue, (N)o to abort, (R)etry the build?:
RAW Paste Data
We use cookies for various purposes including analytics. By continuing to use Pastebin, you agree to our use of cookies as described in the Cookies Policy. OK, I Understand
 
Top