abirama62

log_error_web_app

Jul 12th, 2021
838
73 days
Not a member of Pastebin yet? Sign Up, it unlocks many cool features!
  1. 2021-07-12 20:11:11.542 [DEBUG] org.jleaf.release.app.util.SvnUtil:677 - [INFO] [INFO] ------------------------------------------------------------------------
  2. 2021-07-12 20:11:11.543 [DEBUG] org.jleaf.release.app.util.SvnUtil:677 - [INFO] [INFO] BUILD FAILURE
  3. 2021-07-12 20:11:11.543 [DEBUG] org.jleaf.release.app.util.SvnUtil:677 - [INFO] [INFO] ------------------------------------------------------------------------
  4. 2021-07-12 20:11:11.544 [DEBUG] org.jleaf.release.app.util.SvnUtil:677 - [INFO] [INFO] Total time:  02:50 min
  5. 2021-07-12 20:11:11.546 [DEBUG] org.jleaf.release.app.util.SvnUtil:677 - [INFO] [INFO] Finished at: 2021-07-12T20:11:11+07:00
  6. 2021-07-12 20:11:11.548 [DEBUG] org.jleaf.release.app.util.SvnUtil:677 - [INFO] [INFO] ------------------------------------------------------------------------
  7. 2021-07-12 20:11:11.558 [DEBUG] org.jleaf.release.app.util.SvnUtil:677 - [INFO] [ERROR] Failed to execute goal on project web-app-cland: Could not resolve dependencies for project org.jleaf.erp:web-app-cland:war:3.5.7.5.CLAND: Failed to collect dependencies at org.jleaf.erp:import-data-api:jar:3.5.8: Failed to read artifact descriptor for org.jleaf.erp:import-data-api:jar:3.5.8: Could not transfer artifact org.jleaf.erp:parent-pom:pom:3.5.7-WITH-IMPORT-DATA from/to maven-2 (http://repo1.maven.org/maven2): Transfer failed for http://repo1.maven.org/maven2/org/jleaf/erp/parent-pom/3.5.7-WITH-IMPORT-DATA/parent-pom-3.5.7-WITH-IMPORT-DATA.pom 501 HTTPS Required -> [Help 1]
  8. 2021-07-12 20:11:11.559 [DEBUG] org.jleaf.release.app.util.SvnUtil:677 - [INFO] [ERROR]
  9. 2021-07-12 20:11:11.560 [DEBUG] org.jleaf.release.app.util.SvnUtil:677 - [INFO] [ERROR] To see the full stack trace of the errors, re-run Maven with the -e switch.
  10. 2021-07-12 20:11:11.563 [DEBUG] org.jleaf.release.app.util.SvnUtil:677 - [INFO] [ERROR] Re-run Maven using the -X switch to enable full debug logging.
  11. 2021-07-12 20:11:11.564 [DEBUG] org.jleaf.release.app.util.SvnUtil:677 - [INFO] [ERROR]
  12. 2021-07-12 20:11:11.567 [DEBUG] org.jleaf.release.app.util.SvnUtil:677 - [INFO] [ERROR] For more information about the errors and possible solutions, please read the following articles:
  13. 2021-07-12 20:11:11.571 [DEBUG] org.jleaf.release.app.util.SvnUtil:677 - [INFO] [ERROR] [Help 1] http://cwiki.apache.org/confluence/display/MAVEN/DependencyResolutionException
  14. 2021-07-12 20:11:11.608 [DEBUG] org.jleaf.release.app.util.SvnUtil:677 - [INFO] ------------------------------------------------------------------------
  15. 2021-07-12 20:11:11.608 [DEBUG] org.jleaf.release.app.util.SvnUtil:677 - [INFO] BUILD FAILURE
  16. 2021-07-12 20:11:11.608 [DEBUG] org.jleaf.release.app.util.SvnUtil:677 - [INFO] ------------------------------------------------------------------------
  17. 2021-07-12 20:11:11.610 [DEBUG] org.jleaf.release.app.util.SvnUtil:677 - [INFO] Total time:  02:54 min
  18. 2021-07-12 20:11:11.610 [DEBUG] org.jleaf.release.app.util.SvnUtil:677 - [INFO] Finished at: 2021-07-12T20:11:11+07:00
  19. 2021-07-12 20:11:11.610 [DEBUG] org.jleaf.release.app.util.SvnUtil:677 - [INFO] ------------------------------------------------------------------------
  20. 2021-07-12 20:11:11.611 [DEBUG] org.jleaf.release.app.util.SvnUtil:677 - [ERROR] Failed to execute goal org.apache.maven.plugins:maven-release-plugin:2.5.3:prepare (default-cli) on project web-app-cland: Maven execution failed, exit code: '1' -> [Help 1]
  21. 2021-07-12 20:11:11.611 [DEBUG] org.jleaf.release.app.util.SvnUtil:677 - [ERROR]
  22. 2021-07-12 20:11:11.611 [DEBUG] org.jleaf.release.app.util.SvnUtil:677 - [ERROR] To see the full stack trace of the errors, re-run Maven with the -e switch.
  23. 2021-07-12 20:11:11.612 [DEBUG] org.jleaf.release.app.util.SvnUtil:677 - [ERROR] Re-run Maven using the -X switch to enable full debug logging.
  24. 2021-07-12 20:11:11.612 [DEBUG] org.jleaf.release.app.util.SvnUtil:677 - [ERROR]
  25. 2021-07-12 20:11:11.612 [DEBUG] org.jleaf.release.app.util.SvnUtil:677 - [ERROR] For more information about the errors and possible solutions, please read the following articles:
  26. 2021-07-12 20:11:11.612 [DEBUG] org.jleaf.release.app.util.SvnUtil:677 - [ERROR] [Help 1] http://cwiki.apache.org/confluence/display/MAVEN/MojoExecutionException
  27. 2021-07-12 20:11:11.626 [DEBUG] org.jleaf.release.app.util.SvnUtil:677 - Fail prepare release to svn 'web-app-cland'
  28. 2021-07-12 20:11:13.151 [DEBUG] org.jleaf.release.app.util.SvnUtil:677 - Retry [y/N] ? [INFO] Scanning for projects...
  29. 2021-07-12 20:11:13.673 [DEBUG] org.jleaf.release.app.util.SvnUtil:677 - [INFO]
  30. 2021-07-12 20:11:13.676 [DEBUG] org.jleaf.release.app.util.SvnUtil:677 - [INFO] --------------------< org.jleaf.erp:web-app-cland >---------------------
  31. 2021-07-12 20:11:13.677 [DEBUG] org.jleaf.release.app.util.SvnUtil:677 - [INFO] Building ERP Web Application 3.5.7.5.CLAND
  32. 2021-07-12 20:11:13.679 [DEBUG] org.jleaf.release.app.util.SvnUtil:677 - [INFO] --------------------------------[ war ]---------------------------------
  33. 2021-07-12 20:11:13.687 [DEBUG] org.jleaf.release.app.util.SvnUtil:677 - [INFO]
  34. 2021-07-12 20:11:13.690 [DEBUG] org.jleaf.release.app.util.SvnUtil:677 - [INFO] --- maven-release-plugin:2.5.3:rollback (default-cli) @ web-app-cland ---
  35. 2021-07-12 20:11:14.418 [DEBUG] org.jleaf.release.app.util.SvnUtil:677 - [INFO] Checking in modified POMs...
  36. 2021-07-12 20:11:14.438 [DEBUG] org.jleaf.release.app.util.SvnUtil:677 - [INFO] Executing: /bin/sh -c cd /home/sts/RELEASE_TEMP/temp-release-erp-enterprise/SOURCES/web-app-cland && svn --username abirama --password '*****' --no-auth-cache --non-interactive commit --file /tmp/maven-scm-1147484495.commit --targets /tmp/maven-scm-4332753584330986285-targets
  37. 2021-07-12 20:11:14.440 [DEBUG] org.jleaf.release.app.util.SvnUtil:677 - [INFO] Working directory: /home/sts/RELEASE_TEMP/temp-release-erp-enterprise/SOURCES/web-app-cland
  38. 2021-07-12 20:11:14.522 [DEBUG] org.jleaf.release.app.util.SvnUtil:677 - [INFO] Cleaning up after release...
  39. 2021-07-12 20:11:14.669 [DEBUG] org.jleaf.release.app.util.SvnUtil:677 - [INFO] ------------------------------------------------------------------------
  40. 2021-07-12 20:11:14.670 [DEBUG] org.jleaf.release.app.util.SvnUtil:677 - [INFO] BUILD SUCCESS
  41. 2021-07-12 20:11:14.670 [DEBUG] org.jleaf.release.app.util.SvnUtil:677 - [INFO] ------------------------------------------------------------------------
  42. 2021-07-12 20:11:14.671 [DEBUG] org.jleaf.release.app.util.SvnUtil:677 - [INFO] Total time:  1.553 s
  43. 2021-07-12 20:11:14.672 [DEBUG] org.jleaf.release.app.util.SvnUtil:677 - [INFO] Finished at: 2021-07-12T20:11:14+07:00
  44. 2021-07-12 20:11:14.672 [DEBUG] org.jleaf.release.app.util.SvnUtil:677 - [INFO] ------------------------------------------------------------------------
  45. 2021-07-12 20:11:16.090 [DEBUG] org.jleaf.release.app.util.SvnUtil:677 - [INFO] Scanning for projects...
  46. 2021-07-12 20:11:16.490 [DEBUG] org.jleaf.release.app.util.SvnUtil:677 - [INFO]
  47. 2021-07-12 20:11:16.492 [DEBUG] org.jleaf.release.app.util.SvnUtil:677 - [INFO] --------------------< org.jleaf.erp:web-app-cland >---------------------
  48. 2021-07-12 20:11:16.493 [DEBUG] org.jleaf.release.app.util.SvnUtil:677 - [INFO] Building ERP Web Application 3.5.7.5.CLAND-SNAPSHOT
  49. 2021-07-12 20:11:16.494 [DEBUG] org.jleaf.release.app.util.SvnUtil:677 - [INFO] --------------------------------[ war ]---------------------------------
  50. 2021-07-12 20:11:16.503 [DEBUG] org.jleaf.release.app.util.SvnUtil:677 - [INFO]
  51. 2021-07-12 20:11:16.510 [DEBUG] org.jleaf.release.app.util.SvnUtil:677 - [INFO] --- maven-release-plugin:2.5.3:clean (default-cli) @ web-app-cland ---
  52. 2021-07-12 20:11:17.024 [DEBUG] org.jleaf.release.app.util.SvnUtil:677 - [INFO] Cleaning up after release...
  53. 2021-07-12 20:11:17.079 [DEBUG] org.jleaf.release.app.util.SvnUtil:677 - [INFO] ------------------------------------------------------------------------
  54. 2021-07-12 20:11:17.080 [DEBUG] org.jleaf.release.app.util.SvnUtil:677 - [INFO] BUILD SUCCESS
  55. 2021-07-12 20:11:17.080 [DEBUG] org.jleaf.release.app.util.SvnUtil:677 - [INFO] ------------------------------------------------------------------------
  56. 2021-07-12 20:11:17.083 [DEBUG] org.jleaf.release.app.util.SvnUtil:677 - [INFO] Total time:  1.019 s
  57. 2021-07-12 20:11:17.084 [DEBUG] org.jleaf.release.app.util.SvnUtil:677 - [INFO] Finished at: 2021-07-12T20:11:17+07:00
  58. 2021-07-12 20:11:17.086 [DEBUG] org.jleaf.release.app.util.SvnUtil:677 - [INFO] ------------------------------------------------------------------------
  59. 2021-07-12 20:11:20.463 [DEBUG] org.jleaf.release.app.util.SvnUtil:677 - Sending        pom.xml
  60. 2021-07-12 20:11:20.465 [DEBUG] org.jleaf.release.app.util.SvnUtil:677 - Transmitting file data .done
  61. 2021-07-12 20:11:20.465 [DEBUG] org.jleaf.release.app.util.SvnUtil:677 - Committing transaction...
  62. 2021-07-12 20:11:21.287 [DEBUG] org.jleaf.release.app.util.SvnUtil:677 - Committed revision 9921.
  63. 2021-07-12 20:11:24.008 [DEBUG] org.jleaf.release.app.util.SvnUtil:683 - Output error :
  64. 2021-07-12 20:11:24.008 [DEBUG] org.jleaf.release.app.util.SvnUtil:691 - exit value : 28
  65. 2021-07-12 20:11:24.009 [ERROR] org.jleaf.release.app.controller.ReleaseAppController:556 - release error
  66. 28:
  67.     at org.jleaf.release.app.util.SvnUtil.releaseProjectWithParent(SvnUtil.java:699)
  68.     at org.jleaf.release.app.controller.ReleaseAppController.release(ReleaseAppController.java:786)
  69.     at org.jleaf.release.app.controller.ReleaseAppController.doRelease(ReleaseAppController.java:548)
  70.     at org.jleaf.release.app.ui.ReleaseAppFrame$9.run(ReleaseAppFrame.java:990)
  71.     at java.lang.Thread.run(Thread.java:662)
  72. 2021-07-12 20:11:24.009 [INFO] org.jleaf.release.app.ui.ReleaseAppFrame:782 - LOG INFO : web-app-cland ERROR
  73.  
RAW Paste Data