SHARE
TWEET

Untitled

a guest Mar 7th, 2015 232 Never
Not a member of Pastebin yet? Sign Up, it unlocks many cool features!
  1. ./compileblokel.sh
  2. [sudo] password for devmarth:
  3. Reading package lists... Done
  4. Building dependency tree      
  5. Reading state information... Done
  6. build-essential is already the newest version.
  7. cmake is already the newest version.
  8. libbz2-dev is already the newest version.
  9. libgettextpo-dev is already the newest version.
  10. libjpeg8-dev is already the newest version.
  11. libogg-dev is already the newest version.
  12. libpng12-dev is already the newest version.
  13. libsqlite3-dev is already the newest version.
  14. libvorbis-dev is already the newest version.
  15. libxxf86vm-dev is already the newest version.
  16. libhiredis-dev is already the newest version.
  17. libirrlicht-dev is already the newest version.
  18. libopenal-dev is already the newest version.
  19. git is already the newest version.
  20. libfreetype6-dev is already the newest version.
  21. libgl1-mesa-dev is already the newest version.
  22. 0 upgraded, 0 newly installed, 0 to remove and 183 not upgraded.
  23. Cloning into 'blokel'...
  24. remote: Counting objects: 30643, done.
  25. remote: Compressing objects: 100% (17/17), done.
  26. remote: Total 30643 (delta 6), reused 0 (delta 0), pack-reused 30626
  27. Receiving objects: 100% (30643/30643), 32.03 MiB | 2.88 MiB/s, done.
  28. Resolving deltas: 100% (20949/20949), done.
  29. Checking connectivity... done.
  30. Cloning into 'blokel_game'...
  31. remote: Counting objects: 2092, done.
  32. remote: Compressing objects: 100% (1976/1976), done.
  33. remote: Total 2092 (delta 93), reused 2092 (delta 93), pack-reused 0
  34. Receiving objects: 100% (2092/2092), 18.90 MiB | 2.87 MiB/s, done.
  35. Resolving deltas: 100% (93/93), done.
  36. Checking connectivity... done.
  37. -- The C compiler identification is GNU 4.9.1
  38. -- The CXX compiler identification is GNU 4.9.1
  39. -- Check for working C compiler: /usr/bin/cc
  40. -- Check for working C compiler: /usr/bin/cc -- works
  41. -- Detecting C compiler ABI info
  42. -- Detecting C compiler ABI info - done
  43. -- Check for working CXX compiler: /usr/bin/c++
  44. -- Check for working CXX compiler: /usr/bin/c++ -- works
  45. -- Detecting CXX compiler ABI info
  46. -- Detecting CXX compiler ABI info - done
  47. -- *** Will build version 0.4.12-dev ***
  48. -- IRRLICHT_SOURCE_DIR =
  49. -- IRRLICHT_INCLUDE_DIR = /usr/include/irrlicht
  50. -- IRRLICHT_LIBRARY = /usr/lib/i386-linux-gnu/libIrrlicht.so
  51. -- Found Irrlicht: /usr/lib/i386-linux-gnu/libIrrlicht.so  
  52. -- CURL_INCLUDE_DIR = /usr/include/curl
  53. -- CURL_LIBRARY = /usr/lib/i386-linux-gnu/libcurl.so
  54. -- CURL_DLL =
  55. -- cURL support enabled
  56. -- gettext include path: /usr/include
  57. -- gettext msgfmt path: /usr/bin/msgfmt
  58. -- GetText enabled; locales found: ja;it;id;pt_BR;be;ru;hu;nb;de;da;tr;zh_CN;es;fr;ko;cs;pt;ro;nl;pl;uk;ky;et;lt
  59. -- Found OpenAL: /usr/lib/i386-linux-gnu/libopenal.so  
  60. -- Found VORBIS: /usr/include  
  61. -- Sound enabled
  62. -- Looking for XOpenDisplay in /usr/lib/i386-linux-gnu/libX11.so;/usr/lib/i386-linux-gnu/libXext.so
  63. -- Looking for XOpenDisplay in /usr/lib/i386-linux-gnu/libX11.so;/usr/lib/i386-linux-gnu/libXext.so - found
  64. -- Looking for gethostbyname
  65. -- Looking for gethostbyname - found
  66. -- Looking for connect
  67. -- Looking for connect - found
  68. -- Looking for remove
  69. -- Looking for remove - found
  70. -- Looking for shmat
  71. -- Looking for shmat - found
  72. -- Found X11: /usr/lib/i386-linux-gnu/libX11.so
  73. -- Found OpenGL: /usr/lib/i386-linux-gnu/libGL.so  
  74. -- Found JPEG: /usr/lib/i386-linux-gnu/libjpeg.so  
  75. -- Found BZip2: /usr/lib/i386-linux-gnu/libbz2.so (found version "1.0.6")
  76. -- Looking for BZ2_bzCompressInit in /usr/lib/i386-linux-gnu/libbz2.so
  77. -- Looking for BZ2_bzCompressInit in /usr/lib/i386-linux-gnu/libbz2.so - found
  78. -- Found ZLIB: /usr/lib/i386-linux-gnu/libz.so (found version "1.2.8")
  79. -- Found PNG: /usr/lib/i386-linux-gnu/libpng.so (found version "1.2.51")
  80. -- Found SQLite3: /usr/lib/i386-linux-gnu/libsqlite3.so  
  81. -- Using project jsoncpp library
  82. -- Found PkgConfig: /usr/bin/pkg-config (found version "0.28")
  83. -- LuaJIT library: /usr/lib/i386-linux-gnu/libluajit-5.1.so
  84. -- LuaJIT headers: /usr/include/luajit-2.0
  85. -- LuaJIT found, checking for broken versions...
  86. -- Performing Test VALID_LUAJIT_VERSION
  87. -- Performing Test VALID_LUAJIT_VERSION - Success
  88. -- LuaJIT version ok
  89. -- LevelDB library: /usr/lib/i386-linux-gnu/libleveldb.so
  90. -- LevelDB headers: /usr/include/leveldb
  91. -- LevelDB backend enabled
  92. -- redis library: /usr/lib/i386-linux-gnu/libhiredis.so
  93. -- redis headers: /usr/include/hiredis
  94. -- redis backend enabled
  95. -- Looking for include file endian.h
  96. -- Looking for include file endian.h - found
  97. -- Could NOT find Doxygen (missing:  DOXYGEN_EXECUTABLE)
  98. -- Configuring done
  99. -- Generating done
  100. -- Build files have been written to: /home/devmarth/blokel
  101. Scanning dependencies of target GenerateVersion
  102. Scanning dependencies of target jsoncpp
  103. [  0%] Building CXX object src/json/CMakeFiles/jsoncpp.dir/jsoncpp.cpp.o
  104. -- *** Detected git version 0.4.11-317-g2f6f462 ***
  105. [  0%] Built target GenerateVersion
  106. Scanning dependencies of target cguittfont
  107. [  0%] Building CXX object src/cguittfont/CMakeFiles/cguittfont.dir/xCGUITTFont.cpp.o
  108. Linking CXX static library libcguittfont.a
  109. [  0%] Built target cguittfont
  110. Scanning dependencies of target translations
  111. [  1%] mo-update [lt]: Creating locale directory.
  112. [  1%] mo-update [ja]: Creating locale directory.
  113. [  2%] mo-update [it]: Creating locale directory.
  114. [  2%] mo-update [id]: Creating locale directory.
  115. [  2%] mo-update [pt_BR]: Creating locale directory.
  116. [  3%] mo-update [be]: Creating locale directory.
  117. [  3%] mo-update [ru]: Creating locale directory.
  118. [  3%] mo-update [hu]: Creating locale directory.
  119. [  4%] mo-update [nb]: Creating locale directory.
  120. [  4%] mo-update [de]: Creating locale directory.
  121. [  4%] mo-update [da]: Creating locale directory.
  122. [  5%] mo-update [tr]: Creating locale directory.
  123. [  5%] Linking CXX static library libjsoncpp.a
  124. mo-update [zh_CN]: Creating locale directory.
  125. [  5%] mo-update [es]: Creating locale directory.
  126. [  5%] Built target jsoncpp
  127. [  5%] mo-update [fr]: Creating locale directory.
  128. [  6%] mo-update [ko]: Creating locale directory.
  129. [  6%] mo-update [cs]: Creating locale directory.
  130. [  6%] Scanning dependencies of target minetest
  131. mo-update [pt]: Creating locale directory.
  132. [  7%] mo-update [ro]: Creating locale directory.
  133. [  7%] mo-update [nl]: Creating locale directory.
  134. [  7%] mo-update [pl]: Creating locale directory.
  135. [  8%] mo-update [uk]: Creating locale directory.
  136. [  8%] mo-update [ky]: Creating locale directory.
  137. [  8%] mo-update [et]: Creating locale directory.
  138. [  8%] mo-update [lt]: Creating mo file.
  139. [  8%] mo-update [ja]: Creating mo file.
  140. [  8%] mo-update [it]: Creating mo file.
  141. [  9%] mo-update [id]: Creating mo file.
  142. [  9%] mo-update [pt_BR]: Creating mo file.
  143. [  9%] mo-update [be]: Creating mo file.
  144. [ 10%] mo-update [ru]: Creating mo file.
  145. [ 10%] mo-update [hu]: Creating mo file.
  146. [ 10%] mo-update [nb]: Creating mo file.
  147. [ 11%] mo-update [de]: Creating mo file.
  148. [ 11%] mo-update [da]: Creating mo file.
  149. [ 11%] mo-update [tr]: Creating mo file.
  150. [ 11%] mo-update [zh_CN]: Creating mo file.
  151. [ 12%] mo-update [es]: Creating mo file.
  152. [ 12%] mo-update [fr]: Creating mo file.
  153. [ 12%] mo-update [ko]: Creating mo file.
  154. [ 13%] mo-update [cs]: Creating mo file.
  155. [ 13%] mo-update [pt]: Creating mo file.
  156. [ 13%] mo-update [ro]: Creating mo file.
  157. [ 14%] mo-update [nl]: Creating mo file.
  158. [ 14%] mo-update [pl]: Creating mo file.
  159. [ 14%] mo-update [uk]: Creating mo file.
  160. [ 15%] mo-update [ky]: Creating mo file.
  161. [ 15%] mo-update [et]: Creating mo file.
  162. [ 16%] [ 16%] Building CXX object src/CMakeFiles/minetest.dir/client/clientlauncher.cpp.o
  163. mo update
  164. [ 16%] Built target translations
  165. Scanning dependencies of target minetestserver
  166. [ 17%] Building CXX object src/CMakeFiles/minetestserver.dir/jthread/pthread/jevent.cpp.o
  167. [ 17%] Building CXX object src/CMakeFiles/minetestserver.dir/jthread/pthread/jmutex.cpp.o
  168. [ 17%] Building CXX object src/CMakeFiles/minetestserver.dir/jthread/pthread/jsemaphore.cpp.o
  169. [ 18%] Building CXX object src/CMakeFiles/minetestserver.dir/jthread/pthread/jthread.cpp.o
  170. [ 18%] Building CXX object src/CMakeFiles/minetestserver.dir/network/connection.cpp.o
  171. [ 19%] Building CXX object src/CMakeFiles/minetest.dir/client/tile.cpp.o
  172. [ 19%] Building CXX object src/CMakeFiles/minetestserver.dir/network/networkpacket.cpp.o
  173. [ 19%] Building CXX object src/CMakeFiles/minetest.dir/jthread/pthread/jevent.cpp.o
  174. [ 19%] Building CXX object src/CMakeFiles/minetest.dir/jthread/pthread/jmutex.cpp.o
  175. [ 20%] Building CXX object src/CMakeFiles/minetest.dir/jthread/pthread/jsemaphore.cpp.o
  176. [ 20%] Building CXX object src/CMakeFiles/minetest.dir/jthread/pthread/jthread.cpp.o
  177. [ 20%] Building CXX object src/CMakeFiles/minetest.dir/network/clientopcodes.cpp.o
  178. [ 20%] Building CXX object src/CMakeFiles/minetestserver.dir/network/packethandlers/server.cpp.o
  179. [ 21%] Building CXX object src/CMakeFiles/minetest.dir/network/connection.cpp.o
  180. [ 22%] Building CXX object src/CMakeFiles/minetestserver.dir/network/serveropcodes.cpp.o
  181. [ 22%] Building CXX object src/CMakeFiles/minetestserver.dir/script/common/c_content.cpp.o
  182. [ 22%] Building CXX object src/CMakeFiles/minetest.dir/network/networkpacket.cpp.o
  183. [ 22%] Building CXX object src/CMakeFiles/minetest.dir/network/packethandlers/client.cpp.o
  184. [ 22%] Building CXX object src/CMakeFiles/minetestserver.dir/script/common/c_converter.cpp.o
  185. [ 23%] Building CXX object src/CMakeFiles/minetestserver.dir/script/common/c_internal.cpp.o
  186. [ 23%] Building CXX object src/CMakeFiles/minetest.dir/network/packethandlers/server.cpp.o
  187. [ 23%] Building CXX object src/CMakeFiles/minetestserver.dir/script/common/c_types.cpp.o
  188. [ 23%] Building CXX object src/CMakeFiles/minetestserver.dir/script/cpp_api/s_async.cpp.o
  189. [ 24%] Building CXX object src/CMakeFiles/minetestserver.dir/script/cpp_api/s_base.cpp.o
  190. [ 24%] Building CXX object src/CMakeFiles/minetestserver.dir/script/cpp_api/s_entity.cpp.o
  191. [ 25%] Building CXX object src/CMakeFiles/minetest.dir/network/serveropcodes.cpp.o
  192. [ 25%] Building CXX object src/CMakeFiles/minetestserver.dir/script/cpp_api/s_env.cpp.o
  193. [ 25%] Building CXX object src/CMakeFiles/minetest.dir/script/common/c_content.cpp.o
  194. [ 25%] Building CXX object src/CMakeFiles/minetestserver.dir/script/cpp_api/s_inventory.cpp.o
  195. [ 26%] Building CXX object src/CMakeFiles/minetestserver.dir/script/cpp_api/s_item.cpp.o
  196. [ 26%] Building CXX object src/CMakeFiles/minetestserver.dir/script/cpp_api/s_node.cpp.o
  197. [ 26%] Building CXX object src/CMakeFiles/minetest.dir/script/common/c_converter.cpp.o
  198. [ 26%] Building CXX object src/CMakeFiles/minetestserver.dir/script/cpp_api/s_nodemeta.cpp.o
  199. [ 27%] Building CXX object src/CMakeFiles/minetest.dir/script/common/c_internal.cpp.o
  200. [ 27%] Building CXX object src/CMakeFiles/minetest.dir/script/common/c_types.cpp.o
  201. [ 27%] Building CXX object src/CMakeFiles/minetest.dir/script/cpp_api/s_async.cpp.o
  202. [ 28%] Building CXX object src/CMakeFiles/minetestserver.dir/script/cpp_api/s_player.cpp.o
  203. [ 28%] Building CXX object src/CMakeFiles/minetestserver.dir/script/cpp_api/s_server.cpp.o
  204. [ 28%] Building CXX object src/CMakeFiles/minetestserver.dir/script/lua_api/l_base.cpp.o
  205. [ 29%] Building CXX object src/CMakeFiles/minetestserver.dir/script/lua_api/l_craft.cpp.o
  206. [ 30%] Building CXX object src/CMakeFiles/minetest.dir/script/cpp_api/s_base.cpp.o
  207. [ 30%] Building CXX object src/CMakeFiles/minetest.dir/script/cpp_api/s_entity.cpp.o
  208. [ 30%] Building CXX object src/CMakeFiles/minetest.dir/script/cpp_api/s_env.cpp.o
  209. [ 31%] Building CXX object src/CMakeFiles/minetest.dir/script/cpp_api/s_inventory.cpp.o
  210. [ 31%] Building CXX object src/CMakeFiles/minetest.dir/script/cpp_api/s_item.cpp.o
  211. [ 31%] Building CXX object src/CMakeFiles/minetestserver.dir/script/lua_api/l_env.cpp.o
  212. [ 31%] Building CXX object src/CMakeFiles/minetest.dir/script/cpp_api/s_mainmenu.cpp.o
  213. [ 31%] Building CXX object src/CMakeFiles/minetest.dir/script/cpp_api/s_node.cpp.o
  214. [ 31%] Building CXX object src/CMakeFiles/minetestserver.dir/script/lua_api/l_inventory.cpp.o
  215. [ 32%] Building CXX object src/CMakeFiles/minetest.dir/script/cpp_api/s_nodemeta.cpp.o
  216. [ 32%] Building CXX object src/CMakeFiles/minetest.dir/script/cpp_api/s_player.cpp.o
  217. [ 32%] Building CXX object src/CMakeFiles/minetest.dir/script/cpp_api/s_server.cpp.o
  218. [ 33%] Building CXX object src/CMakeFiles/minetest.dir/script/lua_api/l_base.cpp.o
  219. [ 33%] Building CXX object src/CMakeFiles/minetest.dir/script/lua_api/l_craft.cpp.o
  220. [ 34%] Building CXX object src/CMakeFiles/minetestserver.dir/script/lua_api/l_item.cpp.o
  221. [ 34%] Building CXX object src/CMakeFiles/minetestserver.dir/script/lua_api/l_mapgen.cpp.o
  222. [ 34%] Building CXX object src/CMakeFiles/minetest.dir/script/lua_api/l_env.cpp.o
  223. [ 35%] Building CXX object src/CMakeFiles/minetest.dir/script/lua_api/l_inventory.cpp.o
  224. [ 35%] Building CXX object src/CMakeFiles/minetestserver.dir/script/lua_api/l_nodemeta.cpp.o
  225. [ 35%] Building CXX object src/CMakeFiles/minetestserver.dir/script/lua_api/l_nodetimer.cpp.o
  226. [ 36%] Building CXX object src/CMakeFiles/minetestserver.dir/script/lua_api/l_noise.cpp.o
  227. [ 36%] Building CXX object src/CMakeFiles/minetest.dir/script/lua_api/l_item.cpp.o
  228. [ 36%] Building CXX object src/CMakeFiles/minetestserver.dir/script/lua_api/l_object.cpp.o
  229. [ 36%] Building CXX object src/CMakeFiles/minetest.dir/script/lua_api/l_mainmenu.cpp.o
  230. [ 36%] Building CXX object src/CMakeFiles/minetestserver.dir/script/lua_api/l_particles.cpp.o
  231. [ 37%] Building CXX object src/CMakeFiles/minetestserver.dir/script/lua_api/l_rollback.cpp.o
  232. [ 37%] Building CXX object src/CMakeFiles/minetestserver.dir/script/lua_api/l_server.cpp.o
  233. [ 38%] Building CXX object src/CMakeFiles/minetest.dir/script/lua_api/l_mapgen.cpp.o
  234. [ 38%] Building CXX object src/CMakeFiles/minetest.dir/script/lua_api/l_nodemeta.cpp.o
  235. [ 38%] Building CXX object src/CMakeFiles/minetestserver.dir/script/lua_api/l_settings.cpp.o
  236. [ 38%] Building CXX object src/CMakeFiles/minetest.dir/script/lua_api/l_nodetimer.cpp.o
  237. [ 38%] Building CXX object src/CMakeFiles/minetest.dir/script/lua_api/l_noise.cpp.o
  238. [ 39%] Building CXX object src/CMakeFiles/minetestserver.dir/script/lua_api/l_util.cpp.o
  239. [ 40%] Building CXX object src/CMakeFiles/minetest.dir/script/lua_api/l_object.cpp.o
  240. [ 40%] Building CXX object src/CMakeFiles/minetestserver.dir/script/lua_api/l_vmanip.cpp.o
  241. [ 40%] Building CXX object src/CMakeFiles/minetest.dir/script/lua_api/l_particles.cpp.o
  242. [ 40%] Building CXX object src/CMakeFiles/minetest.dir/script/lua_api/l_rollback.cpp.o
  243. [ 40%] Building CXX object src/CMakeFiles/minetestserver.dir/script/scripting_game.cpp.o
  244. [ 41%] Building CXX object src/CMakeFiles/minetest.dir/script/lua_api/l_server.cpp.o
  245. [ 42%] Building CXX object src/CMakeFiles/minetestserver.dir/util/base64.cpp.o
  246. [ 42%] Building CXX object src/CMakeFiles/minetestserver.dir/util/directiontables.cpp.o
  247. [ 42%] Building CXX object src/CMakeFiles/minetestserver.dir/util/numeric.cpp.o
  248. [ 42%] Building CXX object src/CMakeFiles/minetestserver.dir/util/pointedthing.cpp.o
  249. [ 43%] Building CXX object src/CMakeFiles/minetestserver.dir/util/serialize.cpp.o
  250. [ 43%] Building CXX object src/CMakeFiles/minetest.dir/script/lua_api/l_settings.cpp.o
  251. [ 43%] Building CXX object src/CMakeFiles/minetestserver.dir/util/sha1.cpp.o
  252. [ 43%] Building CXX object src/CMakeFiles/minetestserver.dir/util/string.cpp.o
  253. [ 43%] Building CXX object src/CMakeFiles/minetest.dir/script/lua_api/l_util.cpp.o
  254. [ 44%] Building CXX object src/CMakeFiles/minetestserver.dir/util/timetaker.cpp.o
  255. [ 44%] Building CXX object src/CMakeFiles/minetestserver.dir/ban.cpp.o
  256. [ 44%] Building CXX object src/CMakeFiles/minetestserver.dir/cavegen.cpp.o
  257. [ 45%] Building CXX object src/CMakeFiles/minetestserver.dir/clientiface.cpp.o
  258. [ 46%] Building CXX object src/CMakeFiles/minetest.dir/script/lua_api/l_vmanip.cpp.o
  259. [ 46%] Building CXX object src/CMakeFiles/minetestserver.dir/collision.cpp.o
  260. [ 46%] Building CXX object src/CMakeFiles/minetest.dir/script/scripting_game.cpp.o
  261. [ 46%] Building CXX object src/CMakeFiles/minetest.dir/script/scripting_mainmenu.cpp.o
  262. [ 46%] Building CXX object src/CMakeFiles/minetestserver.dir/content_abm.cpp.o
  263. [ 47%] Building CXX object src/CMakeFiles/minetestserver.dir/content_mapnode.cpp.o
  264. [ 48%] Building CXX object src/CMakeFiles/minetest.dir/util/base64.cpp.o
  265. [ 48%] Building CXX object src/CMakeFiles/minetest.dir/util/directiontables.cpp.o
  266. [ 48%] Building CXX object src/CMakeFiles/minetest.dir/util/numeric.cpp.o
  267. [ 48%] Building CXX object src/CMakeFiles/minetest.dir/util/pointedthing.cpp.o
  268. [ 48%] Building CXX object src/CMakeFiles/minetestserver.dir/content_nodemeta.cpp.o
  269. [ 49%] Building CXX object src/CMakeFiles/minetest.dir/util/serialize.cpp.o
  270. [ 49%] Building CXX object src/CMakeFiles/minetestserver.dir/content_sao.cpp.o
  271. [ 49%] Building CXX object src/CMakeFiles/minetest.dir/util/sha1.cpp.o
  272. [ 49%] Building CXX object src/CMakeFiles/minetest.dir/util/string.cpp.o
  273. [ 50%] Building CXX object src/CMakeFiles/minetest.dir/util/timetaker.cpp.o
  274. [ 50%] Building CXX object src/CMakeFiles/minetest.dir/ban.cpp.o
  275. [ 50%] Building CXX object src/CMakeFiles/minetestserver.dir/convert_json.cpp.o
  276. [ 50%] Building CXX object src/CMakeFiles/minetest.dir/camera.cpp.o
  277. [ 51%] Building CXX object src/CMakeFiles/minetest.dir/cavegen.cpp.o
  278. [ 52%] Building CXX object src/CMakeFiles/minetestserver.dir/craftdef.cpp.o
  279. [ 52%] Building CXX object src/CMakeFiles/minetest.dir/chat.cpp.o
  280. [ 52%] Building CXX object src/CMakeFiles/minetest.dir/client.cpp.o
  281. [ 52%] Building CXX object src/CMakeFiles/minetestserver.dir/database-dummy.cpp.o
  282. [ 52%] Building CXX object src/CMakeFiles/minetestserver.dir/database-leveldb.cpp.o
  283. [ 53%] Building CXX object src/CMakeFiles/minetestserver.dir/database-redis.cpp.o
  284. [ 53%] Building CXX object src/CMakeFiles/minetestserver.dir/database-sqlite3.cpp.o
  285. [ 53%] Building CXX object src/CMakeFiles/minetestserver.dir/database.cpp.o
  286. [ 54%] Building CXX object src/CMakeFiles/minetestserver.dir/debug.cpp.o
  287. [ 54%] Building CXX object src/CMakeFiles/minetestserver.dir/defaultsettings.cpp.o
  288. [ 55%] Building CXX object src/CMakeFiles/minetest.dir/clientiface.cpp.o
  289. [ 55%] Building CXX object src/CMakeFiles/minetest.dir/clientmap.cpp.o
  290. [ 55%] Building CXX object src/CMakeFiles/minetestserver.dir/dungeongen.cpp.o
  291. [ 56%] Building CXX object src/CMakeFiles/minetestserver.dir/emerge.cpp.o
  292. [ 56%] Building CXX object src/CMakeFiles/minetest.dir/clientmedia.cpp.o
  293. [ 56%] Building CXX object src/CMakeFiles/minetestserver.dir/environment.cpp.o
  294. [ 56%] Building CXX object src/CMakeFiles/minetest.dir/clientobject.cpp.o
  295. [ 57%] Building CXX object src/CMakeFiles/minetest.dir/clouds.cpp.o
  296. [ 57%] Building CXX object src/CMakeFiles/minetest.dir/collision.cpp.o
  297. [ 57%] Building CXX object src/CMakeFiles/minetestserver.dir/filesys.cpp.o
  298. [ 57%] Building CXX object src/CMakeFiles/minetest.dir/content_abm.cpp.o
  299. [ 57%] Building CXX object src/CMakeFiles/minetestserver.dir/genericobject.cpp.o
  300. [ 58%] Building CXX object src/CMakeFiles/minetest.dir/content_cao.cpp.o
  301. [ 59%] Building CXX object src/CMakeFiles/minetestserver.dir/gettext.cpp.o
  302. [ 59%] Building CXX object src/CMakeFiles/minetestserver.dir/httpfetch.cpp.o
  303. [ 59%] Building CXX object src/CMakeFiles/minetest.dir/content_cso.cpp.o
  304. [ 59%] Building CXX object src/CMakeFiles/minetest.dir/content_mapblock.cpp.o
  305. [ 59%] Building CXX object src/CMakeFiles/minetestserver.dir/inventory.cpp.o
  306. [ 60%] Building CXX object src/CMakeFiles/minetest.dir/content_mapnode.cpp.o
  307. [ 60%] Building CXX object src/CMakeFiles/minetest.dir/content_nodemeta.cpp.o
  308. [ 61%] Building CXX object src/CMakeFiles/minetestserver.dir/inventorymanager.cpp.o
  309. [ 61%] Building CXX object src/CMakeFiles/minetest.dir/content_sao.cpp.o
  310. [ 61%] Building CXX object src/CMakeFiles/minetestserver.dir/itemdef.cpp.o
  311. [ 61%] Building CXX object src/CMakeFiles/minetestserver.dir/light.cpp.o
  312. [ 62%] Building CXX object src/CMakeFiles/minetestserver.dir/log.cpp.o
  313. [ 63%] Building CXX object src/CMakeFiles/minetest.dir/convert_json.cpp.o
  314. [ 63%] Building CXX object src/CMakeFiles/minetestserver.dir/main.cpp.o
  315. [ 63%] Building CXX object src/CMakeFiles/minetest.dir/craftdef.cpp.o
  316. [ 63%] Building CXX object src/CMakeFiles/minetestserver.dir/map.cpp.o
  317. /home/devmarth/blokel/src/map.cpp: In member function ‘v2s16 ServerMap::getSectorPos(std::string)’:
  318. /home/devmarth/blokel/src/map.cpp:2845:6: warning: variable ‘r’ set but not used [-Wunused-but-set-variable]
  319.   int r;
  320.       ^
  321. [ 63%] Building CXX object src/CMakeFiles/minetest.dir/database-dummy.cpp.o
  322. [ 63%] Building CXX object src/CMakeFiles/minetest.dir/database-leveldb.cpp.o
  323. [ 64%] Building CXX object src/CMakeFiles/minetest.dir/database-redis.cpp.o
  324. [ 65%] Building CXX object src/CMakeFiles/minetestserver.dir/mapblock.cpp.o
  325. [ 65%] Building CXX object src/CMakeFiles/minetest.dir/database-sqlite3.cpp.o
  326. [ 65%] Building CXX object src/CMakeFiles/minetest.dir/database.cpp.o
  327. [ 66%] Building CXX object src/CMakeFiles/minetest.dir/debug.cpp.o
  328. [ 66%] Building CXX object src/CMakeFiles/minetestserver.dir/mapgen.cpp.o
  329. [ 66%] Building CXX object src/CMakeFiles/minetest.dir/defaultsettings.cpp.o
  330. [ 66%] Building CXX object src/CMakeFiles/minetestserver.dir/mapgen_singlenode.cpp.o
  331. [ 66%] Building CXX object src/CMakeFiles/minetestserver.dir/mapgen_v5.cpp.o
  332. [ 66%] Building CXX object src/CMakeFiles/minetest.dir/drawscene.cpp.o
  333. [ 67%] Building CXX object src/CMakeFiles/minetestserver.dir/mapgen_v6.cpp.o
  334. [ 68%] Building CXX object src/CMakeFiles/minetest.dir/dungeongen.cpp.o
  335. [ 68%] Building CXX object src/CMakeFiles/minetestserver.dir/mapgen_v7.cpp.o
  336. [ 68%] Building CXX object src/CMakeFiles/minetestserver.dir/mapnode.cpp.o
  337. [ 68%] Building CXX object src/CMakeFiles/minetest.dir/emerge.cpp.o
  338. [ 69%] Building CXX object src/CMakeFiles/minetestserver.dir/mapsector.cpp.o
  339. [ 69%] Building CXX object src/CMakeFiles/minetestserver.dir/mg_biome.cpp.o
  340. [ 69%] Building CXX object src/CMakeFiles/minetest.dir/environment.cpp.o
  341. [ 69%] Building CXX object src/CMakeFiles/minetestserver.dir/mg_decoration.cpp.o
  342. [ 70%] Building CXX object src/CMakeFiles/minetestserver.dir/mg_ore.cpp.o
  343. [ 70%] Building CXX object src/CMakeFiles/minetestserver.dir/mg_schematic.cpp.o
  344. [ 70%] Building CXX object src/CMakeFiles/minetestserver.dir/mods.cpp.o
  345. [ 70%] Building CXX object src/CMakeFiles/minetest.dir/filecache.cpp.o
  346. [ 71%] Building CXX object src/CMakeFiles/minetest.dir/filesys.cpp.o
  347. [ 71%] Building CXX object src/CMakeFiles/minetestserver.dir/nameidmapping.cpp.o
  348. [ 71%] Building CXX object src/CMakeFiles/minetest.dir/fontengine.cpp.o
  349. [ 72%] Building CXX object src/CMakeFiles/minetestserver.dir/nodedef.cpp.o
  350. [ 72%] Building CXX object src/CMakeFiles/minetest.dir/game.cpp.o
  351. [ 72%] Building CXX object src/CMakeFiles/minetestserver.dir/nodemetadata.cpp.o
  352. [ 72%] Building CXX object src/CMakeFiles/minetestserver.dir/nodetimer.cpp.o
  353. [ 73%] Building CXX object src/CMakeFiles/minetestserver.dir/noise.cpp.o
  354. [ 73%] Building CXX object src/CMakeFiles/minetestserver.dir/object_properties.cpp.o
  355. [ 73%] Building CXX object src/CMakeFiles/minetestserver.dir/pathfinder.cpp.o
  356. [ 74%] Building CXX object src/CMakeFiles/minetest.dir/genericobject.cpp.o
  357. [ 75%] Building CXX object src/CMakeFiles/minetestserver.dir/player.cpp.o
  358. [ 75%] Building CXX object src/CMakeFiles/minetest.dir/gettext.cpp.o
  359. [ 75%] Building CXX object src/CMakeFiles/minetest.dir/guiChatConsole.cpp.o
  360. [ 75%] Building CXX object src/CMakeFiles/minetestserver.dir/porting.cpp.o
  361. [ 75%] Building CXX object src/CMakeFiles/minetestserver.dir/quicktune.cpp.o
  362. [ 76%] Building CXX object src/CMakeFiles/minetest.dir/guiEngine.cpp.o
  363. [ 77%] Building CXX object src/CMakeFiles/minetestserver.dir/rollback.cpp.o
  364. /home/devmarth/blokel/src/guiEngine.cpp: In constructor ‘GUIEngine::GUIEngine(irr::IrrlichtDevice*, irr::gui::IGUIElement*, IMenuManager*, irr::scene::ISceneManager*, MainMenuData*, bool&)’:
  365. /home/devmarth/blokel/src/guiEngine.cpp:174:61: error: expected ‘)’ before ‘;’ token
  366.   std::wstring t = narrow_to_wide(std::string("Blokel 0.5.0");
  367.                                                              ^
  368. /home/devmarth/blokel/src/guiEngine.cpp: In member function ‘void GUIEngine::setTopleftText(std::string)’:
  369. /home/devmarth/blokel/src/guiEngine.cpp:572:66: error: expected ‘)’ before ‘;’ token
  370.   std::wstring toset = narrow_to_wide( std::string("Blokel 0.5.0");
  371.                                                                   ^
  372. src/CMakeFiles/minetest.dir/build.make:2170: recipe for target 'src/CMakeFiles/minetest.dir/guiEngine.cpp.o' failed
  373. make[2]: *** [src/CMakeFiles/minetest.dir/guiEngine.cpp.o] Error 1
  374. CMakeFiles/Makefile2:133: recipe for target 'src/CMakeFiles/minetest.dir/all' failed
  375. make[1]: *** [src/CMakeFiles/minetest.dir/all] Error 2
  376. make[1]: *** Waiting for unfinished jobs....
  377. [ 77%] Building CXX object src/CMakeFiles/minetestserver.dir/rollback_interface.cpp.o
  378. [ 77%] Building CXX object src/CMakeFiles/minetestserver.dir/serialization.cpp.o
  379. [ 77%] Building CXX object src/CMakeFiles/minetestserver.dir/server.cpp.o
  380. [ 78%] Building CXX object src/CMakeFiles/minetestserver.dir/serverlist.cpp.o
  381. [ 78%] Building CXX object src/CMakeFiles/minetestserver.dir/serverobject.cpp.o
  382. [ 78%] Building CXX object src/CMakeFiles/minetestserver.dir/settings.cpp.o
  383. [ 79%] Building CXX object src/CMakeFiles/minetestserver.dir/socket.cpp.o
  384. [ 79%] Building CXX object src/CMakeFiles/minetestserver.dir/sound.cpp.o
  385. [ 79%] Building CXX object src/CMakeFiles/minetestserver.dir/staticobject.cpp.o
  386. [ 80%] Building CXX object src/CMakeFiles/minetestserver.dir/subgame.cpp.o
  387. [ 80%] Building CXX object src/CMakeFiles/minetestserver.dir/test.cpp.o
  388. [ 80%] Building CXX object src/CMakeFiles/minetestserver.dir/tool.cpp.o
  389. [ 81%] Building CXX object src/CMakeFiles/minetestserver.dir/treegen.cpp.o
  390. [ 81%] Building CXX object src/CMakeFiles/minetestserver.dir/version.cpp.o
  391. [ 81%] Building CXX object src/CMakeFiles/minetestserver.dir/voxel.cpp.o
  392. [ 81%] Building CXX object src/CMakeFiles/minetestserver.dir/voxelalgorithms.cpp.o
  393. Linking CXX executable ../bin/minetestserver
  394. [ 81%] Built target minetestserver
  395. Makefile:133: recipe for target 'all' failed
  396. make: *** [all] Error 2
RAW Paste Data
Top