Guest User

Dolphin build fail

a guest
Jul 2nd, 2016
22
Never
Not a member of Pastebin yet? Sign Up, it unlocks many cool features!
  1. :: Building dolphin-emu-cli-git,dolphin-emu-qt-git,dolphin-emu-git package(s)...
  2. ==> Making package: dolphin-emu-git 5.0.r120.b33a5e2-1 (Sat Jul 2 09:25:52 EDT 2016)
  3. ==> Checking runtime dependencies...
  4. ==> Checking buildtime dependencies...
  5. ==> Retrieving sources...
  6. -> Updating dolphin-emu git repo...
  7. Fetching origin
  8. ==> Validating source files with sha256sums...
  9. dolphin-emu ... Skipped
  10. ==> Extracting sources...
  11. -> Creating working copy of dolphin git repo...
  12. Reset branch 'makepkg'
  13. ==> Starting prepare()...
  14. ==> Starting pkgver()...
  15. ==> Removing existing $pkgdir/ directory...
  16. ==> Starting build()...
  17. -- The C compiler identification is GNU 6.1.1
  18. -- The CXX compiler identification is GNU 6.1.1
  19. -- Check for working C compiler: /usr/lib/ccache/bin/cc
  20. -- Check for working C compiler: /usr/lib/ccache/bin/cc -- works
  21. -- Detecting C compiler ABI info
  22. -- Detecting C compiler ABI info - done
  23. -- Detecting C compile features
  24. -- Detecting C compile features - done
  25. -- Check for working CXX compiler: /usr/lib/ccache/bin/c++
  26. -- Check for working CXX compiler: /usr/lib/ccache/bin/c++ -- works
  27. -- Detecting CXX compiler ABI info
  28. -- Detecting CXX compiler ABI info - done
  29. -- Detecting CXX compile features
  30. -- Detecting CXX compile features - done
  31. -- Found Git: /usr/bin/git (found version "2.9.0")
  32. x86_64
  33. -- Performing Test FLAG_TYPE_LIMITS
  34. -- Performing Test FLAG_TYPE_LIMITS - Success
  35. -- Performing Test FLAG_SIGN_COMPARE
  36. -- Performing Test FLAG_SIGN_COMPARE - Success
  37. -- Performing Test FLAG_IGNORED_QUALIFIERS
  38. -- Performing Test FLAG_IGNORED_QUALIFIERS - Success
  39. -- Performing Test FLAG_UNINITIALIZED
  40. -- Performing Test FLAG_UNINITIALIZED - Success
  41. -- Performing Test FLAG_LOGICAL_OP
  42. -- Performing Test FLAG_LOGICAL_OP - Success
  43. -- Performing Test FLAG_SHADOW
  44. -- Performing Test FLAG_SHADOW - Success
  45. -- Performing Test FLAG_INIT_SELF
  46. -- Performing Test FLAG_INIT_SELF - Success
  47. -- Performing Test FLAG_MISSING_DECLARATIONS
  48. -- Performing Test FLAG_MISSING_DECLARATIONS - Success
  49. -- Performing Test FLAG_MISSING_VARIABLE_DECLARATIONS
  50. -- Performing Test FLAG_MISSING_VARIABLE_DECLARATIONS - Failed
  51. -- Performing Test FLAG_VISIBILITY_INLINES_HIDDEN
  52. -- Performing Test FLAG_VISIBILITY_INLINES_HIDDEN - Success
  53. -- Performing Test FLAG_VISIBILITY_HIDDEN
  54. -- Performing Test FLAG_VISIBILITY_HIDDEN - Success
  55. -- Performing Test FLAG_LTO
  56. -- Performing Test FLAG_LTO - Success
  57. -- Looking for pthread.h
  58. -- Looking for pthread.h - found
  59. -- Looking for pthread_create
  60. -- Looking for pthread_create - not found
  61. -- Looking for pthread_create in pthreads
  62. -- Looking for pthread_create in pthreads - not found
  63. -- Looking for pthread_create in pthread
  64. -- Looking for pthread_create in pthread - found
  65. -- Found Threads: TRUE
  66. -- Found PkgConfig: /usr/bin/pkg-config (found version "0.29.1")
  67. -- Found OpenGL: /usr/lib64/libGL.so
  68. -- Found ALSA: /usr/lib64/libasound.so (found version "1.1.1")
  69. ALSA found, enabling ALSA sound backend
  70. ao found, enabling ao sound backend
  71. bluez found, enabling bluetooth support
  72. PulseAudio found, enabling PulseAudio sound backend
  73. -- Found OpenAL: /usr/lib64/libopenal.so
  74. OpenAL found, enabling OpenAL sound backend
  75. -- Looking for XOpenDisplay in /usr/lib64/libX11.so;/usr/lib64/libXext.so
  76. -- Looking for XOpenDisplay in /usr/lib64/libX11.so;/usr/lib64/libXext.so - found
  77. -- Looking for gethostbyname
  78. -- Looking for gethostbyname - found
  79. -- Looking for connect
  80. -- Looking for connect - found
  81. -- Looking for remove
  82. -- Looking for remove - found
  83. -- Looking for shmat
  84. -- Looking for shmat - found
  85. -- Looking for IceConnectionNumber in ICE
  86. -- Looking for IceConnectionNumber in ICE - found
  87. -- Found X11: /usr/lib64/libX11.so
  88. X11 support enabled
  89. Xrandr found
  90. -- Checking for module 'xi>=1.5.0'
  91. -- Found xi, version 1.7.6
  92. -- Checking for modules 'libavcodec>=54.35.0;libavformat>=54.20.4;libswscale>=2.1.1;libavutil>=52.3.0'
  93. -- Found libavcodec, version 57.24.102
  94. -- Found libavformat, version 57.25.100
  95. -- Found libswscale, version 4.0.100
  96. -- Found libavutil, version 55.17.103
  97. libav/ffmpeg found, enabling AVI frame dumps
  98. -- Performing Test PORTAUDIO
  99. -- Performing Test PORTAUDIO - Success
  100. PortAudio found, enabling mic support
  101. -- Found LIBUDEV: /usr/lib64/libudev.so
  102. -- Found libevdev: /usr/lib64/libevdev.so
  103. libevdev/libudev found, enabling evdev controller backend
  104. Using named pipes as controller inputs
  105. Watching game memory for changes
  106. Enabling analytics collection (subject to end-user opt-in)
  107. -- Looking for enet_socket_get_address
  108. -- Looking for enet_socket_get_address - found
  109. Using shared enet
  110. Using static xxhash from Externals
  111. -- Found ZLIB: /usr/lib64/libz.so (found version "1.2.8")
  112. Using shared zlib
  113. Using shared lzo
  114. Using shared libpng
  115. Using shared soundtouch
  116. -- Checking for module 'libusb-1.0'
  117. -- Found libusb-1.0, version 1.0.20
  118. -- Found libusb-1.0: /usr/include/libusb-1.0, /usr/lib64/libusb-1.0.so
  119. Using shared LibUSB
  120. -- Found SFML 2.3 in /usr/include
  121. Using shared SFML
  122. -- Found MINIUPNPC: /usr/include/miniupnpc
  123. Using shared miniupnpc
  124. -- Performing Test MBEDTLS_VERSION_OK
  125. -- Performing Test MBEDTLS_VERSION_OK - Success
  126. -- Found MBEDTLS: /usr/include
  127. Using shared mbed TLS
  128. -- Found CURL: /usr/lib64/libcurl.so (found version "7.49.1")
  129. Using shared libcurl
  130. Using static SOIL from Externals
  131. Found Qt version 5.7.0, enabling the Qt backend
  132. -- Found wxWidgets: -pthread;;;-lwx_gtk2u_xrc-3.0;-lwx_gtk2u_webview-3.0;-lwx_gtk2u_html-3.0;-lwx_gtk2u_qa-3.0;-lwx_gtk2u_adv-3.0;-lwx_gtk2u_core-3.0;-lwx_baseu_xml-3.0;-lwx_baseu_net-3.0;-lwx_baseu-3.0 (found version "3.0.2")
  133. -- Found wxWidgets: -pthread;;;-lwx_gtk2u_core-3.0;-lwx_gtk2u_aui-3.0;-lwx_gtk2u_adv-3.0;-lwx_baseu-3.0 (found version "3.0.2")
  134. Found wxWidgets version 3.0.2
  135. -- Found GTK2_GTK: /usr/lib64/libgtk-x11-2.0.so
  136. wxWidgets found, enabling GUI build
  137. -- Could NOT find GTest (missing: GTEST_LIBRARY GTEST_INCLUDE_DIR GTEST_MAIN_LIBRARY)
  138. Using static gtest from Externals
  139. -- Found Gettext: /usr/bin/msgmerge (found version "0.19.7")
  140. -- Configuring done
  141. -- Generating done
  142. -- Build files have been written to: /home/buck/.cache/pacaur/dolphin-emu-git/src/dolphin-emu/build
  143. Scanning dependencies of target bdisasm
  144. [ 0%] Building CXX object Externals/Bochs_disasm/CMakeFiles/bdisasm.dir/dis_decode.cc.o
  145. [ 0%] Building CXX object Externals/Bochs_disasm/CMakeFiles/bdisasm.dir/dis_groups.cc.o
  146. [ 0%] Building CXX object Externals/Bochs_disasm/CMakeFiles/bdisasm.dir/resolve.cc.o
  147. [ 1%] Building CXX object Externals/Bochs_disasm/CMakeFiles/bdisasm.dir/syntax.cc.o
  148. [ 1%] Linking CXX static library libbdisasm.a
  149. [ 1%] Built target bdisasm
  150. Scanning dependencies of target xxhash
  151. [ 1%] Building C object Externals/xxhash/CMakeFiles/xxhash.dir/xxhash.c.o
  152. [ 2%] Linking C static library libxxhash.a
  153. [ 2%] Built target xxhash
  154. Scanning dependencies of target SOIL
  155. [ 2%] Building C object Externals/SOIL/CMakeFiles/SOIL.dir/image_DXT.c.o
  156. [ 2%] Building C object Externals/SOIL/CMakeFiles/SOIL.dir/image_helper.c.o
  157. [ 2%] Building C object Externals/SOIL/CMakeFiles/SOIL.dir/SOIL.c.o
  158. [ 2%] Building C object Externals/SOIL/CMakeFiles/SOIL.dir/stb_image_aug.c.o
  159. [ 2%] Linking C static library libSOIL.a
  160. [ 2%] Built target SOIL
  161. Scanning dependencies of target pch
  162. [ 2%] Building CXX object Source/CMakeFiles/pch.dir/PCH/pch.h.o
  163. [ 2%] Linking FAKELANG static library libpch.a
  164. [ 2%] Built target pch
  165. Scanning dependencies of target audiocommon
  166. [ 2%] Building CXX object Source/Core/AudioCommon/CMakeFiles/audiocommon.dir/AudioCommon.cpp.o
  167. [ 2%] Building CXX object Source/Core/AudioCommon/CMakeFiles/audiocommon.dir/DPL2Decoder.cpp.o
  168. [ 3%] Building CXX object Source/Core/AudioCommon/CMakeFiles/audiocommon.dir/Mixer.cpp.o
  169. [ 3%] Building CXX object Source/Core/AudioCommon/CMakeFiles/audiocommon.dir/WaveFile.cpp.o
  170. [ 3%] Building CXX object Source/Core/AudioCommon/CMakeFiles/audiocommon.dir/NullSoundStream.cpp.o
  171. [ 3%] Building CXX object Source/Core/AudioCommon/CMakeFiles/audiocommon.dir/AlsaSoundStream.cpp.o
  172. [ 3%] Building CXX object Source/Core/AudioCommon/CMakeFiles/audiocommon.dir/AOSoundStream.cpp.o
  173. [ 3%] Building CXX object Source/Core/AudioCommon/CMakeFiles/audiocommon.dir/OpenALStream.cpp.o
  174. [ 4%] Building CXX object Source/Core/AudioCommon/CMakeFiles/audiocommon.dir/aldlist.cpp.o
  175. [ 4%] Building CXX object Source/Core/AudioCommon/CMakeFiles/audiocommon.dir/PulseAudioStream.cpp.o
  176. [ 4%] Linking CXX static library libaudiocommon.a
  177. [ 4%] Built target audiocommon
  178. Scanning dependencies of target traversal_server
  179. [ 4%] Building CXX object Source/Core/Common/CMakeFiles/traversal_server.dir/TraversalServer.cpp.o
  180. [ 4%] Linking CXX executable ../../../Binaries/traversal_server
  181. [ 4%] Built target traversal_server
  182. Scanning dependencies of target common
  183. [ 4%] Building CXX object Source/Core/Common/CMakeFiles/common.dir/Analytics.cpp.o
  184. [ 4%] Building CXX object Source/Core/Common/CMakeFiles/common.dir/BreakPoints.cpp.o
  185. [ 4%] Building CXX object Source/Core/Common/CMakeFiles/common.dir/CDUtils.cpp.o
  186. [ 5%] Building CXX object Source/Core/Common/CMakeFiles/common.dir/ColorUtil.cpp.o
  187. [ 5%] Building CXX object Source/Core/Common/CMakeFiles/common.dir/ENetUtil.cpp.o
  188. [ 5%] Building CXX object Source/Core/Common/CMakeFiles/common.dir/FileSearch.cpp.o
  189. [ 5%] Building CXX object Source/Core/Common/CMakeFiles/common.dir/FileUtil.cpp.o
  190. [ 5%] Building CXX object Source/Core/Common/CMakeFiles/common.dir/GekkoDisassembler.cpp.o
  191. [ 5%] Building CXX object Source/Core/Common/CMakeFiles/common.dir/Hash.cpp.o
  192. [ 6%] Building CXX object Source/Core/Common/CMakeFiles/common.dir/IniFile.cpp.o
  193. [ 6%] Building CXX object Source/Core/Common/CMakeFiles/common.dir/JitRegister.cpp.o
  194. [ 6%] Building CXX object Source/Core/Common/CMakeFiles/common.dir/MathUtil.cpp.o
  195. [ 6%] Building CXX object Source/Core/Common/CMakeFiles/common.dir/MemArena.cpp.o
  196. [ 6%] Building CXX object Source/Core/Common/CMakeFiles/common.dir/MemoryUtil.cpp.o
  197. /home/buck/.cache/pacaur/dolphin-emu-git/src/dolphin-emu/Source/Core/Common/MemoryUtil.cpp:36:18: warning: ‘uintptr_t RoundPage(uintptr_t)’ defined but not used [-Wunused-function]
  198. static uintptr_t RoundPage(uintptr_t addr)
  199. ^~~~~~~~~
  200. [ 7%] Building CXX object Source/Core/Common/CMakeFiles/common.dir/Misc.cpp.o
  201. [ 7%] Building CXX object Source/Core/Common/CMakeFiles/common.dir/MsgHandler.cpp.o
  202. [ 7%] Building CXX object Source/Core/Common/CMakeFiles/common.dir/NandPaths.cpp.o
  203. [ 7%] Building CXX object Source/Core/Common/CMakeFiles/common.dir/Network.cpp.o
  204. [ 7%] Building CXX object Source/Core/Common/CMakeFiles/common.dir/PcapFile.cpp.o
  205. [ 7%] Building CXX object Source/Core/Common/CMakeFiles/common.dir/PerformanceCounter.cpp.o
  206. [ 8%] Building CXX object Source/Core/Common/CMakeFiles/common.dir/Profiler.cpp.o
  207. [ 8%] Building CXX object Source/Core/Common/CMakeFiles/common.dir/SettingsHandler.cpp.o
  208. [ 8%] Building CXX object Source/Core/Common/CMakeFiles/common.dir/SDCardUtil.cpp.o
  209. [ 8%] Building CXX object Source/Core/Common/CMakeFiles/common.dir/StringUtil.cpp.o
  210. [ 8%] Building CXX object Source/Core/Common/CMakeFiles/common.dir/SymbolDB.cpp.o
  211. [ 9%] Building CXX object Source/Core/Common/CMakeFiles/common.dir/SysConf.cpp.o
  212. [ 9%] Building CXX object Source/Core/Common/CMakeFiles/common.dir/Thread.cpp.o
  213. [ 9%] Building CXX object Source/Core/Common/CMakeFiles/common.dir/Timer.cpp.o
  214. [ 9%] Building CXX object Source/Core/Common/CMakeFiles/common.dir/TraversalClient.cpp.o
  215. [ 9%] Building CXX object Source/Core/Common/CMakeFiles/common.dir/Version.cpp.o
  216. [ 9%] Building CXX object Source/Core/Common/CMakeFiles/common.dir/x64ABI.cpp.o
  217. [ 10%] Building CXX object Source/Core/Common/CMakeFiles/common.dir/x64Emitter.cpp.o
  218. [ 10%] Building CXX object Source/Core/Common/CMakeFiles/common.dir/Crypto/bn.cpp.o
  219. [ 10%] Building CXX object Source/Core/Common/CMakeFiles/common.dir/Crypto/ec.cpp.o
  220. [ 10%] Building CXX object Source/Core/Common/CMakeFiles/common.dir/Logging/LogManager.cpp.o
  221. [ 10%] Building CXX object Source/Core/Common/CMakeFiles/common.dir/Logging/ConsoleListenerNix.cpp.o
  222. [ 12%] Building CXX object Source/Core/Common/CMakeFiles/common.dir/x64FPURoundMode.cpp.o
  223. [ 12%] Building CXX object Source/Core/Common/CMakeFiles/common.dir/x64CPUDetect.cpp.o
  224. [ 12%] Building CXX object Source/Core/Common/CMakeFiles/common.dir/GL/GLUtil.cpp.o
  225. [ 12%] Building CXX object Source/Core/Common/CMakeFiles/common.dir/GL/GLExtensions/GLExtensions.cpp.o
  226. [ 12%] Building CXX object Source/Core/Common/CMakeFiles/common.dir/GL/GLInterface/GLInterface.cpp.o
  227. [ 12%] Building CXX object Source/Core/Common/CMakeFiles/common.dir/GL/GLInterface/GLX.cpp.o
  228. [ 13%] Building CXX object Source/Core/Common/CMakeFiles/common.dir/GL/GLInterface/X11_Util.cpp.o
  229. [ 13%] Linking CXX static library libcommon.a
  230. [ 13%] Built target common
  231. Scanning dependencies of target inputcommon
  232. [ 13%] Building CXX object Source/Core/InputCommon/CMakeFiles/inputcommon.dir/ControllerEmu.cpp.o
  233. [ 13%] Building CXX object Source/Core/InputCommon/CMakeFiles/inputcommon.dir/InputConfig.cpp.o
  234. [ 13%] Building CXX object Source/Core/InputCommon/CMakeFiles/inputcommon.dir/ControllerInterface/ControllerInterface.cpp.o
  235. [ 13%] Building CXX object Source/Core/InputCommon/CMakeFiles/inputcommon.dir/ControllerInterface/Device.cpp.o
  236. [ 13%] Building CXX object Source/Core/InputCommon/CMakeFiles/inputcommon.dir/ControllerInterface/ExpressionParser.cpp.o
  237. [ 14%] Building CXX object Source/Core/InputCommon/CMakeFiles/inputcommon.dir/ControllerInterface/Xlib/Xlib.cpp.o
  238. [ 14%] Building CXX object Source/Core/InputCommon/CMakeFiles/inputcommon.dir/ControllerInterface/Xlib/XInput2.cpp.o
  239. [ 14%] Building CXX object Source/Core/InputCommon/CMakeFiles/inputcommon.dir/GCAdapter.cpp.o
  240. [ 14%] Building CXX object Source/Core/InputCommon/CMakeFiles/inputcommon.dir/ControllerInterface/evdev/evdev.cpp.o
  241. [ 14%] Building CXX object Source/Core/InputCommon/CMakeFiles/inputcommon.dir/ControllerInterface/Pipes/Pipes.cpp.o
  242. [ 15%] Linking CXX static library libinputcommon.a
  243. [ 15%] Built target inputcommon
  244. Scanning dependencies of target discio
  245. [ 15%] Building CXX object Source/Core/DiscIO/CMakeFiles/discio.dir/Blob.cpp.o
  246. [ 15%] Building CXX object Source/Core/DiscIO/CMakeFiles/discio.dir/CISOBlob.cpp.o
  247. [ 16%] Building CXX object Source/Core/DiscIO/CMakeFiles/discio.dir/WbfsBlob.cpp.o
  248. [ 16%] Building CXX object Source/Core/DiscIO/CMakeFiles/discio.dir/CompressedBlob.cpp.o
  249. [ 16%] Building CXX object Source/Core/DiscIO/CMakeFiles/discio.dir/DiscScrubber.cpp.o
  250. [ 16%] Building CXX object Source/Core/DiscIO/CMakeFiles/discio.dir/DriveBlob.cpp.o
  251. [ 16%] Building CXX object Source/Core/DiscIO/CMakeFiles/discio.dir/FileBlob.cpp.o
  252. [ 17%] Building CXX object Source/Core/DiscIO/CMakeFiles/discio.dir/FileMonitor.cpp.o
  253. [ 17%] Building CXX object Source/Core/DiscIO/CMakeFiles/discio.dir/FileSystemGCWii.cpp.o
  254. [ 17%] Building CXX object Source/Core/DiscIO/CMakeFiles/discio.dir/Filesystem.cpp.o
  255. [ 17%] Building CXX object Source/Core/DiscIO/CMakeFiles/discio.dir/NANDContentLoader.cpp.o
  256. [ 17%] Building CXX object Source/Core/DiscIO/CMakeFiles/discio.dir/VolumeCommon.cpp.o
  257. [ 17%] Building CXX object Source/Core/DiscIO/CMakeFiles/discio.dir/VolumeCreator.cpp.o
  258. [ 18%] Building CXX object Source/Core/DiscIO/CMakeFiles/discio.dir/VolumeDirectory.cpp.o
  259. [ 18%] Building CXX object Source/Core/DiscIO/CMakeFiles/discio.dir/VolumeGC.cpp.o
  260. [ 18%] Building CXX object Source/Core/DiscIO/CMakeFiles/discio.dir/VolumeWad.cpp.o
  261. [ 18%] Building CXX object Source/Core/DiscIO/CMakeFiles/discio.dir/VolumeWiiCrypted.cpp.o
  262. [ 18%] Building CXX object Source/Core/DiscIO/CMakeFiles/discio.dir/WiiWad.cpp.o
  263. [ 19%] Linking CXX static library libdiscio.a
  264. [ 19%] Built target discio
  265. Scanning dependencies of target videosoftware
  266. [ 20%] Building CXX object Source/Core/VideoBackends/Software/CMakeFiles/videosoftware.dir/Clipper.cpp.o
  267. [ 20%] Building CXX object Source/Core/VideoBackends/Software/CMakeFiles/videosoftware.dir/DebugUtil.cpp.o
  268. [ 20%] Building CXX object Source/Core/VideoBackends/Software/CMakeFiles/videosoftware.dir/EfbCopy.cpp.o
  269. [ 20%] Building CXX object Source/Core/VideoBackends/Software/CMakeFiles/videosoftware.dir/EfbInterface.cpp.o
  270. [ 20%] Building CXX object Source/Core/VideoBackends/Software/CMakeFiles/videosoftware.dir/Rasterizer.cpp.o
  271. [ 21%] Building CXX object Source/Core/VideoBackends/Software/CMakeFiles/videosoftware.dir/SWOGLWindow.cpp.o
  272. [ 21%] Building CXX object Source/Core/VideoBackends/Software/CMakeFiles/videosoftware.dir/SWRenderer.cpp.o
  273. [ 21%] Building CXX object Source/Core/VideoBackends/Software/CMakeFiles/videosoftware.dir/SWVertexLoader.cpp.o
  274. [ 21%] Building CXX object Source/Core/VideoBackends/Software/CMakeFiles/videosoftware.dir/SWmain.cpp.o
  275. [ 21%] Building CXX object Source/Core/VideoBackends/Software/CMakeFiles/videosoftware.dir/SetupUnit.cpp.o
  276. [ 21%] Building CXX object Source/Core/VideoBackends/Software/CMakeFiles/videosoftware.dir/Tev.cpp.o
  277. [ 23%] Building CXX object Source/Core/VideoBackends/Software/CMakeFiles/videosoftware.dir/TextureEncoder.cpp.o
  278. [ 23%] Building CXX object Source/Core/VideoBackends/Software/CMakeFiles/videosoftware.dir/TextureSampler.cpp.o
  279. [ 23%] Building CXX object Source/Core/VideoBackends/Software/CMakeFiles/videosoftware.dir/TransformUnit.cpp.o
  280. [ 23%] Linking CXX static library libvideosoftware.a
  281. [ 23%] Built target videosoftware
  282. Scanning dependencies of target videonull
  283. [ 23%] Building CXX object Source/Core/VideoBackends/Null/CMakeFiles/videonull.dir/NullBackend.cpp.o
  284. [ 23%] Building CXX object Source/Core/VideoBackends/Null/CMakeFiles/videonull.dir/Render.cpp.o
  285. [ 23%] Building CXX object Source/Core/VideoBackends/Null/CMakeFiles/videonull.dir/VertexManager.cpp.o
  286. [ 24%] Building CXX object Source/Core/VideoBackends/Null/CMakeFiles/videonull.dir/ShaderCache.cpp.o
  287. [ 24%] Linking CXX static library libvideonull.a
  288. [ 24%] Built target videonull
  289. Scanning dependencies of target videoogl
  290. [ 24%] Building CXX object Source/Core/VideoBackends/OGL/CMakeFiles/videoogl.dir/BoundingBox.cpp.o
  291. [ 24%] Building CXX object Source/Core/VideoBackends/OGL/CMakeFiles/videoogl.dir/FramebufferManager.cpp.o
  292. [ 24%] Building CXX object Source/Core/VideoBackends/OGL/CMakeFiles/videoogl.dir/main.cpp.o
  293. [ 24%] Building CXX object Source/Core/VideoBackends/OGL/CMakeFiles/videoogl.dir/NativeVertexFormat.cpp.o
  294. [ 25%] Building CXX object Source/Core/VideoBackends/OGL/CMakeFiles/videoogl.dir/PerfQuery.cpp.o
  295. [ 25%] Building CXX object Source/Core/VideoBackends/OGL/CMakeFiles/videoogl.dir/PostProcessing.cpp.o
  296. [ 25%] Building CXX object Source/Core/VideoBackends/OGL/CMakeFiles/videoogl.dir/ProgramShaderCache.cpp.o
  297. [ 25%] Building CXX object Source/Core/VideoBackends/OGL/CMakeFiles/videoogl.dir/RasterFont.cpp.o
  298. [ 25%] Building CXX object Source/Core/VideoBackends/OGL/CMakeFiles/videoogl.dir/Render.cpp.o
  299. [ 26%] Building CXX object Source/Core/VideoBackends/OGL/CMakeFiles/videoogl.dir/SamplerCache.cpp.o
  300. [ 26%] Building CXX object Source/Core/VideoBackends/OGL/CMakeFiles/videoogl.dir/StreamBuffer.cpp.o
  301. [ 26%] Building CXX object Source/Core/VideoBackends/OGL/CMakeFiles/videoogl.dir/TextureCache.cpp.o
  302. [ 26%] Building CXX object Source/Core/VideoBackends/OGL/CMakeFiles/videoogl.dir/TextureConverter.cpp.o
  303. [ 26%] Building CXX object Source/Core/VideoBackends/OGL/CMakeFiles/videoogl.dir/VertexManager.cpp.o
  304. [ 26%] Linking CXX static library libvideoogl.a
  305. [ 26%] Built target videoogl
  306. Scanning dependencies of target videocommon
  307. [ 26%] Building CXX object Source/Core/VideoCommon/CMakeFiles/videocommon.dir/AsyncRequests.cpp.o
  308. [ 26%] Building CXX object Source/Core/VideoCommon/CMakeFiles/videocommon.dir/BoundingBox.cpp.o
  309. [ 26%] Building CXX object Source/Core/VideoCommon/CMakeFiles/videocommon.dir/BPFunctions.cpp.o
  310. [ 27%] Building CXX object Source/Core/VideoCommon/CMakeFiles/videocommon.dir/BPMemory.cpp.o
  311. [ 27%] Building CXX object Source/Core/VideoCommon/CMakeFiles/videocommon.dir/BPStructs.cpp.o
  312. [ 27%] Building CXX object Source/Core/VideoCommon/CMakeFiles/videocommon.dir/CPMemory.cpp.o
  313. [ 27%] Building CXX object Source/Core/VideoCommon/CMakeFiles/videocommon.dir/CommandProcessor.cpp.o
  314. [ 27%] Building CXX object Source/Core/VideoCommon/CMakeFiles/videocommon.dir/Debugger.cpp.o
  315. [ 27%] Building CXX object Source/Core/VideoCommon/CMakeFiles/videocommon.dir/DriverDetails.cpp.o
  316. [ 28%] Building CXX object Source/Core/VideoCommon/CMakeFiles/videocommon.dir/Fifo.cpp.o
  317. [ 28%] Building CXX object Source/Core/VideoCommon/CMakeFiles/videocommon.dir/FPSCounter.cpp.o
  318. [ 28%] Building CXX object Source/Core/VideoCommon/CMakeFiles/videocommon.dir/FramebufferManagerBase.cpp.o
  319. [ 28%] Building CXX object Source/Core/VideoCommon/CMakeFiles/videocommon.dir/GeometryShaderGen.cpp.o
  320. [ 28%] Building CXX object Source/Core/VideoCommon/CMakeFiles/videocommon.dir/GeometryShaderManager.cpp.o
  321. [ 29%] Building CXX object Source/Core/VideoCommon/CMakeFiles/videocommon.dir/HiresTextures.cpp.o
  322. [ 29%] Building CXX object Source/Core/VideoCommon/CMakeFiles/videocommon.dir/ImageWrite.cpp.o
  323. [ 29%] Building CXX object Source/Core/VideoCommon/CMakeFiles/videocommon.dir/IndexGenerator.cpp.o
  324. [ 29%] Building CXX object Source/Core/VideoCommon/CMakeFiles/videocommon.dir/LightingShaderGen.cpp.o
  325. [ 29%] Building CXX object Source/Core/VideoCommon/CMakeFiles/videocommon.dir/MainBase.cpp.o
  326. [ 29%] Building CXX object Source/Core/VideoCommon/CMakeFiles/videocommon.dir/OnScreenDisplay.cpp.o
  327. [ 30%] Building CXX object Source/Core/VideoCommon/CMakeFiles/videocommon.dir/OpcodeDecoding.cpp.o
  328. [ 30%] Building CXX object Source/Core/VideoCommon/CMakeFiles/videocommon.dir/PerfQueryBase.cpp.o
  329. [ 30%] Building CXX object Source/Core/VideoCommon/CMakeFiles/videocommon.dir/PixelEngine.cpp.o
  330. [ 30%] Building CXX object Source/Core/VideoCommon/CMakeFiles/videocommon.dir/PixelShaderGen.cpp.o
  331. [ 30%] Building CXX object Source/Core/VideoCommon/CMakeFiles/videocommon.dir/PixelShaderManager.cpp.o
  332. [ 31%] Building CXX object Source/Core/VideoCommon/CMakeFiles/videocommon.dir/PostProcessing.cpp.o
  333. [ 31%] Building CXX object Source/Core/VideoCommon/CMakeFiles/videocommon.dir/RenderBase.cpp.o
  334. [ 31%] Building CXX object Source/Core/VideoCommon/CMakeFiles/videocommon.dir/Statistics.cpp.o
  335. [ 31%] Building CXX object Source/Core/VideoCommon/CMakeFiles/videocommon.dir/TextureCacheBase.cpp.o
  336. [ 31%] Building CXX object Source/Core/VideoCommon/CMakeFiles/videocommon.dir/TextureConversionShader.cpp.o
  337. [ 31%] Building CXX object Source/Core/VideoCommon/CMakeFiles/videocommon.dir/TextureDecoder_Common.cpp.o
  338. [ 32%] Building CXX object Source/Core/VideoCommon/CMakeFiles/videocommon.dir/VertexLoader.cpp.o
  339. [ 32%] Building CXX object Source/Core/VideoCommon/CMakeFiles/videocommon.dir/VertexLoaderBase.cpp.o
  340. [ 32%] Building CXX object Source/Core/VideoCommon/CMakeFiles/videocommon.dir/VertexLoaderManager.cpp.o
  341. [ 32%] Building CXX object Source/Core/VideoCommon/CMakeFiles/videocommon.dir/VertexLoader_Color.cpp.o
  342. [ 32%] Building CXX object Source/Core/VideoCommon/CMakeFiles/videocommon.dir/VertexLoader_Normal.cpp.o
  343. [ 32%] Building CXX object Source/Core/VideoCommon/CMakeFiles/videocommon.dir/VertexLoader_Position.cpp.o
  344. [ 34%] Building CXX object Source/Core/VideoCommon/CMakeFiles/videocommon.dir/VertexLoader_TextCoord.cpp.o
  345. [ 34%] Building CXX object Source/Core/VideoCommon/CMakeFiles/videocommon.dir/VertexManagerBase.cpp.o
  346. [ 34%] Building CXX object Source/Core/VideoCommon/CMakeFiles/videocommon.dir/VertexShaderGen.cpp.o
  347. [ 34%] Building CXX object Source/Core/VideoCommon/CMakeFiles/videocommon.dir/VertexShaderManager.cpp.o
  348. [ 34%] Building CXX object Source/Core/VideoCommon/CMakeFiles/videocommon.dir/VideoBackendBase.cpp.o
  349. [ 35%] Building CXX object Source/Core/VideoCommon/CMakeFiles/videocommon.dir/VideoConfig.cpp.o
  350. [ 35%] Building CXX object Source/Core/VideoCommon/CMakeFiles/videocommon.dir/VideoState.cpp.o
  351. [ 35%] Building CXX object Source/Core/VideoCommon/CMakeFiles/videocommon.dir/XFMemory.cpp.o
  352. [ 35%] Building CXX object Source/Core/VideoCommon/CMakeFiles/videocommon.dir/XFStructs.cpp.o
  353. [ 35%] Building CXX object Source/Core/VideoCommon/CMakeFiles/videocommon.dir/TextureDecoder_x64.cpp.o
  354. [ 35%] Building CXX object Source/Core/VideoCommon/CMakeFiles/videocommon.dir/VertexLoaderX64.cpp.o
  355. [ 36%] Building CXX object Source/Core/VideoCommon/CMakeFiles/videocommon.dir/AVIDump.cpp.o
  356. /home/buck/.cache/pacaur/dolphin-emu-git/src/dolphin-emu/Source/Core/VideoCommon/AVIDump.cpp: In static member function ‘static bool AVIDump::CreateFile()’:
  357. /home/buck/.cache/pacaur/dolphin-emu-git/src/dolphin-emu/Source/Core/VideoCommon/AVIDump.cpp:143:12: warning: ‘int avpicture_get_size(AVPixelFormat, int, int)’ is deprecated [-Wdeprecated-declarations]
  358. s_size = avpicture_get_size(s_stream->codec->pix_fmt, s_width, s_height);
  359. ^~~~~~~~~~~~~~~~~~
  360. In file included from /home/buck/.cache/pacaur/dolphin-emu-git/src/dolphin-emu/Source/Core/VideoCommon/AVIDump.cpp:12:0:
  361. /usr/include/libavcodec/avcodec.h:4898:5: note: declared here
  362. int avpicture_get_size(enum AVPixelFormat pix_fmt, int width, int height);
  363. ^~~~~~~~~~~~~~~~~~
  364. /home/buck/.cache/pacaur/dolphin-emu-git/src/dolphin-emu/Source/Core/VideoCommon/AVIDump.cpp:143:74: warning: ‘int avpicture_get_size(AVPixelFormat, int, int)’ is deprecated [-Wdeprecated-declarations]
  365. s_size = avpicture_get_size(s_stream->codec->pix_fmt, s_width, s_height);
  366. ^
  367. In file included from /home/buck/.cache/pacaur/dolphin-emu-git/src/dolphin-emu/Source/Core/VideoCommon/AVIDump.cpp:12:0:
  368. /usr/include/libavcodec/avcodec.h:4898:5: note: declared here
  369. int avpicture_get_size(enum AVPixelFormat pix_fmt, int width, int height);
  370. ^~~~~~~~~~~~~~~~~~
  371. /home/buck/.cache/pacaur/dolphin-emu-git/src/dolphin-emu/Source/Core/VideoCommon/AVIDump.cpp:146:3: warning: ‘int avpicture_fill(AVPicture*, const uint8_t*, AVPixelFormat, int, int)’ is deprecated [-Wdeprecated-declarations]
  372. avpicture_fill((AVPicture*)s_scaled_frame, s_yuv_buffer, s_stream->codec->pix_fmt, s_width,
  373. ^~~~~~~~~~~~~~
  374. In file included from /home/buck/.cache/pacaur/dolphin-emu-git/src/dolphin-emu/Source/Core/VideoCommon/AVIDump.cpp:12:0:
  375. /usr/include/libavcodec/avcodec.h:4883:5: note: declared here
  376. int avpicture_fill(AVPicture *picture, const uint8_t *ptr,
  377. ^~~~~~~~~~~~~~
  378. /home/buck/.cache/pacaur/dolphin-emu-git/src/dolphin-emu/Source/Core/VideoCommon/AVIDump.cpp:147:26: warning: ‘int avpicture_fill(AVPicture*, const uint8_t*, AVPixelFormat, int, int)’ is deprecated [-Wdeprecated-declarations]
  379. s_height);
  380. ^
  381. In file included from /home/buck/.cache/pacaur/dolphin-emu-git/src/dolphin-emu/Source/Core/VideoCommon/AVIDump.cpp:12:0:
  382. /usr/include/libavcodec/avcodec.h:4883:5: note: declared here
  383. int avpicture_fill(AVPicture *picture, const uint8_t *ptr,
  384. ^~~~~~~~~~~~~~
  385. /home/buck/.cache/pacaur/dolphin-emu-git/src/dolphin-emu/Source/Core/VideoCommon/AVIDump.cpp: In static member function ‘static void AVIDump::AddFrame(const u8*, int, int)’:
  386. /home/buck/.cache/pacaur/dolphin-emu-git/src/dolphin-emu/Source/Core/VideoCommon/AVIDump.cpp:171:3: warning: ‘int avpicture_fill(AVPicture*, const uint8_t*, AVPixelFormat, int, int)’ is deprecated [-Wdeprecated-declarations]
  387. avpicture_fill((AVPicture*)s_src_frame, const_cast<u8*>(data), s_pix_fmt, width, height);
  388. ^~~~~~~~~~~~~~
  389. In file included from /home/buck/.cache/pacaur/dolphin-emu-git/src/dolphin-emu/Source/Core/VideoCommon/AVIDump.cpp:12:0:
  390. /usr/include/libavcodec/avcodec.h:4883:5: note: declared here
  391. int avpicture_fill(AVPicture *picture, const uint8_t *ptr,
  392. ^~~~~~~~~~~~~~
  393. /home/buck/.cache/pacaur/dolphin-emu-git/src/dolphin-emu/Source/Core/VideoCommon/AVIDump.cpp:171:90: warning: ‘int avpicture_fill(AVPicture*, const uint8_t*, AVPixelFormat, int, int)’ is deprecated [-Wdeprecated-declarations]
  394. avpicture_fill((AVPicture*)s_src_frame, const_cast<u8*>(data), s_pix_fmt, width, height);
  395. ^
  396. In file included from /home/buck/.cache/pacaur/dolphin-emu-git/src/dolphin-emu/Source/Core/VideoCommon/AVIDump.cpp:12:0:
  397. /usr/include/libavcodec/avcodec.h:4883:5: note: declared here
  398. int avpicture_fill(AVPicture *picture, const uint8_t *ptr,
  399. ^~~~~~~~~~~~~~
  400. /home/buck/.cache/pacaur/dolphin-emu-git/src/dolphin-emu/Source/Core/VideoCommon/AVIDump.cpp: In static member function ‘static bool AVIDump::CreateFile()’:
  401. /home/buck/.cache/pacaur/dolphin-emu-git/src/dolphin-emu/Source/Core/VideoCommon/AVIDump.cpp:156:51: warning: ignoring return value of ‘int avformat_write_header(AVFormatContext*, AVDictionary**)’, declared with attribute warn_unused_result [-Wunused-result]
  402. avformat_write_header(s_format_context, nullptr);
  403. ^
  404. [ 36%] Linking CXX static library libvideocommon.a
  405. [ 36%] Built target videocommon
  406. Scanning dependencies of target core
  407. [ 36%] Building CXX object Source/Core/Core/CMakeFiles/core.dir/ActionReplay.cpp.o
  408. [ 36%] Building CXX object Source/Core/Core/CMakeFiles/core.dir/Analytics.cpp.o
  409. [ 36%] Building CXX object Source/Core/Core/CMakeFiles/core.dir/ARDecrypt.cpp.o
  410. [ 37%] Building CXX object Source/Core/Core/CMakeFiles/core.dir/BootManager.cpp.o
  411. [ 37%] Building CXX object Source/Core/Core/CMakeFiles/core.dir/ConfigManager.cpp.o
  412. [ 37%] Building CXX object Source/Core/Core/CMakeFiles/core.dir/Core.cpp.o
  413. In file included from /usr/include/mbedtls/net.h:34:0,
  414. from /home/buck/.cache/pacaur/dolphin-emu-git/src/dolphin-emu/Source/Core/Core/IPC_HLE/WII_IPC_HLE_Device_net_ssl.h:9,
  415. from /home/buck/.cache/pacaur/dolphin-emu-git/src/dolphin-emu/Source/Core/Core/IPC_HLE/WII_Socket.h:54,
  416. from /home/buck/.cache/pacaur/dolphin-emu-git/src/dolphin-emu/Source/Core/Core/Core.cpp:55:
  417. /usr/include/mbedtls/ssl.h:547:5: error: ‘mbedtls_time_t’ does not name a type
  418. mbedtls_time_t start; /*!< starting time */
  419. ^~~~~~~~~~~~~~
  420. make[2]: *** [Source/Core/Core/CMakeFiles/core.dir/build.make:189: Source/Core/Core/CMakeFiles/core.dir/Core.cpp.o] Error 1
  421. make[1]: *** [CMakeFiles/Makefile2:601: Source/Core/Core/CMakeFiles/core.dir/all] Error 2
  422. make: *** [Makefile:161: all] Error 2
  423. ==> ERROR: A failure occurred in build().
  424. Aborting...
  425. :: failed to build dolphin-emu-cli-git,dolphin-emu-qt-git,dolphin-emu-git package(s)
  426. buck@archie ~>
RAW Paste Data

Adblocker detected! Please consider disabling it...

We've detected AdBlock Plus or some other adblocking software preventing Pastebin.com from fully loading.

We don't have any obnoxious sound, or popup ads, we actively block these annoying types of ads!

Please add Pastebin.com to your ad blocker whitelist or disable your adblocking software.

×