Advertisement
dedrickt

Untitled

Nov 23rd, 2020
16
Never
Not a member of Pastebin yet? Sign Up, it unlocks many cool features!
text 70.48 KB | None
  1. WARNING: An illegal reflective access operation has occurred
  2. WARNING: Illegal reflective access by com.google.inject.internal.cglib.core.$ReflectUtils$1 (file:/usr/share/maven/lib/guice.jar) to method java.lang.ClassLoader.defineClass(java.lang.String,byte[],int,int,java.security.ProtectionDomain)
  3. WARNING: Please consider reporting this to the maintainers of com.google.inject.internal.cglib.core.$ReflectUtils$1
  4. WARNING: Use --illegal-access=warn to enable warnings of further illegal reflective access operations
  5. WARNING: All illegal access operations will be denied in a future release
  6. [INFO] Scanning for projects...
  7. Downloading from openmrs-repo: http://mavenrepo.openmrs.org/nexus/content/repositories/public/de/saumya/mojo/gem-maven-plugin/maven-metadata.xml
  8. Downloading from openmrs-bintray-repo: https://dl.bintray.com/openmrs/maven/de/saumya/mojo/gem-maven-plugin/maven-metadata.xml
  9. Downloaded from openmrs-repo: http://mavenrepo.openmrs.org/nexus/content/repositories/public/de/saumya/mojo/gem-maven-plugin/maven-metadata.xml (2.0 kB at 373 B/s)
  10. [WARNING]
  11. [WARNING] Some problems were encountered while building the effective model for org.openmrs.module:referenceapplication-omod:jar:2.12.0-SNAPSHOT
  12. [WARNING] 'build.plugins.plugin.(groupId:artifactId)' must be unique but found duplicate declaration of plugin org.apache.maven.plugins:maven-dependency-plugin @ line 231, column 21
  13. [WARNING] 'build.plugins.plugin.version' for de.saumya.mojo:gem-maven-plugin is missing. @ line 256, column 21
  14. [WARNING]
  15. [WARNING] It is highly recommended to fix these problems because they threaten the stability of your build.
  16. [WARNING]
  17. [WARNING] For this reason, future Maven versions might no longer support building such malformed projects.
  18. [WARNING]
  19. [INFO] ------------------------------------------------------------------------
  20. [INFO] Reactor Build Order:
  21. [INFO]
  22. [INFO] Reference Application Module [pom]
  23. [INFO] Reference Application Module API [jar]
  24. [INFO] Reference Application Module OMOD [jar]
  25. Downloading from openmrs-bintray-repo: https://dl.bintray.com/openmrs/maven/org/apache/maven/plugins/maven-compiler-plugin/maven-metadata.xml
  26. Downloading from openmrs-repo: http://mavenrepo.openmrs.org/nexus/content/repositories/public/org/apache/maven/plugins/maven-compiler-plugin/maven-metadata.xml
  27. Downloaded from openmrs-repo: http://mavenrepo.openmrs.org/nexus/content/repositories/public/org/apache/maven/plugins/maven-compiler-plugin/maven-metadata.xml (1.1 kB at 1.4 kB/s)
  28. Downloading from openmrs-repo: http://mavenrepo.openmrs.org/nexus/content/repositories/public/org/eclipse/m2e/lifecycle-mapping/1.0.0/lifecycle-mapping-1.0.0.pom
  29. Downloading from openmrs-bintray-repo: https://dl.bintray.com/openmrs/maven/org/eclipse/m2e/lifecycle-mapping/1.0.0/lifecycle-mapping-1.0.0.pom
  30. [WARNING] The POM for org.eclipse.m2e:lifecycle-mapping:jar:1.0.0 is missing, no dependency information available
  31. Downloading from openmrs-repo: http://mavenrepo.openmrs.org/nexus/content/repositories/public/org/eclipse/m2e/lifecycle-mapping/1.0.0/lifecycle-mapping-1.0.0.jar
  32. Downloading from openmrs-bintray-repo: https://dl.bintray.com/openmrs/maven/org/eclipse/m2e/lifecycle-mapping/1.0.0/lifecycle-mapping-1.0.0.jar
  33. [WARNING] Failed to retrieve plugin descriptor for org.eclipse.m2e:lifecycle-mapping:1.0.0: Plugin org.eclipse.m2e:lifecycle-mapping:1.0.0 or one of its dependencies could not be resolved: Could not find artifact org.eclipse.m2e:lifecycle-mapping:jar:1.0.0 in openmrs-repo (http://mavenrepo.openmrs.org/nexus/content/repositories/public)
  34. Downloading from openmrs-repo: http://mavenrepo.openmrs.org/nexus/content/repositories/public/org/openmrs/maven/plugins/maven-metadata.xml
  35. Downloading from openmrs-bintray-repo: https://dl.bintray.com/openmrs/maven/org/openmrs/maven/plugins/maven-metadata.xml
  36. Downloading from openmrs-bintray-repo: https://dl.bintray.com/openmrs/maven/org/apache/maven/plugins/maven-metadata.xml
  37. Downloading from openmrs-repo: http://mavenrepo.openmrs.org/nexus/content/repositories/public/org/apache/maven/plugins/maven-metadata.xml
  38. Downloading from openmrs-repo: http://mavenrepo.openmrs.org/nexus/content/repositories/public/org/codehaus/mojo/maven-metadata.xml
  39. Downloaded from openmrs-bintray-repo: https://dl.bintray.com/openmrs/maven/org/openmrs/maven/plugins/maven-metadata.xml (432 B at 295 B/s)
  40. Downloading from openmrs-bintray-repo: https://dl.bintray.com/openmrs/maven/org/codehaus/mojo/maven-metadata.xml
  41. Downloaded from openmrs-repo: http://mavenrepo.openmrs.org/nexus/content/repositories/public/org/openmrs/maven/plugins/maven-metadata.xml (1.4 kB at 629 B/s)
  42. Downloaded from openmrs-repo: http://mavenrepo.openmrs.org/nexus/content/repositories/public/org/apache/maven/plugins/maven-metadata.xml (19 kB at 7.6 kB/s)
  43. Downloaded from openmrs-repo: http://mavenrepo.openmrs.org/nexus/content/repositories/public/org/codehaus/mojo/maven-metadata.xml (20 kB at 13 kB/s)
  44. Downloading from openmrs-repo: http://mavenrepo.openmrs.org/nexus/content/repositories/public/org/openmrs/maven/plugins/openmrs-sdk-maven-plugin/maven-metadata.xml
  45. Downloading from openmrs-bintray-repo: https://dl.bintray.com/openmrs/maven/org/openmrs/maven/plugins/openmrs-sdk-maven-plugin/maven-metadata.xml
  46. Downloaded from openmrs-repo: http://mavenrepo.openmrs.org/nexus/content/repositories/public/org/openmrs/maven/plugins/openmrs-sdk-maven-plugin/maven-metadata.xml (1.9 kB at 3.1 kB/s)
  47. Downloaded from openmrs-bintray-repo: https://dl.bintray.com/openmrs/maven/org/openmrs/maven/plugins/openmrs-sdk-maven-plugin/maven-metadata.xml (1.6 kB at 2.4 kB/s)
  48. [INFO]
  49. [INFO] --------------< org.openmrs.module:referenceapplication >---------------
  50. [INFO] Building Reference Application Module 2.12.0-SNAPSHOT [1/3]
  51. [INFO] --------------------------------[ pom ]---------------------------------
  52. [INFO]
  53. [INFO] --- maven-clean-plugin:2.5:clean (default-clean) @ referenceapplication ---
  54. [INFO]
  55. [INFO] --- maven-install-plugin:2.4:install (default-install) @ referenceapplication ---
  56. [INFO] Installing /home/tarad/git/openmrs-module-referenceapplication/pom.xml to /home/tarad/.m2/repository/org/openmrs/module/referenceapplication/2.12.0-SNAPSHOT/referenceapplication-2.12.0-SNAPSHOT.pom
  57. [INFO]
  58. [INFO] ------------< org.openmrs.module:referenceapplication-api >-------------
  59. [INFO] Building Reference Application Module API 2.12.0-SNAPSHOT [2/3]
  60. [INFO] --------------------------------[ jar ]---------------------------------
  61. [INFO]
  62. [INFO] --- maven-clean-plugin:2.5:clean (default-clean) @ referenceapplication-api ---
  63. [INFO] Deleting /home/tarad/git/openmrs-module-referenceapplication/api/target
  64. [INFO]
  65. [INFO] --- maven-resources-plugin:2.6:resources (default-resources) @ referenceapplication-api ---
  66. [INFO] Using 'UTF-8' encoding to copy filtered resources.
  67. [INFO] Copying 22 resources
  68. [INFO]
  69. [INFO] --- maven-compiler-plugin:3.1:compile (default-compile) @ referenceapplication-api ---
  70. [INFO] Changes detected - recompiling the module!
  71. [INFO] Compiling 3 source files to /home/tarad/git/openmrs-module-referenceapplication/api/target/classes
  72. [INFO]
  73. [INFO] --- maven-resources-plugin:2.6:testResources (default-testResources) @ referenceapplication-api ---
  74. [INFO] Using 'UTF-8' encoding to copy filtered resources.
  75. [INFO] Copying 3 resources
  76. [INFO]
  77. [INFO] --- maven-compiler-plugin:3.1:testCompile (default-testCompile) @ referenceapplication-api ---
  78. [INFO] Changes detected - recompiling the module!
  79. [INFO] Compiling 3 source files to /home/tarad/git/openmrs-module-referenceapplication/api/target/test-classes
  80. [INFO]
  81. [INFO] --- maven-surefire-plugin:2.22.1:test (default-test) @ referenceapplication-api ---
  82. [INFO]
  83. [INFO] -------------------------------------------------------
  84. [INFO] T E S T S
  85. [INFO] -------------------------------------------------------
  86. [INFO] Running org.openmrs.module.referenceapplication.ReferenceApplicationActivatorTest
  87. [INFO] Tests run: 2, Failures: 0, Errors: 0, Skipped: 0, Time elapsed: 5.499 s - in org.openmrs.module.referenceapplication.ReferenceApplicationActivatorTest
  88. [INFO] Running org.openmrs.module.referenceapplication.administrativenotification.ConfigureAtlasNotificationProducerTest
  89. ERROR - TestContextManager.prepareTestInstance(215) |2020-11-23 18:08:48,099| Caught exception while allowing TestExecutionListener [org.springframework.test.context.support.DependencyInjectionTestExecutionListener@7eb4ad65] to prepare test instance [org.openmrs.module.referenceapplication.administrativenotification.ConfigureAtlasNotificationProducerTest@5f392f80]
  90. java.lang.IllegalStateException: Failed to load ApplicationContext
  91. at org.springframework.test.context.DefaultCacheAwareContextLoaderDelegate.loadContext(DefaultCacheAwareContextLoaderDelegate.java:94)
  92. at org.springframework.test.context.DefaultTestContext.getApplicationContext(DefaultTestContext.java:72)
  93. at org.springframework.test.context.support.DependencyInjectionTestExecutionListener.injectDependencies(DependencyInjectionTestExecutionListener.java:117)
  94. at org.springframework.test.context.support.DependencyInjectionTestExecutionListener.prepareTestInstance(DependencyInjectionTestExecutionListener.java:83)
  95. at org.springframework.test.context.TestContextManager.prepareTestInstance(TestContextManager.java:212)
  96. at org.springframework.test.context.junit4.SpringJUnit4ClassRunner.createTest(SpringJUnit4ClassRunner.java:200)
  97. at org.springframework.test.context.junit4.SpringJUnit4ClassRunner$1.runReflectiveCall(SpringJUnit4ClassRunner.java:252)
  98. at org.junit.internal.runners.model.ReflectiveCallable.run(ReflectiveCallable.java:12)
  99. at org.springframework.test.context.junit4.SpringJUnit4ClassRunner.methodBlock(SpringJUnit4ClassRunner.java:254)
  100. at org.springframework.test.context.junit4.SpringJUnit4ClassRunner.runChild(SpringJUnit4ClassRunner.java:217)
  101. at org.springframework.test.context.junit4.SpringJUnit4ClassRunner.runChild(SpringJUnit4ClassRunner.java:83)
  102. at org.junit.runners.ParentRunner$3.run(ParentRunner.java:238)
  103. at org.junit.runners.ParentRunner$1.schedule(ParentRunner.java:63)
  104. at org.junit.runners.ParentRunner.runChildren(ParentRunner.java:236)
  105. at org.junit.runners.ParentRunner.access$000(ParentRunner.java:53)
  106. at org.junit.runners.ParentRunner$2.evaluate(ParentRunner.java:229)
  107. at org.springframework.test.context.junit4.statements.RunBeforeTestClassCallbacks.evaluate(RunBeforeTestClassCallbacks.java:61)
  108. at org.junit.internal.runners.statements.RunAfters.evaluate(RunAfters.java:27)
  109. at org.springframework.test.context.junit4.statements.RunAfterTestClassCallbacks.evaluate(RunAfterTestClassCallbacks.java:68)
  110. at org.junit.runners.ParentRunner.run(ParentRunner.java:309)
  111. at org.springframework.test.context.junit4.SpringJUnit4ClassRunner.run(SpringJUnit4ClassRunner.java:163)
  112. at org.apache.maven.surefire.junit4.JUnit4Provider.execute(JUnit4Provider.java:365)
  113. at org.apache.maven.surefire.junit4.JUnit4Provider.executeWithRerun(JUnit4Provider.java:273)
  114. at org.apache.maven.surefire.junit4.JUnit4Provider.executeTestSet(JUnit4Provider.java:238)
  115. at org.apache.maven.surefire.junit4.JUnit4Provider.invoke(JUnit4Provider.java:159)
  116. at org.apache.maven.surefire.booter.ForkedBooter.invokeProviderInSameClassLoader(ForkedBooter.java:384)
  117. at org.apache.maven.surefire.booter.ForkedBooter.runSuitesInProcess(ForkedBooter.java:345)
  118. at org.apache.maven.surefire.booter.ForkedBooter.execute(ForkedBooter.java:126)
  119. at org.apache.maven.surefire.booter.ForkedBooter.main(ForkedBooter.java:418)
  120. Caused by: org.springframework.beans.factory.BeanCreationException: Error creating bean with name 'stringToAppDescriptorConverter': Injection of autowired dependencies failed; nested exception is org.springframework.beans.factory.BeanCreationException: Could not autowire field: private org.openmrs.module.appframework.service.AppFrameworkService org.openmrs.module.appui.converter.StringToAppDescriptorConverter.appFrameworkService; nested exception is org.springframework.beans.factory.NoSuchBeanDefinitionException: No qualifying bean of type [org.openmrs.module.appframework.service.AppFrameworkService] found for dependency: expected at least 1 bean which qualifies as autowire candidate for this dependency. Dependency annotations: {@org.springframework.beans.factory.annotation.Autowired(required=true)}
  121. Related cause: org.springframework.beans.factory.BeanCreationException: Error creating bean with name 'appFrameworkService' defined in URL [jar:file:/home/tarad/.m2/repository/org/openmrs/module/appframework-api/2.9/appframework-api-2.9.jar!/moduleApplicationContext.xml]: Cannot create inner bean 'org.openmrs.module.appframework.service.AppFrameworkServiceImpl#14060410' of type [org.openmrs.module.appframework.service.AppFrameworkServiceImpl] while setting bean property 'target'; nested exception is org.springframework.beans.factory.BeanCreationException: Error creating bean with name 'org.openmrs.module.appframework.service.AppFrameworkServiceImpl#14060410' defined in URL [jar:file:/home/tarad/.m2/repository/org/openmrs/module/appframework-api/2.9/appframework-api-2.9.jar!/moduleApplicationContext.xml]: Cannot resolve reference to bean 'allAppTemplates' while setting constructor argument; nested exception is org.springframework.beans.factory.BeanCreationException: Error creating bean with name 'allAppTemplates': Injection of autowired dependencies failed; nested exception is org.springframework.beans.factory.BeanCreationException: Could not autowire field: private javax.validation.Validator org.openmrs.module.appframework.repository.AllAppTemplates.validator; nested exception is org.springframework.beans.factory.BeanCreationException: Error creating bean with name 'validatorFactory' defined in URL [jar:file:/home/tarad/.m2/repository/org/openmrs/module/appframework-api/2.9/appframework-api-2.9.jar!/moduleApplicationContext.xml]: Invocation of init method failed; nested exception is java.lang.NoClassDefFoundError: javax/xml/bind/JAXBException
  122. at org.springframework.beans.factory.annotation.AutowiredAnnotationBeanPostProcessor.postProcessPropertyValues(AutowiredAnnotationBeanPostProcessor.java:334)
  123. at org.springframework.beans.factory.support.AbstractAutowireCapableBeanFactory.populateBean(AbstractAutowireCapableBeanFactory.java:1202)
  124. at org.springframework.beans.factory.support.AbstractAutowireCapableBeanFactory.doCreateBean(AbstractAutowireCapableBeanFactory.java:537)
  125. at org.springframework.beans.factory.support.AbstractAutowireCapableBeanFactory.createBean(AbstractAutowireCapableBeanFactory.java:476)
  126. at org.springframework.beans.factory.support.AbstractBeanFactory$1.getObject(AbstractBeanFactory.java:303)
  127. at org.springframework.beans.factory.support.DefaultSingletonBeanRegistry.getSingleton(DefaultSingletonBeanRegistry.java:230)
  128. at org.springframework.beans.factory.support.AbstractBeanFactory.doGetBean(AbstractBeanFactory.java:299)
  129. at org.springframework.beans.factory.support.AbstractBeanFactory.getBean(AbstractBeanFactory.java:194)
  130. at org.springframework.beans.factory.support.DefaultListableBeanFactory.preInstantiateSingletons(DefaultListableBeanFactory.java:762)
  131. at org.springframework.context.support.AbstractApplicationContext.finishBeanFactoryInitialization(AbstractApplicationContext.java:757)
  132. at org.springframework.context.support.AbstractApplicationContext.refresh(AbstractApplicationContext.java:480)
  133. at org.springframework.test.context.support.AbstractGenericContextLoader.loadContext(AbstractGenericContextLoader.java:125)
  134. at org.springframework.test.context.support.AbstractGenericContextLoader.loadContext(AbstractGenericContextLoader.java:60)
  135. at org.springframework.test.context.support.AbstractDelegatingSmartContextLoader.delegateLoading(AbstractDelegatingSmartContextLoader.java:109)
  136. at org.springframework.test.context.support.AbstractDelegatingSmartContextLoader.loadContext(AbstractDelegatingSmartContextLoader.java:261)
  137. at org.springframework.test.context.DefaultCacheAwareContextLoaderDelegate.loadContextInternal(DefaultCacheAwareContextLoaderDelegate.java:68)
  138. at org.springframework.test.context.DefaultCacheAwareContextLoaderDelegate.loadContext(DefaultCacheAwareContextLoaderDelegate.java:86)
  139. ... 28 more
  140. Caused by: org.springframework.beans.factory.BeanCreationException: Could not autowire field: private org.openmrs.module.appframework.service.AppFrameworkService org.openmrs.module.appui.converter.StringToAppDescriptorConverter.appFrameworkService; nested exception is org.springframework.beans.factory.NoSuchBeanDefinitionException: No qualifying bean of type [org.openmrs.module.appframework.service.AppFrameworkService] found for dependency: expected at least 1 bean which qualifies as autowire candidate for this dependency. Dependency annotations: {@org.springframework.beans.factory.annotation.Autowired(required=true)}
  141. at org.springframework.beans.factory.annotation.AutowiredAnnotationBeanPostProcessor$AutowiredFieldElement.inject(AutowiredAnnotationBeanPostProcessor.java:561)
  142. at org.springframework.beans.factory.annotation.InjectionMetadata.inject(InjectionMetadata.java:88)
  143. at org.springframework.beans.factory.annotation.AutowiredAnnotationBeanPostProcessor.postProcessPropertyValues(AutowiredAnnotationBeanPostProcessor.java:331)
  144. ... 44 more
  145. Caused by: org.springframework.beans.factory.NoSuchBeanDefinitionException: No qualifying bean of type [org.openmrs.module.appframework.service.AppFrameworkService] found for dependency: expected at least 1 bean which qualifies as autowire candidate for this dependency. Dependency annotations: {@org.springframework.beans.factory.annotation.Autowired(required=true)}
  146. at org.springframework.beans.factory.support.DefaultListableBeanFactory.raiseNoSuchBeanDefinitionException(DefaultListableBeanFactory.java:1308)
  147. at org.springframework.beans.factory.support.DefaultListableBeanFactory.doResolveDependency(DefaultListableBeanFactory.java:1054)
  148. at org.springframework.beans.factory.support.DefaultListableBeanFactory.resolveDependency(DefaultListableBeanFactory.java:949)
  149. at org.springframework.beans.factory.annotation.AutowiredAnnotationBeanPostProcessor$AutowiredFieldElement.inject(AutowiredAnnotationBeanPostProcessor.java:533)
  150. ... 46 more
  151. [ERROR] Tests run: 1, Failures: 0, Errors: 1, Skipped: 0, Time elapsed: 92.55 s <<< FAILURE! - in org.openmrs.module.referenceapplication.administrativenotification.ConfigureAtlasNotificationProducerTest
  152. [ERROR] testWhenAtlasModuleIsNotInstalled(org.openmrs.module.referenceapplication.administrativenotification.ConfigureAtlasNotificationProducerTest) Time elapsed: 0.008 s <<< ERROR!
  153. java.lang.IllegalStateException: Failed to load ApplicationContext
  154. Caused by: org.springframework.beans.factory.BeanCreationException: Error creating bean with name 'stringToAppDescriptorConverter': Injection of autowired dependencies failed; nested exception is org.springframework.beans.factory.BeanCreationException: Could not autowire field: private org.openmrs.module.appframework.service.AppFrameworkService org.openmrs.module.appui.converter.StringToAppDescriptorConverter.appFrameworkService; nested exception is org.springframework.beans.factory.NoSuchBeanDefinitionException: No qualifying bean of type [org.openmrs.module.appframework.service.AppFrameworkService] found for dependency: expected at least 1 bean which qualifies as autowire candidate for this dependency. Dependency annotations: {@org.springframework.beans.factory.annotation.Autowired(required=true)}
  155. Caused by: org.springframework.beans.factory.BeanCreationException: Could not autowire field: private org.openmrs.module.appframework.service.AppFrameworkService org.openmrs.module.appui.converter.StringToAppDescriptorConverter.appFrameworkService; nested exception is org.springframework.beans.factory.NoSuchBeanDefinitionException: No qualifying bean of type [org.openmrs.module.appframework.service.AppFrameworkService] found for dependency: expected at least 1 bean which qualifies as autowire candidate for this dependency. Dependency annotations: {@org.springframework.beans.factory.annotation.Autowired(required=true)}
  156. Caused by: org.springframework.beans.factory.NoSuchBeanDefinitionException: No qualifying bean of type [org.openmrs.module.appframework.service.AppFrameworkService] found for dependency: expected at least 1 bean which qualifies as autowire candidate for this dependency. Dependency annotations: {@org.springframework.beans.factory.annotation.Autowired(required=true)}
  157.  
  158. [INFO] Running org.openmrs.module.referenceapplication.ReferenceApplicationActivatorComponentTest
  159. ERROR - TestContextManager.prepareTestInstance(215) |2020-11-23 18:09:29,652| Caught exception while allowing TestExecutionListener [org.springframework.test.context.support.DependencyInjectionTestExecutionListener@c4aa305] to prepare test instance [org.openmrs.module.referenceapplication.ReferenceApplicationActivatorComponentTest@709f11f3]
  160. java.lang.IllegalStateException: Failed to load ApplicationContext
  161. at org.springframework.test.context.DefaultCacheAwareContextLoaderDelegate.loadContext(DefaultCacheAwareContextLoaderDelegate.java:94)
  162. at org.springframework.test.context.DefaultTestContext.getApplicationContext(DefaultTestContext.java:72)
  163. at org.springframework.test.context.support.DependencyInjectionTestExecutionListener.injectDependencies(DependencyInjectionTestExecutionListener.java:117)
  164. at org.springframework.test.context.support.DependencyInjectionTestExecutionListener.prepareTestInstance(DependencyInjectionTestExecutionListener.java:83)
  165. at org.springframework.test.context.TestContextManager.prepareTestInstance(TestContextManager.java:212)
  166. at org.springframework.test.context.junit4.SpringJUnit4ClassRunner.createTest(SpringJUnit4ClassRunner.java:200)
  167. at org.springframework.test.context.junit4.SpringJUnit4ClassRunner$1.runReflectiveCall(SpringJUnit4ClassRunner.java:252)
  168. at org.junit.internal.runners.model.ReflectiveCallable.run(ReflectiveCallable.java:12)
  169. at org.springframework.test.context.junit4.SpringJUnit4ClassRunner.methodBlock(SpringJUnit4ClassRunner.java:254)
  170. at org.springframework.test.context.junit4.SpringJUnit4ClassRunner.runChild(SpringJUnit4ClassRunner.java:217)
  171. at org.springframework.test.context.junit4.SpringJUnit4ClassRunner.runChild(SpringJUnit4ClassRunner.java:83)
  172. at org.junit.runners.ParentRunner$3.run(ParentRunner.java:238)
  173. at org.junit.runners.ParentRunner$1.schedule(ParentRunner.java:63)
  174. at org.junit.runners.ParentRunner.runChildren(ParentRunner.java:236)
  175. at org.junit.runners.ParentRunner.access$000(ParentRunner.java:53)
  176. at org.junit.runners.ParentRunner$2.evaluate(ParentRunner.java:229)
  177. at org.springframework.test.context.junit4.statements.RunBeforeTestClassCallbacks.evaluate(RunBeforeTestClassCallbacks.java:61)
  178. at org.junit.internal.runners.statements.RunAfters.evaluate(RunAfters.java:27)
  179. at org.springframework.test.context.junit4.statements.RunAfterTestClassCallbacks.evaluate(RunAfterTestClassCallbacks.java:68)
  180. at org.junit.runners.ParentRunner.run(ParentRunner.java:309)
  181. at org.springframework.test.context.junit4.SpringJUnit4ClassRunner.run(SpringJUnit4ClassRunner.java:163)
  182. at org.apache.maven.surefire.junit4.JUnit4Provider.execute(JUnit4Provider.java:365)
  183. at org.apache.maven.surefire.junit4.JUnit4Provider.executeWithRerun(JUnit4Provider.java:273)
  184. at org.apache.maven.surefire.junit4.JUnit4Provider.executeTestSet(JUnit4Provider.java:238)
  185. at org.apache.maven.surefire.junit4.JUnit4Provider.invoke(JUnit4Provider.java:159)
  186. at org.apache.maven.surefire.booter.ForkedBooter.invokeProviderInSameClassLoader(ForkedBooter.java:384)
  187. at org.apache.maven.surefire.booter.ForkedBooter.runSuitesInProcess(ForkedBooter.java:345)
  188. at org.apache.maven.surefire.booter.ForkedBooter.execute(ForkedBooter.java:126)
  189. at org.apache.maven.surefire.booter.ForkedBooter.main(ForkedBooter.java:418)
  190. Caused by: org.springframework.beans.factory.BeanCreationException: Error creating bean with name 'stringToAppDescriptorConverter': Injection of autowired dependencies failed; nested exception is org.springframework.beans.factory.BeanCreationException: Could not autowire field: private org.openmrs.module.appframework.service.AppFrameworkService org.openmrs.module.appui.converter.StringToAppDescriptorConverter.appFrameworkService; nested exception is org.springframework.beans.factory.NoSuchBeanDefinitionException: No qualifying bean of type [org.openmrs.module.appframework.service.AppFrameworkService] found for dependency: expected at least 1 bean which qualifies as autowire candidate for this dependency. Dependency annotations: {@org.springframework.beans.factory.annotation.Autowired(required=true)}
  191. Related cause: org.springframework.beans.factory.BeanCreationException: Error creating bean with name 'appFrameworkService' defined in URL [jar:file:/home/tarad/.m2/repository/org/openmrs/module/appframework-api/2.9/appframework-api-2.9.jar!/moduleApplicationContext.xml]: Cannot create inner bean 'org.openmrs.module.appframework.service.AppFrameworkServiceImpl#12ecf3ff' of type [org.openmrs.module.appframework.service.AppFrameworkServiceImpl] while setting bean property 'target'; nested exception is org.springframework.beans.factory.BeanCreationException: Error creating bean with name 'org.openmrs.module.appframework.service.AppFrameworkServiceImpl#12ecf3ff' defined in URL [jar:file:/home/tarad/.m2/repository/org/openmrs/module/appframework-api/2.9/appframework-api-2.9.jar!/moduleApplicationContext.xml]: Cannot resolve reference to bean 'allAppTemplates' while setting constructor argument; nested exception is org.springframework.beans.factory.BeanCreationException: Error creating bean with name 'allAppTemplates': Injection of autowired dependencies failed; nested exception is org.springframework.beans.factory.BeanCreationException: Could not autowire field: private javax.validation.Validator org.openmrs.module.appframework.repository.AllAppTemplates.validator; nested exception is org.springframework.beans.factory.BeanCreationException: Error creating bean with name 'validatorFactory' defined in URL [jar:file:/home/tarad/.m2/repository/org/openmrs/module/appframework-api/2.9/appframework-api-2.9.jar!/moduleApplicationContext.xml]: Invocation of init method failed; nested exception is java.lang.NoClassDefFoundError: javax/xml/bind/JAXBException
  192. at org.springframework.beans.factory.annotation.AutowiredAnnotationBeanPostProcessor.postProcessPropertyValues(AutowiredAnnotationBeanPostProcessor.java:334)
  193. at org.springframework.beans.factory.support.AbstractAutowireCapableBeanFactory.populateBean(AbstractAutowireCapableBeanFactory.java:1202)
  194. at org.springframework.beans.factory.support.AbstractAutowireCapableBeanFactory.doCreateBean(AbstractAutowireCapableBeanFactory.java:537)
  195. at org.springframework.beans.factory.support.AbstractAutowireCapableBeanFactory.createBean(AbstractAutowireCapableBeanFactory.java:476)
  196. at org.springframework.beans.factory.support.AbstractBeanFactory$1.getObject(AbstractBeanFactory.java:303)
  197. at org.springframework.beans.factory.support.DefaultSingletonBeanRegistry.getSingleton(DefaultSingletonBeanRegistry.java:230)
  198. at org.springframework.beans.factory.support.AbstractBeanFactory.doGetBean(AbstractBeanFactory.java:299)
  199. at org.springframework.beans.factory.support.AbstractBeanFactory.getBean(AbstractBeanFactory.java:194)
  200. at org.springframework.beans.factory.support.DefaultListableBeanFactory.preInstantiateSingletons(DefaultListableBeanFactory.java:762)
  201. at org.springframework.context.support.AbstractApplicationContext.finishBeanFactoryInitialization(AbstractApplicationContext.java:757)
  202. at org.springframework.context.support.AbstractApplicationContext.refresh(AbstractApplicationContext.java:480)
  203. at org.springframework.test.context.support.AbstractGenericContextLoader.loadContext(AbstractGenericContextLoader.java:125)
  204. at org.springframework.test.context.support.AbstractGenericContextLoader.loadContext(AbstractGenericContextLoader.java:60)
  205. at org.springframework.test.context.support.AbstractDelegatingSmartContextLoader.delegateLoading(AbstractDelegatingSmartContextLoader.java:109)
  206. at org.springframework.test.context.support.AbstractDelegatingSmartContextLoader.loadContext(AbstractDelegatingSmartContextLoader.java:261)
  207. at org.springframework.test.context.DefaultCacheAwareContextLoaderDelegate.loadContextInternal(DefaultCacheAwareContextLoaderDelegate.java:68)
  208. at org.springframework.test.context.DefaultCacheAwareContextLoaderDelegate.loadContext(DefaultCacheAwareContextLoaderDelegate.java:86)
  209. ... 28 more
  210. Caused by: org.springframework.beans.factory.BeanCreationException: Could not autowire field: private org.openmrs.module.appframework.service.AppFrameworkService org.openmrs.module.appui.converter.StringToAppDescriptorConverter.appFrameworkService; nested exception is org.springframework.beans.factory.NoSuchBeanDefinitionException: No qualifying bean of type [org.openmrs.module.appframework.service.AppFrameworkService] found for dependency: expected at least 1 bean which qualifies as autowire candidate for this dependency. Dependency annotations: {@org.springframework.beans.factory.annotation.Autowired(required=true)}
  211. at org.springframework.beans.factory.annotation.AutowiredAnnotationBeanPostProcessor$AutowiredFieldElement.inject(AutowiredAnnotationBeanPostProcessor.java:561)
  212. at org.springframework.beans.factory.annotation.InjectionMetadata.inject(InjectionMetadata.java:88)
  213. at org.springframework.beans.factory.annotation.AutowiredAnnotationBeanPostProcessor.postProcessPropertyValues(AutowiredAnnotationBeanPostProcessor.java:331)
  214. ... 44 more
  215. Caused by: org.springframework.beans.factory.NoSuchBeanDefinitionException: No qualifying bean of type [org.openmrs.module.appframework.service.AppFrameworkService] found for dependency: expected at least 1 bean which qualifies as autowire candidate for this dependency. Dependency annotations: {@org.springframework.beans.factory.annotation.Autowired(required=true)}
  216. at org.springframework.beans.factory.support.DefaultListableBeanFactory.raiseNoSuchBeanDefinitionException(DefaultListableBeanFactory.java:1308)
  217. at org.springframework.beans.factory.support.DefaultListableBeanFactory.doResolveDependency(DefaultListableBeanFactory.java:1054)
  218. at org.springframework.beans.factory.support.DefaultListableBeanFactory.resolveDependency(DefaultListableBeanFactory.java:949)
  219. at org.springframework.beans.factory.annotation.AutowiredAnnotationBeanPostProcessor$AutowiredFieldElement.inject(AutowiredAnnotationBeanPostProcessor.java:533)
  220. ... 46 more
  221. ERROR - TestContextManager.prepareTestInstance(215) |2020-11-23 18:09:44,725| Caught exception while allowing TestExecutionListener [org.springframework.test.context.support.DependencyInjectionTestExecutionListener@c4aa305] to prepare test instance [org.openmrs.module.referenceapplication.ReferenceApplicationActivatorComponentTest@6ab20341]
  222. java.lang.IllegalStateException: Failed to load ApplicationContext
  223. at org.springframework.test.context.DefaultCacheAwareContextLoaderDelegate.loadContext(DefaultCacheAwareContextLoaderDelegate.java:94)
  224. at org.springframework.test.context.DefaultTestContext.getApplicationContext(DefaultTestContext.java:72)
  225. at org.springframework.test.context.support.DependencyInjectionTestExecutionListener.injectDependencies(DependencyInjectionTestExecutionListener.java:117)
  226. at org.springframework.test.context.support.DependencyInjectionTestExecutionListener.prepareTestInstance(DependencyInjectionTestExecutionListener.java:83)
  227. at org.springframework.test.context.TestContextManager.prepareTestInstance(TestContextManager.java:212)
  228. at org.springframework.test.context.junit4.SpringJUnit4ClassRunner.createTest(SpringJUnit4ClassRunner.java:200)
  229. at org.springframework.test.context.junit4.SpringJUnit4ClassRunner$1.runReflectiveCall(SpringJUnit4ClassRunner.java:252)
  230. at org.junit.internal.runners.model.ReflectiveCallable.run(ReflectiveCallable.java:12)
  231. at org.springframework.test.context.junit4.SpringJUnit4ClassRunner.methodBlock(SpringJUnit4ClassRunner.java:254)
  232. at org.springframework.test.context.junit4.SpringJUnit4ClassRunner.runChild(SpringJUnit4ClassRunner.java:217)
  233. at org.springframework.test.context.junit4.SpringJUnit4ClassRunner.runChild(SpringJUnit4ClassRunner.java:83)
  234. at org.junit.runners.ParentRunner$3.run(ParentRunner.java:238)
  235. at org.junit.runners.ParentRunner$1.schedule(ParentRunner.java:63)
  236. at org.junit.runners.ParentRunner.runChildren(ParentRunner.java:236)
  237. at org.junit.runners.ParentRunner.access$000(ParentRunner.java:53)
  238. at org.junit.runners.ParentRunner$2.evaluate(ParentRunner.java:229)
  239. at org.springframework.test.context.junit4.statements.RunBeforeTestClassCallbacks.evaluate(RunBeforeTestClassCallbacks.java:61)
  240. at org.junit.internal.runners.statements.RunAfters.evaluate(RunAfters.java:27)
  241. at org.springframework.test.context.junit4.statements.RunAfterTestClassCallbacks.evaluate(RunAfterTestClassCallbacks.java:68)
  242. at org.junit.runners.ParentRunner.run(ParentRunner.java:309)
  243. at org.springframework.test.context.junit4.SpringJUnit4ClassRunner.run(SpringJUnit4ClassRunner.java:163)
  244. at org.apache.maven.surefire.junit4.JUnit4Provider.execute(JUnit4Provider.java:365)
  245. at org.apache.maven.surefire.junit4.JUnit4Provider.executeWithRerun(JUnit4Provider.java:273)
  246. at org.apache.maven.surefire.junit4.JUnit4Provider.executeTestSet(JUnit4Provider.java:238)
  247. at org.apache.maven.surefire.junit4.JUnit4Provider.invoke(JUnit4Provider.java:159)
  248. at org.apache.maven.surefire.booter.ForkedBooter.invokeProviderInSameClassLoader(ForkedBooter.java:384)
  249. at org.apache.maven.surefire.booter.ForkedBooter.runSuitesInProcess(ForkedBooter.java:345)
  250. at org.apache.maven.surefire.booter.ForkedBooter.execute(ForkedBooter.java:126)
  251. at org.apache.maven.surefire.booter.ForkedBooter.main(ForkedBooter.java:418)
  252. Caused by: org.springframework.beans.factory.BeanCreationException: Error creating bean with name 'stringToAppDescriptorConverter': Injection of autowired dependencies failed; nested exception is org.springframework.beans.factory.BeanCreationException: Could not autowire field: private org.openmrs.module.appframework.service.AppFrameworkService org.openmrs.module.appui.converter.StringToAppDescriptorConverter.appFrameworkService; nested exception is org.springframework.beans.factory.NoSuchBeanDefinitionException: No qualifying bean of type [org.openmrs.module.appframework.service.AppFrameworkService] found for dependency: expected at least 1 bean which qualifies as autowire candidate for this dependency. Dependency annotations: {@org.springframework.beans.factory.annotation.Autowired(required=true)}
  253. Related cause: org.springframework.beans.factory.BeanCreationException: Error creating bean with name 'appFrameworkService' defined in URL [jar:file:/home/tarad/.m2/repository/org/openmrs/module/appframework-api/2.9/appframework-api-2.9.jar!/moduleApplicationContext.xml]: Cannot create inner bean 'org.openmrs.module.appframework.service.AppFrameworkServiceImpl#7b020fc2' of type [org.openmrs.module.appframework.service.AppFrameworkServiceImpl] while setting bean property 'target'; nested exception is org.springframework.beans.factory.BeanCreationException: Error creating bean with name 'org.openmrs.module.appframework.service.AppFrameworkServiceImpl#7b020fc2' defined in URL [jar:file:/home/tarad/.m2/repository/org/openmrs/module/appframework-api/2.9/appframework-api-2.9.jar!/moduleApplicationContext.xml]: Cannot resolve reference to bean 'allAppTemplates' while setting constructor argument; nested exception is org.springframework.beans.factory.BeanCreationException: Error creating bean with name 'allAppTemplates': Injection of autowired dependencies failed; nested exception is org.springframework.beans.factory.BeanCreationException: Could not autowire field: private javax.validation.Validator org.openmrs.module.appframework.repository.AllAppTemplates.validator; nested exception is org.springframework.beans.factory.BeanCreationException: Error creating bean with name 'validatorFactory' defined in URL [jar:file:/home/tarad/.m2/repository/org/openmrs/module/appframework-api/2.9/appframework-api-2.9.jar!/moduleApplicationContext.xml]: Invocation of init method failed; nested exception is java.lang.NoClassDefFoundError: javax/xml/bind/JAXBException
  254. at org.springframework.beans.factory.annotation.AutowiredAnnotationBeanPostProcessor.postProcessPropertyValues(AutowiredAnnotationBeanPostProcessor.java:334)
  255. at org.springframework.beans.factory.support.AbstractAutowireCapableBeanFactory.populateBean(AbstractAutowireCapableBeanFactory.java:1202)
  256. at org.springframework.beans.factory.support.AbstractAutowireCapableBeanFactory.doCreateBean(AbstractAutowireCapableBeanFactory.java:537)
  257. at org.springframework.beans.factory.support.AbstractAutowireCapableBeanFactory.createBean(AbstractAutowireCapableBeanFactory.java:476)
  258. at org.springframework.beans.factory.support.AbstractBeanFactory$1.getObject(AbstractBeanFactory.java:303)
  259. at org.springframework.beans.factory.support.DefaultSingletonBeanRegistry.getSingleton(DefaultSingletonBeanRegistry.java:230)
  260. at org.springframework.beans.factory.support.AbstractBeanFactory.doGetBean(AbstractBeanFactory.java:299)
  261. at org.springframework.beans.factory.support.AbstractBeanFactory.getBean(AbstractBeanFactory.java:194)
  262. at org.springframework.beans.factory.support.DefaultListableBeanFactory.preInstantiateSingletons(DefaultListableBeanFactory.java:762)
  263. at org.springframework.context.support.AbstractApplicationContext.finishBeanFactoryInitialization(AbstractApplicationContext.java:757)
  264. at org.springframework.context.support.AbstractApplicationContext.refresh(AbstractApplicationContext.java:480)
  265. at org.springframework.test.context.support.AbstractGenericContextLoader.loadContext(AbstractGenericContextLoader.java:125)
  266. at org.springframework.test.context.support.AbstractGenericContextLoader.loadContext(AbstractGenericContextLoader.java:60)
  267. at org.springframework.test.context.support.AbstractDelegatingSmartContextLoader.delegateLoading(AbstractDelegatingSmartContextLoader.java:109)
  268. at org.springframework.test.context.support.AbstractDelegatingSmartContextLoader.loadContext(AbstractDelegatingSmartContextLoader.java:261)
  269. at org.springframework.test.context.DefaultCacheAwareContextLoaderDelegate.loadContextInternal(DefaultCacheAwareContextLoaderDelegate.java:68)
  270. at org.springframework.test.context.DefaultCacheAwareContextLoaderDelegate.loadContext(DefaultCacheAwareContextLoaderDelegate.java:86)
  271. ... 28 more
  272. Caused by: org.springframework.beans.factory.BeanCreationException: Could not autowire field: private org.openmrs.module.appframework.service.AppFrameworkService org.openmrs.module.appui.converter.StringToAppDescriptorConverter.appFrameworkService; nested exception is org.springframework.beans.factory.NoSuchBeanDefinitionException: No qualifying bean of type [org.openmrs.module.appframework.service.AppFrameworkService] found for dependency: expected at least 1 bean which qualifies as autowire candidate for this dependency. Dependency annotations: {@org.springframework.beans.factory.annotation.Autowired(required=true)}
  273. at org.springframework.beans.factory.annotation.AutowiredAnnotationBeanPostProcessor$AutowiredFieldElement.inject(AutowiredAnnotationBeanPostProcessor.java:561)
  274. at org.springframework.beans.factory.annotation.InjectionMetadata.inject(InjectionMetadata.java:88)
  275. at org.springframework.beans.factory.annotation.AutowiredAnnotationBeanPostProcessor.postProcessPropertyValues(AutowiredAnnotationBeanPostProcessor.java:331)
  276. ... 44 more
  277. Caused by: org.springframework.beans.factory.NoSuchBeanDefinitionException: No qualifying bean of type [org.openmrs.module.appframework.service.AppFrameworkService] found for dependency: expected at least 1 bean which qualifies as autowire candidate for this dependency. Dependency annotations: {@org.springframework.beans.factory.annotation.Autowired(required=true)}
  278. at org.springframework.beans.factory.support.DefaultListableBeanFactory.raiseNoSuchBeanDefinitionException(DefaultListableBeanFactory.java:1308)
  279. at org.springframework.beans.factory.support.DefaultListableBeanFactory.doResolveDependency(DefaultListableBeanFactory.java:1054)
  280. at org.springframework.beans.factory.support.DefaultListableBeanFactory.resolveDependency(DefaultListableBeanFactory.java:949)
  281. at org.springframework.beans.factory.annotation.AutowiredAnnotationBeanPostProcessor$AutowiredFieldElement.inject(AutowiredAnnotationBeanPostProcessor.java:533)
  282. ... 46 more
  283. ERROR - TestContextManager.prepareTestInstance(215) |2020-11-23 18:09:58,285| Caught exception while allowing TestExecutionListener [org.springframework.test.context.support.DependencyInjectionTestExecutionListener@c4aa305] to prepare test instance [org.openmrs.module.referenceapplication.ReferenceApplicationActivatorComponentTest@2db47e67]
  284. java.lang.IllegalStateException: Failed to load ApplicationContext
  285. at org.springframework.test.context.DefaultCacheAwareContextLoaderDelegate.loadContext(DefaultCacheAwareContextLoaderDelegate.java:94)
  286. at org.springframework.test.context.DefaultTestContext.getApplicationContext(DefaultTestContext.java:72)
  287. at org.springframework.test.context.support.DependencyInjectionTestExecutionListener.injectDependencies(DependencyInjectionTestExecutionListener.java:117)
  288. at org.springframework.test.context.support.DependencyInjectionTestExecutionListener.prepareTestInstance(DependencyInjectionTestExecutionListener.java:83)
  289. at org.springframework.test.context.TestContextManager.prepareTestInstance(TestContextManager.java:212)
  290. at org.springframework.test.context.junit4.SpringJUnit4ClassRunner.createTest(SpringJUnit4ClassRunner.java:200)
  291. at org.springframework.test.context.junit4.SpringJUnit4ClassRunner$1.runReflectiveCall(SpringJUnit4ClassRunner.java:252)
  292. at org.junit.internal.runners.model.ReflectiveCallable.run(ReflectiveCallable.java:12)
  293. at org.springframework.test.context.junit4.SpringJUnit4ClassRunner.methodBlock(SpringJUnit4ClassRunner.java:254)
  294. at org.springframework.test.context.junit4.SpringJUnit4ClassRunner.runChild(SpringJUnit4ClassRunner.java:217)
  295. at org.springframework.test.context.junit4.SpringJUnit4ClassRunner.runChild(SpringJUnit4ClassRunner.java:83)
  296. at org.junit.runners.ParentRunner$3.run(ParentRunner.java:238)
  297. at org.junit.runners.ParentRunner$1.schedule(ParentRunner.java:63)
  298. at org.junit.runners.ParentRunner.runChildren(ParentRunner.java:236)
  299. at org.junit.runners.ParentRunner.access$000(ParentRunner.java:53)
  300. at org.junit.runners.ParentRunner$2.evaluate(ParentRunner.java:229)
  301. at org.springframework.test.context.junit4.statements.RunBeforeTestClassCallbacks.evaluate(RunBeforeTestClassCallbacks.java:61)
  302. at org.junit.internal.runners.statements.RunAfters.evaluate(RunAfters.java:27)
  303. at org.springframework.test.context.junit4.statements.RunAfterTestClassCallbacks.evaluate(RunAfterTestClassCallbacks.java:68)
  304. at org.junit.runners.ParentRunner.run(ParentRunner.java:309)
  305. at org.springframework.test.context.junit4.SpringJUnit4ClassRunner.run(SpringJUnit4ClassRunner.java:163)
  306. at org.apache.maven.surefire.junit4.JUnit4Provider.execute(JUnit4Provider.java:365)
  307. at org.apache.maven.surefire.junit4.JUnit4Provider.executeWithRerun(JUnit4Provider.java:273)
  308. at org.apache.maven.surefire.junit4.JUnit4Provider.executeTestSet(JUnit4Provider.java:238)
  309. at org.apache.maven.surefire.junit4.JUnit4Provider.invoke(JUnit4Provider.java:159)
  310. at org.apache.maven.surefire.booter.ForkedBooter.invokeProviderInSameClassLoader(ForkedBooter.java:384)
  311. at org.apache.maven.surefire.booter.ForkedBooter.runSuitesInProcess(ForkedBooter.java:345)
  312. at org.apache.maven.surefire.booter.ForkedBooter.execute(ForkedBooter.java:126)
  313. at org.apache.maven.surefire.booter.ForkedBooter.main(ForkedBooter.java:418)
  314. Caused by: org.springframework.beans.factory.BeanCreationException: Error creating bean with name 'stringToAppDescriptorConverter': Injection of autowired dependencies failed; nested exception is org.springframework.beans.factory.BeanCreationException: Could not autowire field: private org.openmrs.module.appframework.service.AppFrameworkService org.openmrs.module.appui.converter.StringToAppDescriptorConverter.appFrameworkService; nested exception is org.springframework.beans.factory.NoSuchBeanDefinitionException: No qualifying bean of type [org.openmrs.module.appframework.service.AppFrameworkService] found for dependency: expected at least 1 bean which qualifies as autowire candidate for this dependency. Dependency annotations: {@org.springframework.beans.factory.annotation.Autowired(required=true)}
  315. Related cause: org.springframework.beans.factory.BeanCreationException: Error creating bean with name 'appFrameworkService' defined in URL [jar:file:/home/tarad/.m2/repository/org/openmrs/module/appframework-api/2.9/appframework-api-2.9.jar!/moduleApplicationContext.xml]: Cannot create inner bean 'org.openmrs.module.appframework.service.AppFrameworkServiceImpl#4c9ed82f' of type [org.openmrs.module.appframework.service.AppFrameworkServiceImpl] while setting bean property 'target'; nested exception is org.springframework.beans.factory.BeanCreationException: Error creating bean with name 'org.openmrs.module.appframework.service.AppFrameworkServiceImpl#4c9ed82f' defined in URL [jar:file:/home/tarad/.m2/repository/org/openmrs/module/appframework-api/2.9/appframework-api-2.9.jar!/moduleApplicationContext.xml]: Cannot resolve reference to bean 'allAppTemplates' while setting constructor argument; nested exception is org.springframework.beans.factory.BeanCreationException: Error creating bean with name 'allAppTemplates': Injection of autowired dependencies failed; nested exception is org.springframework.beans.factory.BeanCreationException: Could not autowire field: private javax.validation.Validator org.openmrs.module.appframework.repository.AllAppTemplates.validator; nested exception is org.springframework.beans.factory.BeanCreationException: Error creating bean with name 'validatorFactory' defined in URL [jar:file:/home/tarad/.m2/repository/org/openmrs/module/appframework-api/2.9/appframework-api-2.9.jar!/moduleApplicationContext.xml]: Invocation of init method failed; nested exception is java.lang.NoClassDefFoundError: javax/xml/bind/JAXBException
  316. at org.springframework.beans.factory.annotation.AutowiredAnnotationBeanPostProcessor.postProcessPropertyValues(AutowiredAnnotationBeanPostProcessor.java:334)
  317. at org.springframework.beans.factory.support.AbstractAutowireCapableBeanFactory.populateBean(AbstractAutowireCapableBeanFactory.java:1202)
  318. at org.springframework.beans.factory.support.AbstractAutowireCapableBeanFactory.doCreateBean(AbstractAutowireCapableBeanFactory.java:537)
  319. at org.springframework.beans.factory.support.AbstractAutowireCapableBeanFactory.createBean(AbstractAutowireCapableBeanFactory.java:476)
  320. at org.springframework.beans.factory.support.AbstractBeanFactory$1.getObject(AbstractBeanFactory.java:303)
  321. at org.springframework.beans.factory.support.DefaultSingletonBeanRegistry.getSingleton(DefaultSingletonBeanRegistry.java:230)
  322. at org.springframework.beans.factory.support.AbstractBeanFactory.doGetBean(AbstractBeanFactory.java:299)
  323. at org.springframework.beans.factory.support.AbstractBeanFactory.getBean(AbstractBeanFactory.java:194)
  324. at org.springframework.beans.factory.support.DefaultListableBeanFactory.preInstantiateSingletons(DefaultListableBeanFactory.java:762)
  325. at org.springframework.context.support.AbstractApplicationContext.finishBeanFactoryInitialization(AbstractApplicationContext.java:757)
  326. at org.springframework.context.support.AbstractApplicationContext.refresh(AbstractApplicationContext.java:480)
  327. at org.springframework.test.context.support.AbstractGenericContextLoader.loadContext(AbstractGenericContextLoader.java:125)
  328. at org.springframework.test.context.support.AbstractGenericContextLoader.loadContext(AbstractGenericContextLoader.java:60)
  329. at org.springframework.test.context.support.AbstractDelegatingSmartContextLoader.delegateLoading(AbstractDelegatingSmartContextLoader.java:109)
  330. at org.springframework.test.context.support.AbstractDelegatingSmartContextLoader.loadContext(AbstractDelegatingSmartContextLoader.java:261)
  331. at org.springframework.test.context.DefaultCacheAwareContextLoaderDelegate.loadContextInternal(DefaultCacheAwareContextLoaderDelegate.java:68)
  332. at org.springframework.test.context.DefaultCacheAwareContextLoaderDelegate.loadContext(DefaultCacheAwareContextLoaderDelegate.java:86)
  333. ... 28 more
  334. Caused by: org.springframework.beans.factory.BeanCreationException: Could not autowire field: private org.openmrs.module.appframework.service.AppFrameworkService org.openmrs.module.appui.converter.StringToAppDescriptorConverter.appFrameworkService; nested exception is org.springframework.beans.factory.NoSuchBeanDefinitionException: No qualifying bean of type [org.openmrs.module.appframework.service.AppFrameworkService] found for dependency: expected at least 1 bean which qualifies as autowire candidate for this dependency. Dependency annotations: {@org.springframework.beans.factory.annotation.Autowired(required=true)}
  335. at org.springframework.beans.factory.annotation.AutowiredAnnotationBeanPostProcessor$AutowiredFieldElement.inject(AutowiredAnnotationBeanPostProcessor.java:561)
  336. at org.springframework.beans.factory.annotation.InjectionMetadata.inject(InjectionMetadata.java:88)
  337. at org.springframework.beans.factory.annotation.AutowiredAnnotationBeanPostProcessor.postProcessPropertyValues(AutowiredAnnotationBeanPostProcessor.java:331)
  338. ... 44 more
  339. Caused by: org.springframework.beans.factory.NoSuchBeanDefinitionException: No qualifying bean of type [org.openmrs.module.appframework.service.AppFrameworkService] found for dependency: expected at least 1 bean which qualifies as autowire candidate for this dependency. Dependency annotations: {@org.springframework.beans.factory.annotation.Autowired(required=true)}
  340. at org.springframework.beans.factory.support.DefaultListableBeanFactory.raiseNoSuchBeanDefinitionException(DefaultListableBeanFactory.java:1308)
  341. at org.springframework.beans.factory.support.DefaultListableBeanFactory.doResolveDependency(DefaultListableBeanFactory.java:1054)
  342. at org.springframework.beans.factory.support.DefaultListableBeanFactory.resolveDependency(DefaultListableBeanFactory.java:949)
  343. at org.springframework.beans.factory.annotation.AutowiredAnnotationBeanPostProcessor$AutowiredFieldElement.inject(AutowiredAnnotationBeanPostProcessor.java:533)
  344. ... 46 more
  345. ERROR - TestContextManager.prepareTestInstance(215) |2020-11-23 18:10:10,637| Caught exception while allowing TestExecutionListener [org.springframework.test.context.support.DependencyInjectionTestExecutionListener@c4aa305] to prepare test instance [org.openmrs.module.referenceapplication.ReferenceApplicationActivatorComponentTest@65d75f8f]
  346. java.lang.IllegalStateException: Failed to load ApplicationContext
  347. at org.springframework.test.context.DefaultCacheAwareContextLoaderDelegate.loadContext(DefaultCacheAwareContextLoaderDelegate.java:94)
  348. at org.springframework.test.context.DefaultTestContext.getApplicationContext(DefaultTestContext.java:72)
  349. at org.springframework.test.context.support.DependencyInjectionTestExecutionListener.injectDependencies(DependencyInjectionTestExecutionListener.java:117)
  350. at org.springframework.test.context.support.DependencyInjectionTestExecutionListener.prepareTestInstance(DependencyInjectionTestExecutionListener.java:83)
  351. at org.springframework.test.context.TestContextManager.prepareTestInstance(TestContextManager.java:212)
  352. at org.springframework.test.context.junit4.SpringJUnit4ClassRunner.createTest(SpringJUnit4ClassRunner.java:200)
  353. at org.springframework.test.context.junit4.SpringJUnit4ClassRunner$1.runReflectiveCall(SpringJUnit4ClassRunner.java:252)
  354. at org.junit.internal.runners.model.ReflectiveCallable.run(ReflectiveCallable.java:12)
  355. at org.springframework.test.context.junit4.SpringJUnit4ClassRunner.methodBlock(SpringJUnit4ClassRunner.java:254)
  356. at org.springframework.test.context.junit4.SpringJUnit4ClassRunner.runChild(SpringJUnit4ClassRunner.java:217)
  357. at org.springframework.test.context.junit4.SpringJUnit4ClassRunner.runChild(SpringJUnit4ClassRunner.java:83)
  358. at org.junit.runners.ParentRunner$3.run(ParentRunner.java:238)
  359. at org.junit.runners.ParentRunner$1.schedule(ParentRunner.java:63)
  360. at org.junit.runners.ParentRunner.runChildren(ParentRunner.java:236)
  361. at org.junit.runners.ParentRunner.access$000(ParentRunner.java:53)
  362. at org.junit.runners.ParentRunner$2.evaluate(ParentRunner.java:229)
  363. at org.springframework.test.context.junit4.statements.RunBeforeTestClassCallbacks.evaluate(RunBeforeTestClassCallbacks.java:61)
  364. at org.junit.internal.runners.statements.RunAfters.evaluate(RunAfters.java:27)
  365. at org.springframework.test.context.junit4.statements.RunAfterTestClassCallbacks.evaluate(RunAfterTestClassCallbacks.java:68)
  366. at org.junit.runners.ParentRunner.run(ParentRunner.java:309)
  367. at org.springframework.test.context.junit4.SpringJUnit4ClassRunner.run(SpringJUnit4ClassRunner.java:163)
  368. at org.apache.maven.surefire.junit4.JUnit4Provider.execute(JUnit4Provider.java:365)
  369. at org.apache.maven.surefire.junit4.JUnit4Provider.executeWithRerun(JUnit4Provider.java:273)
  370. at org.apache.maven.surefire.junit4.JUnit4Provider.executeTestSet(JUnit4Provider.java:238)
  371. at org.apache.maven.surefire.junit4.JUnit4Provider.invoke(JUnit4Provider.java:159)
  372. at org.apache.maven.surefire.booter.ForkedBooter.invokeProviderInSameClassLoader(ForkedBooter.java:384)
  373. at org.apache.maven.surefire.booter.ForkedBooter.runSuitesInProcess(ForkedBooter.java:345)
  374. at org.apache.maven.surefire.booter.ForkedBooter.execute(ForkedBooter.java:126)
  375. at org.apache.maven.surefire.booter.ForkedBooter.main(ForkedBooter.java:418)
  376. Caused by: org.springframework.beans.factory.BeanCreationException: Error creating bean with name 'stringToAppDescriptorConverter': Injection of autowired dependencies failed; nested exception is org.springframework.beans.factory.BeanCreationException: Could not autowire field: private org.openmrs.module.appframework.service.AppFrameworkService org.openmrs.module.appui.converter.StringToAppDescriptorConverter.appFrameworkService; nested exception is org.springframework.beans.factory.NoSuchBeanDefinitionException: No qualifying bean of type [org.openmrs.module.appframework.service.AppFrameworkService] found for dependency: expected at least 1 bean which qualifies as autowire candidate for this dependency. Dependency annotations: {@org.springframework.beans.factory.annotation.Autowired(required=true)}
  377. Related cause: org.springframework.beans.factory.BeanCreationException: Error creating bean with name 'appFrameworkService' defined in URL [jar:file:/home/tarad/.m2/repository/org/openmrs/module/appframework-api/2.9/appframework-api-2.9.jar!/moduleApplicationContext.xml]: Cannot create inner bean 'org.openmrs.module.appframework.service.AppFrameworkServiceImpl#6f52e27f' of type [org.openmrs.module.appframework.service.AppFrameworkServiceImpl] while setting bean property 'target'; nested exception is org.springframework.beans.factory.BeanCreationException: Error creating bean with name 'org.openmrs.module.appframework.service.AppFrameworkServiceImpl#6f52e27f' defined in URL [jar:file:/home/tarad/.m2/repository/org/openmrs/module/appframework-api/2.9/appframework-api-2.9.jar!/moduleApplicationContext.xml]: Cannot resolve reference to bean 'allAppTemplates' while setting constructor argument; nested exception is org.springframework.beans.factory.BeanCreationException: Error creating bean with name 'allAppTemplates': Injection of autowired dependencies failed; nested exception is org.springframework.beans.factory.BeanCreationException: Could not autowire field: private javax.validation.Validator org.openmrs.module.appframework.repository.AllAppTemplates.validator; nested exception is org.springframework.beans.factory.BeanCreationException: Error creating bean with name 'validatorFactory' defined in URL [jar:file:/home/tarad/.m2/repository/org/openmrs/module/appframework-api/2.9/appframework-api-2.9.jar!/moduleApplicationContext.xml]: Invocation of init method failed; nested exception is java.lang.NoClassDefFoundError: javax/xml/bind/JAXBException
  378. at org.springframework.beans.factory.annotation.AutowiredAnnotationBeanPostProcessor.postProcessPropertyValues(AutowiredAnnotationBeanPostProcessor.java:334)
  379. at org.springframework.beans.factory.support.AbstractAutowireCapableBeanFactory.populateBean(AbstractAutowireCapableBeanFactory.java:1202)
  380. at org.springframework.beans.factory.support.AbstractAutowireCapableBeanFactory.doCreateBean(AbstractAutowireCapableBeanFactory.java:537)
  381. at org.springframework.beans.factory.support.AbstractAutowireCapableBeanFactory.createBean(AbstractAutowireCapableBeanFactory.java:476)
  382. at org.springframework.beans.factory.support.AbstractBeanFactory$1.getObject(AbstractBeanFactory.java:303)
  383. at org.springframework.beans.factory.support.DefaultSingletonBeanRegistry.getSingleton(DefaultSingletonBeanRegistry.java:230)
  384. at org.springframework.beans.factory.support.AbstractBeanFactory.doGetBean(AbstractBeanFactory.java:299)
  385. at org.springframework.beans.factory.support.AbstractBeanFactory.getBean(AbstractBeanFactory.java:194)
  386. at org.springframework.beans.factory.support.DefaultListableBeanFactory.preInstantiateSingletons(DefaultListableBeanFactory.java:762)
  387. at org.springframework.context.support.AbstractApplicationContext.finishBeanFactoryInitialization(AbstractApplicationContext.java:757)
  388. at org.springframework.context.support.AbstractApplicationContext.refresh(AbstractApplicationContext.java:480)
  389. at org.springframework.test.context.support.AbstractGenericContextLoader.loadContext(AbstractGenericContextLoader.java:125)
  390. at org.springframework.test.context.support.AbstractGenericContextLoader.loadContext(AbstractGenericContextLoader.java:60)
  391. at org.springframework.test.context.support.AbstractDelegatingSmartContextLoader.delegateLoading(AbstractDelegatingSmartContextLoader.java:109)
  392. at org.springframework.test.context.support.AbstractDelegatingSmartContextLoader.loadContext(AbstractDelegatingSmartContextLoader.java:261)
  393. at org.springframework.test.context.DefaultCacheAwareContextLoaderDelegate.loadContextInternal(DefaultCacheAwareContextLoaderDelegate.java:68)
  394. at org.springframework.test.context.DefaultCacheAwareContextLoaderDelegate.loadContext(DefaultCacheAwareContextLoaderDelegate.java:86)
  395. ... 28 more
  396. Caused by: org.springframework.beans.factory.BeanCreationException: Could not autowire field: private org.openmrs.module.appframework.service.AppFrameworkService org.openmrs.module.appui.converter.StringToAppDescriptorConverter.appFrameworkService; nested exception is org.springframework.beans.factory.NoSuchBeanDefinitionException: No qualifying bean of type [org.openmrs.module.appframework.service.AppFrameworkService] found for dependency: expected at least 1 bean which qualifies as autowire candidate for this dependency. Dependency annotations: {@org.springframework.beans.factory.annotation.Autowired(required=true)}
  397. at org.springframework.beans.factory.annotation.AutowiredAnnotationBeanPostProcessor$AutowiredFieldElement.inject(AutowiredAnnotationBeanPostProcessor.java:561)
  398. at org.springframework.beans.factory.annotation.InjectionMetadata.inject(InjectionMetadata.java:88)
  399. at org.springframework.beans.factory.annotation.AutowiredAnnotationBeanPostProcessor.postProcessPropertyValues(AutowiredAnnotationBeanPostProcessor.java:331)
  400. ... 44 more
  401. Caused by: org.springframework.beans.factory.NoSuchBeanDefinitionException: No qualifying bean of type [org.openmrs.module.appframework.service.AppFrameworkService] found for dependency: expected at least 1 bean which qualifies as autowire candidate for this dependency. Dependency annotations: {@org.springframework.beans.factory.annotation.Autowired(required=true)}
  402. at org.springframework.beans.factory.support.DefaultListableBeanFactory.raiseNoSuchBeanDefinitionException(DefaultListableBeanFactory.java:1308)
  403. at org.springframework.beans.factory.support.DefaultListableBeanFactory.doResolveDependency(DefaultListableBeanFactory.java:1054)
  404. at org.springframework.beans.factory.support.DefaultListableBeanFactory.resolveDependency(DefaultListableBeanFactory.java:949)
  405. at org.springframework.beans.factory.annotation.AutowiredAnnotationBeanPostProcessor$AutowiredFieldElement.inject(AutowiredAnnotationBeanPostProcessor.java:533)
  406. ... 46 more
  407. [ERROR] Tests run: 4, Failures: 0, Errors: 4, Skipped: 0, Time elapsed: 81.853 s <<< FAILURE! - in org.openmrs.module.referenceapplication.ReferenceApplicationActivatorComponentTest
  408. [ERROR] testSetupOfProcessHL7Task(org.openmrs.module.referenceapplication.ReferenceApplicationActivatorComponentTest) Time elapsed: 0 s <<< ERROR!
  409. java.lang.IllegalStateException: Failed to load ApplicationContext
  410. Caused by: org.springframework.beans.factory.BeanCreationException: Error creating bean with name 'stringToAppDescriptorConverter': Injection of autowired dependencies failed; nested exception is org.springframework.beans.factory.BeanCreationException: Could not autowire field: private org.openmrs.module.appframework.service.AppFrameworkService org.openmrs.module.appui.converter.StringToAppDescriptorConverter.appFrameworkService; nested exception is org.springframework.beans.factory.NoSuchBeanDefinitionException: No qualifying bean of type [org.openmrs.module.appframework.service.AppFrameworkService] found for dependency: expected at least 1 bean which qualifies as autowire candidate for this dependency. Dependency annotations: {@org.springframework.beans.factory.annotation.Autowired(required=true)}
  411. Caused by: org.springframework.beans.factory.BeanCreationException: Could not autowire field: private org.openmrs.module.appframework.service.AppFrameworkService org.openmrs.module.appui.converter.StringToAppDescriptorConverter.appFrameworkService; nested exception is org.springframework.beans.factory.NoSuchBeanDefinitionException: No qualifying bean of type [org.openmrs.module.appframework.service.AppFrameworkService] found for dependency: expected at least 1 bean which qualifies as autowire candidate for this dependency. Dependency annotations: {@org.springframework.beans.factory.annotation.Autowired(required=true)}
  412. Caused by: org.springframework.beans.factory.NoSuchBeanDefinitionException: No qualifying bean of type [org.openmrs.module.appframework.service.AppFrameworkService] found for dependency: expected at least 1 bean which qualifies as autowire candidate for this dependency. Dependency annotations: {@org.springframework.beans.factory.annotation.Autowired(required=true)}
  413.  
  414. [ERROR] testAddLoginLocationTagToAtleastOneLocationIfThereAreNoLoginLocations(org.openmrs.module.referenceapplication.ReferenceApplicationActivatorComponentTest) Time elapsed: 0.007 s <<< ERROR!
  415. java.lang.IllegalStateException: Failed to load ApplicationContext
  416. Caused by: org.springframework.beans.factory.BeanCreationException: Error creating bean with name 'stringToAppDescriptorConverter': Injection of autowired dependencies failed; nested exception is org.springframework.beans.factory.BeanCreationException: Could not autowire field: private org.openmrs.module.appframework.service.AppFrameworkService org.openmrs.module.appui.converter.StringToAppDescriptorConverter.appFrameworkService; nested exception is org.springframework.beans.factory.NoSuchBeanDefinitionException: No qualifying bean of type [org.openmrs.module.appframework.service.AppFrameworkService] found for dependency: expected at least 1 bean which qualifies as autowire candidate for this dependency. Dependency annotations: {@org.springframework.beans.factory.annotation.Autowired(required=true)}
  417. Caused by: org.springframework.beans.factory.BeanCreationException: Could not autowire field: private org.openmrs.module.appframework.service.AppFrameworkService org.openmrs.module.appui.converter.StringToAppDescriptorConverter.appFrameworkService; nested exception is org.springframework.beans.factory.NoSuchBeanDefinitionException: No qualifying bean of type [org.openmrs.module.appframework.service.AppFrameworkService] found for dependency: expected at least 1 bean which qualifies as autowire candidate for this dependency. Dependency annotations: {@org.springframework.beans.factory.annotation.Autowired(required=true)}
  418. Caused by: org.springframework.beans.factory.NoSuchBeanDefinitionException: No qualifying bean of type [org.openmrs.module.appframework.service.AppFrameworkService] found for dependency: expected at least 1 bean which qualifies as autowire candidate for this dependency. Dependency annotations: {@org.springframework.beans.factory.annotation.Autowired(required=true)}
  419.  
  420. [ERROR] testAddLoginLocationTagToUnknownLocationIfThereAreNoLoginLocations(org.openmrs.module.referenceapplication.ReferenceApplicationActivatorComponentTest) Time elapsed: 0 s <<< ERROR!
  421. java.lang.IllegalStateException: Failed to load ApplicationContext
  422. Caused by: org.springframework.beans.factory.BeanCreationException: Error creating bean with name 'stringToAppDescriptorConverter': Injection of autowired dependencies failed; nested exception is org.springframework.beans.factory.BeanCreationException: Could not autowire field: private org.openmrs.module.appframework.service.AppFrameworkService org.openmrs.module.appui.converter.StringToAppDescriptorConverter.appFrameworkService; nested exception is org.springframework.beans.factory.NoSuchBeanDefinitionException: No qualifying bean of type [org.openmrs.module.appframework.service.AppFrameworkService] found for dependency: expected at least 1 bean which qualifies as autowire candidate for this dependency. Dependency annotations: {@org.springframework.beans.factory.annotation.Autowired(required=true)}
  423. Caused by: org.springframework.beans.factory.BeanCreationException: Could not autowire field: private org.openmrs.module.appframework.service.AppFrameworkService org.openmrs.module.appui.converter.StringToAppDescriptorConverter.appFrameworkService; nested exception is org.springframework.beans.factory.NoSuchBeanDefinitionException: No qualifying bean of type [org.openmrs.module.appframework.service.AppFrameworkService] found for dependency: expected at least 1 bean which qualifies as autowire candidate for this dependency. Dependency annotations: {@org.springframework.beans.factory.annotation.Autowired(required=true)}
  424. Caused by: org.springframework.beans.factory.NoSuchBeanDefinitionException: No qualifying bean of type [org.openmrs.module.appframework.service.AppFrameworkService] found for dependency: expected at least 1 bean which qualifies as autowire candidate for this dependency. Dependency annotations: {@org.springframework.beans.factory.annotation.Autowired(required=true)}
  425.  
  426. [ERROR] testSetUpAdtGlobalProperties(org.openmrs.module.referenceapplication.ReferenceApplicationActivatorComponentTest) Time elapsed: 0 s <<< ERROR!
  427. java.lang.IllegalStateException: Failed to load ApplicationContext
  428. Caused by: org.springframework.beans.factory.BeanCreationException: Error creating bean with name 'stringToAppDescriptorConverter': Injection of autowired dependencies failed; nested exception is org.springframework.beans.factory.BeanCreationException: Could not autowire field: private org.openmrs.module.appframework.service.AppFrameworkService org.openmrs.module.appui.converter.StringToAppDescriptorConverter.appFrameworkService; nested exception is org.springframework.beans.factory.NoSuchBeanDefinitionException: No qualifying bean of type [org.openmrs.module.appframework.service.AppFrameworkService] found for dependency: expected at least 1 bean which qualifies as autowire candidate for this dependency. Dependency annotations: {@org.springframework.beans.factory.annotation.Autowired(required=true)}
  429. Caused by: org.springframework.beans.factory.BeanCreationException: Could not autowire field: private org.openmrs.module.appframework.service.AppFrameworkService org.openmrs.module.appui.converter.StringToAppDescriptorConverter.appFrameworkService; nested exception is org.springframework.beans.factory.NoSuchBeanDefinitionException: No qualifying bean of type [org.openmrs.module.appframework.service.AppFrameworkService] found for dependency: expected at least 1 bean which qualifies as autowire candidate for this dependency. Dependency annotations: {@org.springframework.beans.factory.annotation.Autowired(required=true)}
  430. Caused by: org.springframework.beans.factory.NoSuchBeanDefinitionException: No qualifying bean of type [org.openmrs.module.appframework.service.AppFrameworkService] found for dependency: expected at least 1 bean which qualifies as autowire candidate for this dependency. Dependency annotations: {@org.springframework.beans.factory.annotation.Autowired(required=true)}
  431.  
  432. [INFO]
  433. [INFO] Results:
  434. [INFO]
  435. [ERROR] Errors:
  436. [ERROR] ReferenceApplicationActivatorComponentTest.testAddLoginLocationTagToAtleastOneLocationIfThereAreNoLoginLocations » IllegalState
  437. [ERROR] ReferenceApplicationActivatorComponentTest.testAddLoginLocationTagToUnknownLocationIfThereAreNoLoginLocations » IllegalState
  438. [ERROR] ReferenceApplicationActivatorComponentTest.testSetUpAdtGlobalProperties » IllegalState
  439. [ERROR] ReferenceApplicationActivatorComponentTest.testSetupOfProcessHL7Task » IllegalState
  440. [ERROR] ConfigureAtlasNotificationProducerTest.testWhenAtlasModuleIsNotInstalled » IllegalState
  441. [INFO]
  442. [ERROR] Tests run: 7, Failures: 0, Errors: 5, Skipped: 0
  443. [INFO]
  444. [INFO]
  445. [INFO] ------------------------------------------------------------------------
  446. [INFO] Skipping Reference Application Module
  447. [INFO] This project has been banned from the build due to previous failures.
  448. [INFO] ------------------------------------------------------------------------
  449. [INFO] ------------------------------------------------------------------------
  450. [INFO] Reactor Summary for Reference Application Module 2.12.0-SNAPSHOT:
  451. [INFO]
  452. [INFO] Reference Application Module ....................... SUCCESS [ 0.982 s]
  453. [INFO] Reference Application Module API ................... FAILURE [03:26 min]
  454. [INFO] Reference Application Module OMOD .................. SKIPPED
  455. [INFO] ------------------------------------------------------------------------
  456. [INFO] BUILD FAILURE
  457. [INFO] ------------------------------------------------------------------------
  458. [INFO] Total time: 03:48 min
  459. [INFO] Finished at: 2020-11-23T18:10:11-05:00
  460. [INFO] ------------------------------------------------------------------------
  461. [ERROR] Failed to execute goal org.apache.maven.plugins:maven-surefire-plugin:2.22.1:test (default-test) on project referenceapplication-api: There are test failures.
  462. [ERROR]
  463. [ERROR] Please refer to /home/tarad/git/openmrs-module-referenceapplication/api/target/surefire-reports for the individual test results.
  464. [ERROR] Please refer to dump files (if any exist) [date].dump, [date]-jvmRun[N].dump and [date].dumpstream.
  465. [ERROR] -> [Help 1]
  466. [ERROR]
  467. [ERROR] To see the full stack trace of the errors, re-run Maven with the -e switch.
  468. [ERROR] Re-run Maven using the -X switch to enable full debug logging.
  469. [ERROR]
  470. [ERROR] For more information about the errors and possible solutions, please read the following articles:
  471. [ERROR] [Help 1] http://cwiki.apache.org/confluence/display/MAVEN/MojoFailureException
  472. [ERROR]
  473. [ERROR] After correcting the problems, you can resume the build with the command
  474. [ERROR] mvn <args> -rf :referenceapplication-api
  475.  
Advertisement
RAW Paste Data Copied
Advertisement