SHARE
TWEET

compiling_minetest

a guest Mar 19th, 2017 79 Never
Not a member of Pastebin yet? Sign Up, it unlocks many cool features!
  1. θ64° mael@mael-GE60:~/projets $ rm -Rf minetest;git clone --depth=1 https://www.github.com/minetest/minetest.git;cd minetest/games/; git clone --depth=1 https://www.github.com/minetest/minetest_game.git;cd ..;mkdir build/linux;cd build/linux/;cmake ../../;make -j9
  2. Clonage dans 'minetest'...
  3. remote: Counting objects: 1048, done.
  4. remote: Compressing objects: 100% (938/938), done.
  5. remote: Total 1048 (delta 126), reused 506 (delta 50), pack-reused 0
  6. Réception d'objets: 100% (1048/1048), 7.16 MiB | 974.00 KiB/s, fait.
  7. Résolution des deltas: 100% (126/126), fait.
  8. Vérification de la connectivité... fait.
  9. Clonage dans 'minetest_game'...
  10. remote: Counting objects: 658, done.
  11. remote: Compressing objects: 100% (604/604), done.
  12. remote: Total 658 (delta 62), reused 526 (delta 39), pack-reused 0
  13. Réception d'objets: 100% (658/658), 1.34 MiB | 1.60 MiB/s, fait.
  14. Résolution des deltas: 100% (62/62), fait.
  15. Vérification de la connectivité... fait.
  16. -- The C compiler identification is GNU 5.2.1
  17. -- The CXX compiler identification is GNU 5.2.1
  18. -- Check for working C compiler: /usr/bin/cc
  19. -- Check for working C compiler: /usr/bin/cc -- works
  20. -- Detecting C compiler ABI info
  21. -- Detecting C compiler ABI info - done
  22. -- Detecting C compile features
  23. -- Detecting C compile features - done
  24. -- Check for working CXX compiler: /usr/bin/c++
  25. -- Check for working CXX compiler: /usr/bin/c++ -- works
  26. -- Detecting CXX compiler ABI info
  27. -- Detecting CXX compiler ABI info - done
  28. -- Detecting CXX compile features
  29. -- Detecting CXX compile features - done
  30. -- *** Will build version 0.4.15-dev ***
  31. -- Found Irrlicht: /usr/lib/x86_64-linux-gnu/libIrrlicht.so  
  32. -- Found CURL: /usr/local/lib/libcurl.a  
  33. -- cURL support enabled.
  34. -- GetText disabled.
  35. -- Found OpenAL: /usr/lib/x86_64-linux-gnu/libopenal.so  
  36. -- Found VORBIS: /usr/include  
  37. -- Sound enabled.
  38. -- Found Freetype: /usr/lib/x86_64-linux-gnu/libfreetype.so  
  39. -- Freetype enabled.
  40. -- Found LuaJit: /usr/lib/x86_64-linux-gnu/libluajit-5.1.so  
  41. -- Using GMP provided by system.
  42. -- Found GMP: /usr/lib/x86_64-linux-gnu/libgmp.so  
  43. -- Found Curses: /usr/lib/x86_64-linux-gnu/libcurses.so  
  44. -- ncurses console enabled.
  45. You need to install postgresql-server-dev-X.Y for building a server-side extension or libpq-dev for building a client-side application.
  46. You need to install postgresql-server-dev-X.Y for building a server-side extension or libpq-dev for building a client-side application.
  47. -- Could NOT find PostgreSQL (missing:  PostgreSQL_LIBRARY PostgreSQL_INCLUDE_DIR PostgreSQL_TYPE_INCLUDE_DIR)
  48. -- PostgreSQL not found!
  49. -- LevelDB backend enabled.
  50. -- Redis backend enabled.
  51. -- Found SQLite3: /usr/lib/x86_64-linux-gnu/libsqlite3.so  
  52. -- Using bundled JSONCPP library.
  53. -- SpatialIndex AreaStore backend enabled.
  54. -- Looking for XOpenDisplay in /usr/lib/x86_64-linux-gnu/libX11.so;/usr/lib/x86_64-linux-gnu/libXext.so
  55. -- Looking for XOpenDisplay in /usr/lib/x86_64-linux-gnu/libX11.so;/usr/lib/x86_64-linux-gnu/libXext.so - found
  56. -- Looking for gethostbyname
  57. -- Looking for gethostbyname - found
  58. -- Looking for connect
  59. -- Looking for connect - found
  60. -- Looking for remove
  61. -- Looking for remove - found
  62. -- Looking for shmat
  63. -- Looking for shmat - found
  64. -- Looking for IceConnectionNumber in ICE
  65. -- Looking for IceConnectionNumber in ICE - found
  66. -- Found X11: /usr/lib/x86_64-linux-gnu/libX11.so
  67. -- Found OpenGL: /usr/lib/x86_64-linux-gnu/libGL.so  
  68. -- Found JPEG: /usr/lib/x86_64-linux-gnu/libjpeg.so  
  69. -- Found BZip2: /usr/lib/x86_64-linux-gnu/libbz2.so (found version "1.0.6")
  70. -- Looking for BZ2_bzCompressInit in /usr/lib/x86_64-linux-gnu/libbz2.so
  71. -- Looking for BZ2_bzCompressInit in /usr/lib/x86_64-linux-gnu/libbz2.so - found
  72. -- Found ZLIB: /usr/lib/x86_64-linux-gnu/libz.so (found version "1.2.8")
  73. -- Found PNG: /usr/lib/x86_64-linux-gnu/libpng.so (found version "1.2.51")
  74. -- Looking for clock_gettime in rt
  75. -- Looking for clock_gettime in rt - found
  76. -- Looking for include file endian.h
  77. -- Looking for include file endian.h - found
  78. -- Found Doxygen: /usr/bin/doxygen (found version "1.8.9.1")
  79. -- Configuring done
  80. -- Generating done
  81. -- Build files have been written to: /home/mael/projets/minetest/build/linux
  82. Scanning dependencies of target jsoncpp
  83. Scanning dependencies of target cguittfont
  84. Scanning dependencies of target GenerateVersion
  85. [  1%] Building CXX object src/jsoncpp/json/CMakeFiles/jsoncpp.dir/jsoncpp.cpp.o
  86. [  1%] Building CXX object src/cguittfont/CMakeFiles/cguittfont.dir/xCGUITTFont.cpp.o
  87. -- *** Detected Git version 0.4.15-dev-525d2a0 ***
  88. [  1%] Built target GenerateVersion
  89. Linking CXX static library libjsoncpp.a
  90. [  1%] Built target jsoncpp
  91. Linking CXX static library libcguittfont.a
  92. [  1%] Built target cguittfont
  93. Scanning dependencies of target minetest
  94. [  2%] [  2%] [  3%] [  3%] [  3%] [  4%] [  5%] [  5%] Building CXX object src/CMakeFiles/minetest.dir/network/clientopcodes.cpp.o
  95. [  5%] Building CXX object src/CMakeFiles/minetest.dir/client/tile.cpp.o
  96. Building CXX object src/CMakeFiles/minetest.dir/client/joystick_controller.cpp.o
  97. Building CXX object src/CMakeFiles/minetest.dir/client/clientlauncher.cpp.o
  98. Building CXX object src/CMakeFiles/minetest.dir/irrlicht_changes/static_text.cpp.o
  99. Building CXX object src/CMakeFiles/minetest.dir/network/serveropcodes.cpp.o
  100. Building CXX object src/CMakeFiles/minetest.dir/network/clientpackethandler.cpp.o
  101. Building CXX object src/CMakeFiles/minetest.dir/network/networkpacket.cpp.o
  102. Building CXX object src/CMakeFiles/minetest.dir/network/connection.cpp.o
  103. [  5%] Building CXX object src/CMakeFiles/minetest.dir/network/serverpackethandler.cpp.o
  104. [  6%] Building CXX object src/CMakeFiles/minetest.dir/script/clientscripting.cpp.o
  105. [  6%] Building CXX object src/CMakeFiles/minetest.dir/script/common/c_content.cpp.o
  106. [  7%] Building CXX object src/CMakeFiles/minetest.dir/script/common/c_converter.cpp.o
  107. [  7%] Building CXX object src/CMakeFiles/minetest.dir/script/common/c_internal.cpp.o
  108. [  8%] Building CXX object src/CMakeFiles/minetest.dir/script/common/c_types.cpp.o
  109. [  8%] Building CXX object src/CMakeFiles/minetest.dir/script/cpp_api/s_async.cpp.o
  110. [  9%] Building CXX object src/CMakeFiles/minetest.dir/script/cpp_api/s_base.cpp.o
  111. [  9%] Building CXX object src/CMakeFiles/minetest.dir/script/cpp_api/s_client.cpp.o
  112. [  9%] Building CXX object src/CMakeFiles/minetest.dir/script/cpp_api/s_entity.cpp.o
  113. [ 10%] Building CXX object src/CMakeFiles/minetest.dir/script/cpp_api/s_env.cpp.o
  114. [ 10%] Building CXX object src/CMakeFiles/minetest.dir/script/cpp_api/s_inventory.cpp.o
  115. [ 11%] Building CXX object src/CMakeFiles/minetest.dir/script/cpp_api/s_item.cpp.o
  116. [ 11%] Building CXX object src/CMakeFiles/minetest.dir/script/cpp_api/s_mainmenu.cpp.o
  117. [ 12%] Building CXX object src/CMakeFiles/minetest.dir/script/cpp_api/s_node.cpp.o
  118. [ 12%] Building CXX object src/CMakeFiles/minetest.dir/script/cpp_api/s_nodemeta.cpp.o
  119. [ 13%] Building CXX object src/CMakeFiles/minetest.dir/script/cpp_api/s_player.cpp.o
  120. [ 13%] Building CXX object src/CMakeFiles/minetest.dir/script/cpp_api/s_security.cpp.o
  121. [ 13%] Building CXX object src/CMakeFiles/minetest.dir/script/cpp_api/s_server.cpp.o
  122. [ 14%] Building CXX object src/CMakeFiles/minetest.dir/script/lua_api/l_areastore.cpp.o
  123. [ 14%] Building CXX object src/CMakeFiles/minetest.dir/script/lua_api/l_base.cpp.o
  124. [ 15%] Building CXX object src/CMakeFiles/minetest.dir/script/lua_api/l_client.cpp.o
  125. [ 15%] Building CXX object src/CMakeFiles/minetest.dir/script/lua_api/l_craft.cpp.o
  126. [ 16%] Building CXX object src/CMakeFiles/minetest.dir/script/lua_api/l_env.cpp.o
  127. [ 16%] Building CXX object src/CMakeFiles/minetest.dir/script/lua_api/l_http.cpp.o
  128. [ 17%] Building CXX object src/CMakeFiles/minetest.dir/script/lua_api/l_inventory.cpp.o
  129. [ 17%] Building CXX object src/CMakeFiles/minetest.dir/script/lua_api/l_item.cpp.o
  130. [ 18%] Building CXX object src/CMakeFiles/minetest.dir/script/lua_api/l_itemstackmeta.cpp.o
  131. [ 18%] Building CXX object src/CMakeFiles/minetest.dir/script/lua_api/l_mainmenu.cpp.o
  132. [ 18%] Building CXX object src/CMakeFiles/minetest.dir/script/lua_api/l_mapgen.cpp.o
  133. [ 19%] Building CXX object src/CMakeFiles/minetest.dir/script/lua_api/l_metadata.cpp.o
  134. [ 19%] Building CXX object src/CMakeFiles/minetest.dir/script/lua_api/l_minimap.cpp.o
  135. [ 20%] Building CXX object src/CMakeFiles/minetest.dir/script/lua_api/l_nodemeta.cpp.o
  136. [ 20%] Building CXX object src/CMakeFiles/minetest.dir/script/lua_api/l_nodetimer.cpp.o
  137. [ 21%] Building CXX object src/CMakeFiles/minetest.dir/script/lua_api/l_noise.cpp.o
  138. [ 21%] [ 22%] Building CXX object src/CMakeFiles/minetest.dir/script/lua_api/l_object.cpp.o
  139. Building CXX object src/CMakeFiles/minetest.dir/script/lua_api/l_particles.cpp.o
  140. [ 22%] Building CXX object src/CMakeFiles/minetest.dir/script/lua_api/l_rollback.cpp.o
  141. [ 22%] Building CXX object src/CMakeFiles/minetest.dir/script/lua_api/l_server.cpp.o
  142. [ 23%] [ 23%] Building CXX object src/CMakeFiles/minetest.dir/script/lua_api/l_settings.cpp.o
  143. Building CXX object src/CMakeFiles/minetest.dir/script/lua_api/l_sound.cpp.o
  144. [ 24%] Building CXX object src/CMakeFiles/minetest.dir/script/lua_api/l_storage.cpp.o
  145. [ 24%] Building CXX object src/CMakeFiles/minetest.dir/script/lua_api/l_util.cpp.o
  146. [ 25%] Building CXX object src/CMakeFiles/minetest.dir/script/lua_api/l_vmanip.cpp.o
  147. [ 25%] Building CXX object src/CMakeFiles/minetest.dir/script/scripting_mainmenu.cpp.o
  148. [ 26%] Building CXX object src/CMakeFiles/minetest.dir/script/serverscripting.cpp.o
  149. [ 26%] Building CXX object src/CMakeFiles/minetest.dir/threading/event.cpp.o
  150. [ 27%] Building CXX object src/CMakeFiles/minetest.dir/threading/mutex.cpp.o
  151. [ 27%] Building CXX object src/CMakeFiles/minetest.dir/threading/semaphore.cpp.o
  152. [ 27%] Building CXX object src/CMakeFiles/minetest.dir/threading/thread.cpp.o
  153. [ 28%] Building CXX object src/CMakeFiles/minetest.dir/unittest/test.cpp.o
  154. [ 28%] [ 29%] Building CXX object src/CMakeFiles/minetest.dir/unittest/test_areastore.cpp.o
  155. Building CXX object src/CMakeFiles/minetest.dir/unittest/test_collision.cpp.o
  156. [ 29%] Building CXX object src/CMakeFiles/minetest.dir/unittest/test_compression.cpp.o
  157. [ 30%] Building CXX object src/CMakeFiles/minetest.dir/unittest/test_connection.cpp.o
  158. [ 30%] Building CXX object src/CMakeFiles/minetest.dir/unittest/test_filepath.cpp.o
  159. [ 31%] Building CXX object src/CMakeFiles/minetest.dir/unittest/test_inventory.cpp.o
  160. [ 31%] Building CXX object src/CMakeFiles/minetest.dir/unittest/test_keycode.cpp.o
  161. [ 31%] Building CXX object src/CMakeFiles/minetest.dir/unittest/test_map_settings_manager.cpp.o
  162. [ 32%] Building CXX object src/CMakeFiles/minetest.dir/unittest/test_mapnode.cpp.o
  163. [ 32%] Building CXX object src/CMakeFiles/minetest.dir/unittest/test_nodedef.cpp.o
  164. [ 33%] Building CXX object src/CMakeFiles/minetest.dir/unittest/test_noderesolver.cpp.o
  165. [ 34%] Building CXX object src/CMakeFiles/minetest.dir/unittest/test_objdef.cpp.o
  166. [ 34%] Building CXX object src/CMakeFiles/minetest.dir/unittest/test_noise.cpp.o
  167. [ 34%] Building CXX object src/CMakeFiles/minetest.dir/unittest/test_player.cpp.o
  168. [ 35%] Building CXX object src/CMakeFiles/minetest.dir/unittest/test_profiler.cpp.o
  169. [ 35%] Building CXX object src/CMakeFiles/minetest.dir/unittest/test_random.cpp.o
  170. [ 36%] Building CXX object src/CMakeFiles/minetest.dir/unittest/test_schematic.cpp.o
  171. [ 36%] Building CXX object src/CMakeFiles/minetest.dir/unittest/test_serialization.cpp.o
  172. [ 36%] Building CXX object src/CMakeFiles/minetest.dir/unittest/test_settings.cpp.o
  173. [ 37%] Building CXX object src/CMakeFiles/minetest.dir/unittest/test_socket.cpp.o
  174. [ 37%] Building CXX object src/CMakeFiles/minetest.dir/unittest/test_threading.cpp.o
  175. [ 38%] Building CXX object src/CMakeFiles/minetest.dir/unittest/test_utilities.cpp.o
  176. [ 38%] Building CXX object src/CMakeFiles/minetest.dir/unittest/test_voxelalgorithms.cpp.o
  177. [ 39%] Building CXX object src/CMakeFiles/minetest.dir/unittest/test_voxelmanipulator.cpp.o
  178. [ 39%] Building CXX object src/CMakeFiles/minetest.dir/util/areastore.cpp.o
  179. [ 40%] Building CXX object src/CMakeFiles/minetest.dir/util/auth.cpp.o
  180. [ 40%] Building CXX object src/CMakeFiles/minetest.dir/util/base64.cpp.o
  181. [ 40%] Building CXX object src/CMakeFiles/minetest.dir/util/directiontables.cpp.o
  182. [ 41%] Building CXX object src/CMakeFiles/minetest.dir/util/enriched_string.cpp.o
  183. [ 41%] Building CXX object src/CMakeFiles/minetest.dir/util/numeric.cpp.o
  184. [ 42%] [ 42%] Building CXX object src/CMakeFiles/minetest.dir/util/pointedthing.cpp.o
  185. Building CXX object src/CMakeFiles/minetest.dir/util/serialize.cpp.o
  186. [ 43%] Building CXX object src/CMakeFiles/minetest.dir/util/sha1.cpp.o
  187. [ 43%] Building C object src/CMakeFiles/minetest.dir/util/sha256.c.o
  188. [ 44%] Building CXX object src/CMakeFiles/minetest.dir/util/srp.cpp.o
  189. [ 44%] [ 45%] Building CXX object src/CMakeFiles/minetest.dir/util/timetaker.cpp.o
  190. Building CXX object src/CMakeFiles/minetest.dir/util/string.cpp.o
  191. [ 45%] Building CXX object src/CMakeFiles/minetest.dir/ban.cpp.o
  192. [ 45%] Building CXX object src/CMakeFiles/minetest.dir/camera.cpp.o
  193. [ 46%] Building CXX object src/CMakeFiles/minetest.dir/cavegen.cpp.o
  194. [ 47%] [ 47%] Building CXX object src/CMakeFiles/minetest.dir/chat.cpp.o
  195. Building CXX object src/CMakeFiles/minetest.dir/client.cpp.o
  196. [ 47%] Building CXX object src/CMakeFiles/minetest.dir/clientenvironment.cpp.o
  197. [ 48%] Building CXX object src/CMakeFiles/minetest.dir/clientiface.cpp.o
  198. [ 48%] Building CXX object src/CMakeFiles/minetest.dir/clientmap.cpp.o
  199. [ 49%] Building CXX object src/CMakeFiles/minetest.dir/clientmedia.cpp.o
  200. [ 49%] Building CXX object src/CMakeFiles/minetest.dir/clientobject.cpp.o
  201. [ 50%] Building CXX object src/CMakeFiles/minetest.dir/clouds.cpp.o
  202. [ 50%] Building CXX object src/CMakeFiles/minetest.dir/collision.cpp.o
  203. [ 50%] Building CXX object src/CMakeFiles/minetest.dir/content_abm.cpp.o
  204. [ 51%] Building CXX object src/CMakeFiles/minetest.dir/content_cao.cpp.o
  205. [ 51%] Building CXX object src/CMakeFiles/minetest.dir/content_cso.cpp.o
  206. [ 52%] Building CXX object src/CMakeFiles/minetest.dir/content_mapblock.cpp.o
  207. [ 52%] Building CXX object src/CMakeFiles/minetest.dir/content_mapnode.cpp.o
  208. [ 53%] Building CXX object src/CMakeFiles/minetest.dir/content_nodemeta.cpp.o
  209. [ 53%] Building CXX object src/CMakeFiles/minetest.dir/content_sao.cpp.o
  210. [ 54%] Building CXX object src/CMakeFiles/minetest.dir/convert_json.cpp.o
  211. [ 54%] Building CXX object src/CMakeFiles/minetest.dir/craftdef.cpp.o
  212. [ 54%] Building CXX object src/CMakeFiles/minetest.dir/database-dummy.cpp.o
  213. [ 55%] Building CXX object src/CMakeFiles/minetest.dir/database-leveldb.cpp.o
  214. [ 55%] Building CXX object src/CMakeFiles/minetest.dir/database-postgresql.cpp.o
  215. [ 56%] Building CXX object src/CMakeFiles/minetest.dir/database-redis.cpp.o
  216. [ 56%] Building CXX object src/CMakeFiles/minetest.dir/database-sqlite3.cpp.o
  217. [ 57%] Building CXX object src/CMakeFiles/minetest.dir/database.cpp.o
  218. [ 57%] Building CXX object src/CMakeFiles/minetest.dir/debug.cpp.o
  219. [ 58%] Building CXX object src/CMakeFiles/minetest.dir/defaultsettings.cpp.o
  220. [ 58%] Building CXX object src/CMakeFiles/minetest.dir/drawscene.cpp.o
  221. [ 59%] [ 59%] Building CXX object src/CMakeFiles/minetest.dir/dungeongen.cpp.o
  222. Building CXX object src/CMakeFiles/minetest.dir/emerge.cpp.o
  223. [ 59%] Building CXX object src/CMakeFiles/minetest.dir/environment.cpp.o
  224. [ 60%] Building CXX object src/CMakeFiles/minetest.dir/filecache.cpp.o
  225. [ 60%] Building CXX object src/CMakeFiles/minetest.dir/filesys.cpp.o
  226. [ 61%] Building CXX object src/CMakeFiles/minetest.dir/fontengine.cpp.o
  227. [ 61%] Building CXX object src/CMakeFiles/minetest.dir/game.cpp.o
  228. [ 62%] Building CXX object src/CMakeFiles/minetest.dir/genericobject.cpp.o
  229. [ 62%] Building CXX object src/CMakeFiles/minetest.dir/gettext.cpp.o
  230. [ 63%] Building CXX object src/CMakeFiles/minetest.dir/guiChatConsole.cpp.o
  231. [ 63%] Building CXX object src/CMakeFiles/minetest.dir/guiEngine.cpp.o
  232. [ 63%] Building CXX object src/CMakeFiles/minetest.dir/guiFileSelectMenu.cpp.o
  233. [ 64%] Building CXX object src/CMakeFiles/minetest.dir/guiFormSpecMenu.cpp.o
  234. [ 64%] Building CXX object src/CMakeFiles/minetest.dir/guiKeyChangeMenu.cpp.o
  235. [ 65%] Building CXX object src/CMakeFiles/minetest.dir/guiPasswordChange.cpp.o
  236. [ 65%] Building CXX object src/CMakeFiles/minetest.dir/guiTable.cpp.o
  237. [ 66%] Building CXX object src/CMakeFiles/minetest.dir/guiVolumeChange.cpp.o
  238. [ 66%] Building CXX object src/CMakeFiles/minetest.dir/guiscalingfilter.cpp.o
  239. [ 67%] Building CXX object src/CMakeFiles/minetest.dir/httpfetch.cpp.o
  240. [ 67%] Building CXX object src/CMakeFiles/minetest.dir/hud.cpp.o
  241. [ 68%] Building CXX object src/CMakeFiles/minetest.dir/imagefilters.cpp.o
  242. [ 68%] Building CXX object src/CMakeFiles/minetest.dir/intlGUIEditBox.cpp.o
  243. [ 68%] Building CXX object src/CMakeFiles/minetest.dir/inventory.cpp.o
  244. [ 69%] Building CXX object src/CMakeFiles/minetest.dir/inventorymanager.cpp.o
  245. [ 69%] Building CXX object src/CMakeFiles/minetest.dir/itemdef.cpp.o
  246. [ 70%] Building CXX object src/CMakeFiles/minetest.dir/itemstackmetadata.cpp.o
  247. [ 70%] Building CXX object src/CMakeFiles/minetest.dir/keycode.cpp.o
  248. [ 71%] Building CXX object src/CMakeFiles/minetest.dir/light.cpp.o
  249. [ 71%] Building CXX object src/CMakeFiles/minetest.dir/localplayer.cpp.o
  250. [ 72%] [ 72%] Building CXX object src/CMakeFiles/minetest.dir/log.cpp.o
  251. Building CXX object src/CMakeFiles/minetest.dir/main.cpp.o
  252. [ 72%] Building CXX object src/CMakeFiles/minetest.dir/map.cpp.o
  253. [ 72%] [ 73%] Building CXX object src/CMakeFiles/minetest.dir/map_settings_manager.cpp.o
  254. Building CXX object src/CMakeFiles/minetest.dir/mapblock.cpp.o
  255. [ 74%] Building CXX object src/CMakeFiles/minetest.dir/mapblock_mesh.cpp.o
  256. [ 74%] Building CXX object src/CMakeFiles/minetest.dir/mapgen.cpp.o
  257. [ 75%] Building CXX object src/CMakeFiles/minetest.dir/mapgen_flat.cpp.o
  258. [ 75%] Building CXX object src/CMakeFiles/minetest.dir/mapgen_fractal.cpp.o
  259. [ 76%] Building CXX object src/CMakeFiles/minetest.dir/mapgen_singlenode.cpp.o
  260. [ 76%] Building CXX object src/CMakeFiles/minetest.dir/mapgen_v5.cpp.o
  261. [ 77%] Building CXX object src/CMakeFiles/minetest.dir/mapgen_v6.cpp.o
  262. [ 77%] [ 77%] Building CXX object src/CMakeFiles/minetest.dir/mapgen_v7.cpp.o
  263. Building CXX object src/CMakeFiles/minetest.dir/mapgen_valleys.cpp.o
  264. [ 78%] Building CXX object src/CMakeFiles/minetest.dir/mapnode.cpp.o
  265. [ 78%] Building CXX object src/CMakeFiles/minetest.dir/mapsector.cpp.o
  266. [ 79%] Building CXX object src/CMakeFiles/minetest.dir/mesh.cpp.o
  267. [ 79%] Building CXX object src/CMakeFiles/minetest.dir/metadata.cpp.o
  268. [ 80%] Building CXX object src/CMakeFiles/minetest.dir/mg_biome.cpp.o
  269. [ 80%] Building CXX object src/CMakeFiles/minetest.dir/mg_decoration.cpp.o
  270. [ 81%] Building CXX object src/CMakeFiles/minetest.dir/mg_ore.cpp.o
  271. [ 81%] Building CXX object src/CMakeFiles/minetest.dir/mg_schematic.cpp.o
  272. [ 81%] Building CXX object src/CMakeFiles/minetest.dir/minimap.cpp.o
  273. [ 82%] Building CXX object src/CMakeFiles/minetest.dir/mods.cpp.o
  274. [ 82%] Building CXX object src/CMakeFiles/minetest.dir/nameidmapping.cpp.o
  275. [ 83%] Building CXX object src/CMakeFiles/minetest.dir/nodedef.cpp.o
  276. [ 83%] [ 84%] Building CXX object src/CMakeFiles/minetest.dir/nodemetadata.cpp.o
  277. Building CXX object src/CMakeFiles/minetest.dir/nodetimer.cpp.o
  278. [ 84%] Building CXX object src/CMakeFiles/minetest.dir/noise.cpp.o
  279. [ 85%] Building CXX object src/CMakeFiles/minetest.dir/objdef.cpp.o
  280. [ 85%] Building CXX object src/CMakeFiles/minetest.dir/object_properties.cpp.o
  281. [ 86%] Building CXX object src/CMakeFiles/minetest.dir/particles.cpp.o
  282. [ 86%] Building CXX object src/CMakeFiles/minetest.dir/pathfinder.cpp.o
  283. [ 86%] Building CXX object src/CMakeFiles/minetest.dir/player.cpp.o
  284. [ 87%] Building CXX object src/CMakeFiles/minetest.dir/porting.cpp.o
  285. [ 87%] Building CXX object src/CMakeFiles/minetest.dir/profiler.cpp.o
  286. [ 88%] Building CXX object src/CMakeFiles/minetest.dir/quicktune.cpp.o
  287. [ 88%] Building CXX object src/CMakeFiles/minetest.dir/raycast.cpp.o
  288. [ 88%] [ 89%] Building CXX object src/CMakeFiles/minetest.dir/remoteplayer.cpp.o
  289. Building CXX object src/CMakeFiles/minetest.dir/reflowscan.cpp.o
  290. [ 90%] Building CXX object src/CMakeFiles/minetest.dir/rollback.cpp.o
  291. [ 90%] [ 90%] Building CXX object src/CMakeFiles/minetest.dir/rollback_interface.cpp.o
  292. Building CXX object src/CMakeFiles/minetest.dir/serialization.cpp.o
  293. [ 91%] Building CXX object src/CMakeFiles/minetest.dir/server.cpp.o
  294. [ 91%] Building CXX object src/CMakeFiles/minetest.dir/serverenvironment.cpp.o
  295. [ 92%] [ 92%] Building CXX object src/CMakeFiles/minetest.dir/serverlist.cpp.o
  296. Building CXX object src/CMakeFiles/minetest.dir/serverobject.cpp.o
  297. [ 93%] [ 93%] Building CXX object src/CMakeFiles/minetest.dir/shader.cpp.o
  298. Building CXX object src/CMakeFiles/minetest.dir/settings.cpp.o
  299. [ 94%] [ 94%] Building CXX object src/CMakeFiles/minetest.dir/socket.cpp.o
  300. Building CXX object src/CMakeFiles/minetest.dir/sky.cpp.o
  301. [ 95%] Building CXX object src/CMakeFiles/minetest.dir/sound.cpp.o
  302. [ 95%] Building CXX object src/CMakeFiles/minetest.dir/sound_openal.cpp.o
  303. [ 95%] Building CXX object src/CMakeFiles/minetest.dir/staticobject.cpp.o
  304. [ 96%] Building CXX object src/CMakeFiles/minetest.dir/subgame.cpp.o
  305. [ 96%] Building CXX object src/CMakeFiles/minetest.dir/terminal_chat_console.cpp.o
  306. [ 97%] Building CXX object src/CMakeFiles/minetest.dir/tileanimation.cpp.o
  307. [ 97%] Building CXX object src/CMakeFiles/minetest.dir/tool.cpp.o
  308. [ 98%] Building CXX object src/CMakeFiles/minetest.dir/treegen.cpp.o
  309. [ 98%] Building CXX object src/CMakeFiles/minetest.dir/version.cpp.o
  310. [ 99%] Building CXX object src/CMakeFiles/minetest.dir/voxel.cpp.o
  311. [ 99%] Building CXX object src/CMakeFiles/minetest.dir/voxelalgorithms.cpp.o
  312. [100%] Building CXX object src/CMakeFiles/minetest.dir/wieldmesh.cpp.o
  313. Linking CXX executable ../../../bin/minetest
  314. /usr/local/lib/libcurl.a(libcurl_la-ssluse.o): dans la fonction « ossl_send »:
  315. ssluse.c:(.text+0x2c): référence indéfinie vers « ERR_clear_error »
  316. ssluse.c:(.text+0x58): référence indéfinie vers « SSL_write »
  317. ssluse.c:(.text+0x90): référence indéfinie vers « SSL_get_error »
  318. ssluse.c:(.text+0xa8): référence indéfinie vers « ERR_get_error »
  319. ssluse.c:(.text+0xb3): référence indéfinie vers « ERR_error_string »
  320. /usr/local/lib/libcurl.a(libcurl_la-ssluse.o): dans la fonction « x509_name_oneline »:
  321. ssluse.c:(.text+0x166): référence indéfinie vers « BIO_s_mem »
  322. ssluse.c:(.text+0x16e): référence indéfinie vers « BIO_new »
  323. ssluse.c:(.text+0x18d): référence indéfinie vers « X509_NAME_print_ex »
  324. ssluse.c:(.text+0x1a4): référence indéfinie vers « BIO_ctrl »
  325. ssluse.c:(.text+0x1d3): référence indéfinie vers « BIO_free »
  326. /usr/local/lib/libcurl.a(libcurl_la-ssluse.o): dans la fonction « cert_verify_callback »:
  327. ssluse.c:(.text+0x211): référence indéfinie vers « X509_STORE_CTX_get_current_cert »
  328. ssluse.c:(.text+0x219): référence indéfinie vers « X509_get_subject_name »
  329. /usr/local/lib/libcurl.a(libcurl_la-ssluse.o): dans la fonction « X509V3_ext »:
  330. ssluse.c:(.text+0x783): référence indéfinie vers « sk_num »
  331. ssluse.c:(.text+0x7b3): référence indéfinie vers « sk_num »
  332. ssluse.c:(.text+0x7c8): référence indéfinie vers « sk_value »
  333. ssluse.c:(.text+0x7d0): référence indéfinie vers « BIO_s_mem »
  334. ssluse.c:(.text+0x7d8): référence indéfinie vers « BIO_new »
  335. ssluse.c:(.text+0x7ec): référence indéfinie vers « X509_EXTENSION_get_object »
  336. ssluse.c:(.text+0x801): référence indéfinie vers « i2t_ASN1_OBJECT »
  337. ssluse.c:(.text+0x809): référence indéfinie vers « X509_EXTENSION_get_critical »
  338. ssluse.c:(.text+0x840): référence indéfinie vers « X509V3_EXT_print »
  339. ssluse.c:(.text+0x862): référence indéfinie vers « BIO_ctrl »
  340. ssluse.c:(.text+0x8f0): référence indéfinie vers « BIO_free »
  341. ssluse.c:(.text+0x8f9): référence indéfinie vers « sk_num »
  342. ssluse.c:(.text+0x975): référence indéfinie vers « ASN1_STRING_print »
  343. /usr/local/lib/libcurl.a(libcurl_la-ssluse.o): dans la fonction « ossl_recv »:
  344. ssluse.c:(.text+0xa3c): référence indéfinie vers « ERR_clear_error »
  345. ssluse.c:(.text+0xa68): référence indéfinie vers « SSL_read »
  346. ssluse.c:(.text+0xaa8): référence indéfinie vers « SSL_get_error »
  347. ssluse.c:(.text+0xad1): référence indéfinie vers « ERR_get_error »
  348. ssluse.c:(.text+0xae6): référence indéfinie vers « ERR_error_string »
  349. /usr/local/lib/libcurl.a(libcurl_la-ssluse.o): dans la fonction « servercert »:
  350. ssluse.c:(.text+0xe40): référence indéfinie vers « SSL_get_peer_certificate »
  351. ssluse.c:(.text+0xe6e): référence indéfinie vers « X509_get_subject_name »
  352. ssluse.c:(.text+0xe9b): référence indéfinie vers « X509_free »
  353. ssluse.c:(.text+0xf31): référence indéfinie vers « SSL_get_peer_cert_chain »
  354. ssluse.c:(.text+0xf49): référence indéfinie vers « sk_num »
  355. ssluse.c:(.text+0xfc3): référence indéfinie vers « sk_value »
  356. ssluse.c:(.text+0xfd3): référence indéfinie vers « X509_get_subject_name »
  357. ssluse.c:(.text+0x1017): référence indéfinie vers « X509_get_issuer_name »
  358. ssluse.c:(.text+0x105b): référence indéfinie vers « ASN1_INTEGER_get »
  359. ssluse.c:(.text+0x10ac): référence indéfinie vers « X509_get_serialNumber »
  360. ssluse.c:(.text+0x1156): référence indéfinie vers « i2t_ASN1_OBJECT »
  361. ssluse.c:(.text+0x1233): référence indéfinie vers « i2t_ASN1_OBJECT »
  362. ssluse.c:(.text+0x126d): référence indéfinie vers « X509_get_pubkey »
  363. ssluse.c:(.text+0x129e): référence indéfinie vers « EVP_PKEY_free »
  364. ssluse.c:(.text+0x12ce): référence indéfinie vers « BIO_s_mem »
  365. ssluse.c:(.text+0x12d6): référence indéfinie vers « BIO_new »
  366. ssluse.c:(.text+0x12e4): référence indéfinie vers « PEM_write_bio_X509 »
  367. ssluse.c:(.text+0x12f8): référence indéfinie vers « BIO_ctrl »
  368. ssluse.c:(.text+0x1338): référence indéfinie vers « BIO_free »
  369. ssluse.c:(.text+0x1472): référence indéfinie vers « X509_get_ext_d2i »
  370. ssluse.c:(.text+0x1486): référence indéfinie vers « sk_num »
  371. ssluse.c:(.text+0x14d8): référence indéfinie vers « sk_value »
  372. ssluse.c:(.text+0x14e9): référence indéfinie vers « ASN1_STRING_data »
  373. ssluse.c:(.text+0x14f7): référence indéfinie vers « ASN1_STRING_length »
  374. ssluse.c:(.text+0x1544): référence indéfinie vers « ASN1_INTEGER_get »
  375. ssluse.c:(.text+0x15a4): référence indéfinie vers « GENERAL_NAMES_free »
  376. ssluse.c:(.text+0x15c0): référence indéfinie vers « X509_get_subject_name »
  377. ssluse.c:(.text+0x15e7): référence indéfinie vers « X509_NAME_get_index_by_NID »
  378. ssluse.c:(.text+0x15ff): référence indéfinie vers « X509_NAME_get_entry »
  379. ssluse.c:(.text+0x1607): référence indéfinie vers « X509_NAME_ENTRY_get_data »
  380. ssluse.c:(.text+0x161b): référence indéfinie vers « ASN1_STRING_type »
  381. ssluse.c:(.text+0x1631): référence indéfinie vers « ASN1_STRING_to_UTF8 »
  382. ssluse.c:(.text+0x1699): référence indéfinie vers « CRYPTO_free »
  383. ssluse.c:(.text+0x16ab): référence indéfinie vers « X509_get_issuer_name »
  384. ssluse.c:(.text+0x16dc): référence indéfinie vers « X509_free »
  385. ssluse.c:(.text+0x1701): référence indéfinie vers « BN_num_bits »
  386. ssluse.c:(.text+0x1721): référence indéfinie vers « BN_num_bits »
  387. ssluse.c:(.text+0x1760): référence indéfinie vers « BN_num_bits »
  388. ssluse.c:(.text+0x178e): référence indéfinie vers « BN_num_bits »
  389. ssluse.c:(.text+0x17bc): référence indéfinie vers « BN_num_bits »
  390. /usr/local/lib/libcurl.a(libcurl_la-ssluse.o):ssluse.c:(.text+0x17ea): encore plus de références indéfinies suivent vers « BN_num_bits »
  391. /usr/local/lib/libcurl.a(libcurl_la-ssluse.o): dans la fonction « servercert »:
  392. ssluse.c:(.text+0x18d7): référence indéfinie vers « BN_bn2bin »
  393. ssluse.c:(.text+0x191e): référence indéfinie vers « BN_num_bits »
  394. ssluse.c:(.text+0x194c): référence indéfinie vers « BN_num_bits »
  395. ssluse.c:(.text+0x197a): référence indéfinie vers « BN_num_bits »
  396. ssluse.c:(.text+0x19a8): référence indéfinie vers « BN_num_bits »
  397. ssluse.c:(.text+0x19da): référence indéfinie vers « BN_num_bits »
  398. ssluse.c:(.text+0x1a0b): référence indéfinie vers « BN_bn2bin »
  399. ssluse.c:(.text+0x1a4e): référence indéfinie vers « BN_num_bits »
  400. ssluse.c:(.text+0x1a7c): référence indéfinie vers « BN_num_bits »
  401. ssluse.c:(.text+0x1aaa): référence indéfinie vers « BN_num_bits »
  402. ssluse.c:(.text+0x1adc): référence indéfinie vers « BN_num_bits »
  403. ssluse.c:(.text+0x1b0d): référence indéfinie vers « BN_bn2bin »
  404. ssluse.c:(.text+0x1bb5): référence indéfinie vers « BN_bn2bin »
  405. ssluse.c:(.text+0x1bf8): référence indéfinie vers « BN_bn2bin »
  406. ssluse.c:(.text+0x1c3b): référence indéfinie vers « BN_bn2bin »
  407. ssluse.c:(.text+0x1c7e): référence indéfinie vers « BN_bn2bin »
  408. /usr/local/lib/libcurl.a(libcurl_la-ssluse.o):ssluse.c:(.text+0x1cc1): encore plus de références indéfinies suivent vers « BN_bn2bin »
  409. /usr/local/lib/libcurl.a(libcurl_la-ssluse.o): dans la fonction « servercert »:
  410. ssluse.c:(.text+0x1f66): référence indéfinie vers « GENERAL_NAMES_free »
  411. ssluse.c:(.text+0x1faa): référence indéfinie vers « X509_free »
  412. ssluse.c:(.text+0x2001): référence indéfinie vers « PEM_read_X509 »
  413. ssluse.c:(.text+0x2021): référence indéfinie vers « X509_check_issued »
  414. ssluse.c:(.text+0x2056): référence indéfinie vers « X509_free »
  415. ssluse.c:(.text+0x205e): référence indéfinie vers « X509_free »
  416. ssluse.c:(.text+0x2116): référence indéfinie vers « X509_free »
  417. ssluse.c:(.text+0x21a1): référence indéfinie vers « X509_free »
  418. ssluse.c:(.text+0x21a8): référence indéfinie vers « X509_free »
  419. /usr/local/lib/libcurl.a(libcurl_la-ssluse.o):ssluse.c:(.text+0x21da): encore plus de références indéfinies suivent vers « X509_free »
  420. /usr/local/lib/libcurl.a(libcurl_la-ssluse.o): dans la fonction « servercert »:
  421. ssluse.c:(.text+0x21e3): référence indéfinie vers « SSL_get_verify_result »
  422. ssluse.c:(.text+0x221b): référence indéfinie vers « X509_verify_cert_error_string »
  423. ssluse.c:(.text+0x224e): référence indéfinie vers « GENERAL_NAMES_free »
  424. ssluse.c:(.text+0x22ac): référence indéfinie vers « ASN1_STRING_length »
  425. ssluse.c:(.text+0x22cb): référence indéfinie vers « CRYPTO_malloc »
  426. ssluse.c:(.text+0x22e0): référence indéfinie vers « ASN1_STRING_data »
  427. ssluse.c:(.text+0x2349): référence indéfinie vers « X509_verify_cert_error_string »
  428. /usr/local/lib/libcurl.a(libcurl_la-ssluse.o): dans la fonction « Curl_ossl_seed »:
  429. ssluse.c:(.text+0x23a1): référence indéfinie vers « RAND_load_file »
  430. ssluse.c:(.text+0x23a6): référence indéfinie vers « RAND_status »
  431. ssluse.c:(.text+0x23bb): référence indéfinie vers « RAND_egd »
  432. ssluse.c:(.text+0x23c5): référence indéfinie vers « RAND_status »
  433. ssluse.c:(.text+0x23fe): référence indéfinie vers « RAND_add »
  434. ssluse.c:(.text+0x240f): référence indéfinie vers « RAND_status »
  435. ssluse.c:(.text+0x2458): référence indéfinie vers « RAND_file_name »
  436. ssluse.c:(.text+0x246e): référence indéfinie vers « RAND_load_file »
  437. ssluse.c:(.text+0x2473): référence indéfinie vers « RAND_status »
  438. /usr/local/lib/libcurl.a(libcurl_la-ssluse.o): dans la fonction « ossl_connect_common »:
  439. ssluse.c:(.text+0x2565): référence indéfinie vers « ERR_clear_error »
  440. ssluse.c:(.text+0x256e): référence indéfinie vers « SSL_connect »
  441. ssluse.c:(.text+0x2582): référence indéfinie vers « SSL_get_error »
  442. ssluse.c:(.text+0x25a0): référence indéfinie vers « ERR_get_error »
  443. ssluse.c:(.text+0x25d8): référence indéfinie vers « ERR_error_string_n »
  444. ssluse.c:(.text+0x268c): référence indéfinie vers « SSL_get_current_cipher »
  445. ssluse.c:(.text+0x2694): référence indéfinie vers « SSL_CIPHER_get_name »
  446. ssluse.c:(.text+0x26f5): référence indéfinie vers « SSL_get_verify_result »
  447. ssluse.c:(.text+0x2769): référence indéfinie vers « X509_verify_cert_error_string »
  448. ssluse.c:(.text+0x2826): référence indéfinie vers « SSLv23_client_method »
  449. ssluse.c:(.text+0x283c): référence indéfinie vers « SSL_CTX_free »
  450. ssluse.c:(.text+0x2844): référence indéfinie vers « SSL_CTX_new »
  451. ssluse.c:(.text+0x2865): référence indéfinie vers « SSL_CTX_ctrl »
  452. ssluse.c:(.text+0x28be): référence indéfinie vers « SSL_CTX_ctrl »
  453. ssluse.c:(.text+0x292a): référence indéfinie vers « SSL_CTX_set_default_passwd_cb_userdata »
  454. ssluse.c:(.text+0x293b): référence indéfinie vers « SSL_CTX_set_default_passwd_cb »
  455. ssluse.c:(.text+0x2997): référence indéfinie vers « d2i_PKCS12_fp »
  456. ssluse.c:(.text+0x29ba): référence indéfinie vers « PKCS12_PBE_add »
  457. ssluse.c:(.text+0x29dd): référence indéfinie vers « PKCS12_parse »
  458. ssluse.c:(.text+0x29ea): référence indéfinie vers « ERR_get_error »
  459. ssluse.c:(.text+0x29f4): référence indéfinie vers « ERR_error_string »
  460. ssluse.c:(.text+0x2a12): référence indéfinie vers « PKCS12_free »
  461. ssluse.c:(.text+0x2a77): référence indéfinie vers « TLSv1_client_method »
  462. ssluse.c:(.text+0x2a9d): référence indéfinie vers « SSL_get1_session »
  463. ssluse.c:(.text+0x2b70): référence indéfinie vers « SSLv3_client_method »
  464. ssluse.c:(.text+0x2b9d): référence indéfinie vers « ERR_peek_error »
  465. ssluse.c:(.text+0x2ba7): référence indéfinie vers « ERR_error_string »
  466. ssluse.c:(.text+0x2c25): référence indéfinie vers « SSL_CTX_set_cipher_list »
  467. ssluse.c:(.text+0x2c5e): référence indéfinie vers « SSL_CTX_load_verify_locations »
  468. ssluse.c:(.text+0x2ccd): référence indéfinie vers « SSL_CTX_callback_ctrl »
  469. ssluse.c:(.text+0x2d02): référence indéfinie vers « SSL_CTX_use_certificate_chain_file »
  470. ssluse.c:(.text+0x2d31): référence indéfinie vers « SSL_CTX_use_certificate_file »
  471. ssluse.c:(.text+0x2d7d): référence indéfinie vers « SSL_new »
  472. ssluse.c:(.text+0x2d95): référence indéfinie vers « SSL_get_certificate »
  473. ssluse.c:(.text+0x2da7): référence indéfinie vers « X509_get_pubkey »
  474. ssluse.c:(.text+0x2db6): référence indéfinie vers « SSL_get_privatekey »
  475. ssluse.c:(.text+0x2dc3): référence indéfinie vers « EVP_PKEY_copy_parameters »
  476. ssluse.c:(.text+0x2dcd): référence indéfinie vers « EVP_PKEY_free »
  477. ssluse.c:(.text+0x2dd7): référence indéfinie vers « SSL_free »
  478. ssluse.c:(.text+0x2de1): référence indéfinie vers « SSL_CTX_check_private_key »
  479. ssluse.c:(.text+0x2e1a): référence indéfinie vers « TLSv1_client_method »
  480. ssluse.c:(.text+0x2ebd): référence indéfinie vers « ENGINE_ctrl »
  481. ssluse.c:(.text+0x2eec): référence indéfinie vers « SSL_CTX_ctrl »
  482. ssluse.c:(.text+0x2f67): référence indéfinie vers « X509_LOOKUP_file »
  483. ssluse.c:(.text+0x2f73): référence indéfinie vers « SSL_CTX_get_cert_store »
  484. ssluse.c:(.text+0x2f7e): référence indéfinie vers « X509_STORE_add_lookup »
  485. ssluse.c:(.text+0x2f98): référence indéfinie vers « X509_load_crl_file »
  486. ssluse.c:(.text+0x2ff4): référence indéfinie vers « ENGINE_ctrl_cmd »
  487. ssluse.c:(.text+0x3017): référence indéfinie vers « SSL_CTX_use_certificate »
  488. ssluse.c:(.text+0x303e): référence indéfinie vers « X509_free »
  489. ssluse.c:(.text+0x304b): référence indéfinie vers « SSL_SESSION_free »
  490. ssluse.c:(.text+0x309f): référence indéfinie vers « SSL_CTX_use_PrivateKey_file »
  491. ssluse.c:(.text+0x3100): référence indéfinie vers « SSL_CTX_set_srp_username »
  492. ssluse.c:(.text+0x312b): référence indéfinie vers « PKCS12_free »
  493. ssluse.c:(.text+0x313a): référence indéfinie vers « SSL_CTX_use_certificate »
  494. ssluse.c:(.text+0x315e): référence indéfinie vers « EVP_PKEY_free »
  495. ssluse.c:(.text+0x3168): référence indéfinie vers « X509_free »
  496. ssluse.c:(.text+0x316f): référence indéfinie vers « X509_free »
  497. ssluse.c:(.text+0x317c): référence indéfinie vers « sk_pop_free »
  498. ssluse.c:(.text+0x31c0): référence indéfinie vers « UI_OpenSSL »
  499. ssluse.c:(.text+0x31db): référence indéfinie vers « ENGINE_load_private_key »
  500. ssluse.c:(.text+0x31f6): référence indéfinie vers « SSL_CTX_use_PrivateKey »
  501. ssluse.c:(.text+0x3227): référence indéfinie vers « EVP_PKEY_free »
  502. ssluse.c:(.text+0x3246): référence indéfinie vers « SSL_CTX_get_cert_store »
  503. ssluse.c:(.text+0x3253): référence indéfinie vers « X509_STORE_set_flags »
  504. ssluse.c:(.text+0x3293): référence indéfinie vers « SSL_CTX_set_verify »
  505. ssluse.c:(.text+0x32ca): référence indéfinie vers « SSL_free »
  506. ssluse.c:(.text+0x32d3): référence indéfinie vers « SSL_new »
  507. ssluse.c:(.text+0x32f0): référence indéfinie vers « SSL_set_connect_state »
  508. ssluse.c:(.text+0x3339): référence indéfinie vers « SSL_set_session »
  509. ssluse.c:(.text+0x3346): référence indéfinie vers « ERR_get_error »
  510. ssluse.c:(.text+0x3350): référence indéfinie vers « ERR_error_string »
  511. ssluse.c:(.text+0x3379): référence indéfinie vers « ERR_get_error »
  512. ssluse.c:(.text+0x3383): référence indéfinie vers « ERR_error_string »
  513. ssluse.c:(.text+0x33ae): référence indéfinie vers « X509_free »
  514. ssluse.c:(.text+0x33c6): référence indéfinie vers « SSL_CTX_set_srp_password »
  515. ssluse.c:(.text+0x33fe): référence indéfinie vers « SSL_CTX_set_cipher_list »
  516. ssluse.c:(.text+0x3478): référence indéfinie vers « SSL_CTX_use_PrivateKey »
  517. ssluse.c:(.text+0x34ba): référence indéfinie vers « SSL_set_fd »
  518. ssluse.c:(.text+0x3550): référence indéfinie vers « SSL_ctrl »
  519. ssluse.c:(.text+0x3590): référence indéfinie vers « SSL_CTX_check_private_key »
  520. ssluse.c:(.text+0x35ae): référence indéfinie vers « sk_num »
  521. ssluse.c:(.text+0x35cd): référence indéfinie vers « sk_value »
  522. ssluse.c:(.text+0x35e1): référence indéfinie vers « SSL_CTX_ctrl »
  523. ssluse.c:(.text+0x35fb): référence indéfinie vers « sk_value »
  524. ssluse.c:(.text+0x3608): référence indéfinie vers « SSL_CTX_add_client_CA »
  525. ssluse.c:(.text+0x3622): référence indéfinie vers « sk_num »
  526. ssluse.c:(.text+0x3632): référence indéfinie vers « EVP_PKEY_free »
  527. ssluse.c:(.text+0x363c): référence indéfinie vers « X509_free »
  528. ssluse.c:(.text+0x3643): référence indéfinie vers « X509_free »
  529. ssluse.c:(.text+0x3650): référence indéfinie vers « sk_pop_free »
  530. ssluse.c:(.text+0x36d6): référence indéfinie vers « EVP_PKEY_free »
  531. ssluse.c:(.text+0x36e1): référence indéfinie vers « ERR_get_error »
  532. ssluse.c:(.text+0x36eb): référence indéfinie vers « ERR_error_string »
  533. /usr/local/lib/libcurl.a(libcurl_la-ssluse.o): dans la fonction « Curl_ossl_init »:
  534. ssluse.c:(.text+0x3745): référence indéfinie vers « ENGINE_load_builtin_engines »
  535. ssluse.c:(.text+0x374a): référence indéfinie vers « SSL_load_error_strings »
  536. ssluse.c:(.text+0x374f): référence indéfinie vers « SSL_library_init »
  537. ssluse.c:(.text+0x3758): référence indéfinie vers « OPENSSL_add_all_algorithms_noconf »
  538. /usr/local/lib/libcurl.a(libcurl_la-ssluse.o): dans la fonction « Curl_ossl_cleanup »:
  539. ssluse.c:(.text+0x3775): référence indéfinie vers « EVP_cleanup »
  540. ssluse.c:(.text+0x377a): référence indéfinie vers « ENGINE_cleanup »
  541. ssluse.c:(.text+0x377f): référence indéfinie vers « CRYPTO_cleanup_all_ex_data »
  542. ssluse.c:(.text+0x3784): référence indéfinie vers « ERR_free_strings »
  543. /usr/local/lib/libcurl.a(libcurl_la-ssluse.o): dans la fonction « Curl_ossl_check_cxn »:
  544. ssluse.c:(.text+0x37b6): référence indéfinie vers « SSL_peek »
  545. /usr/local/lib/libcurl.a(libcurl_la-ssluse.o): dans la fonction « Curl_ossl_set_engine »:
  546. ssluse.c:(.text+0x3808): référence indéfinie vers « ENGINE_by_id »
  547. ssluse.c:(.text+0x3825): référence indéfinie vers « ENGINE_finish »
  548. ssluse.c:(.text+0x3831): référence indéfinie vers « ENGINE_free »
  549. ssluse.c:(.text+0x3844): référence indéfinie vers « ENGINE_init »
  550. ssluse.c:(.text+0x387c): référence indéfinie vers « ENGINE_free »
  551. ssluse.c:(.text+0x3881): référence indéfinie vers « ERR_get_error »
  552. ssluse.c:(.text+0x3891): référence indéfinie vers « ERR_error_string_n »
  553. /usr/local/lib/libcurl.a(libcurl_la-ssluse.o): dans la fonction « Curl_ossl_set_engine_default »:
  554. ssluse.c:(.text+0x38fd): référence indéfinie vers « ENGINE_set_default »
  555. ssluse.c:(.text+0x390d): référence indéfinie vers « ENGINE_get_id »
  556. ssluse.c:(.text+0x3931): référence indéfinie vers « ENGINE_get_id »
  557. /usr/local/lib/libcurl.a(libcurl_la-ssluse.o): dans la fonction « Curl_ossl_engines_list »:
  558. ssluse.c:(.text+0x3965): référence indéfinie vers « ENGINE_get_first »
  559. ssluse.c:(.text+0x3984): référence indéfinie vers « ENGINE_get_next »
  560. ssluse.c:(.text+0x3997): référence indéfinie vers « ENGINE_get_id »
  561. /usr/local/lib/libcurl.a(libcurl_la-ssluse.o): dans la fonction « Curl_ossl_close »:
  562. ssluse.c:(.text+0x39ea): référence indéfinie vers « SSL_shutdown »
  563. ssluse.c:(.text+0x39f3): référence indéfinie vers « SSL_set_connect_state »
  564. ssluse.c:(.text+0x39fc): référence indéfinie vers « SSL_free »
  565. ssluse.c:(.text+0x3a12): référence indéfinie vers « SSL_CTX_free »
  566. /usr/local/lib/libcurl.a(libcurl_la-ssluse.o): dans la fonction « Curl_ossl_shutdown »:
  567. ssluse.c:(.text+0x3a9b): référence indéfinie vers « ERR_clear_error »
  568. ssluse.c:(.text+0x3ab3): référence indéfinie vers « SSL_read »
  569. ssluse.c:(.text+0x3ac2): référence indéfinie vers « SSL_get_error »
  570. ssluse.c:(.text+0x3ae8): référence indéfinie vers « ERR_get_error »
  571. ssluse.c:(.text+0x3afd): référence indéfinie vers « ERR_error_string »
  572. ssluse.c:(.text+0x3b2d): référence indéfinie vers « SSL_free »
  573. ssluse.c:(.text+0x3b81): référence indéfinie vers « SSL_get_shutdown »
  574. ssluse.c:(.text+0x3c55): référence indéfinie vers « SSL_shutdown »
  575. /usr/local/lib/libcurl.a(libcurl_la-ssluse.o): dans la fonction « Curl_ossl_close_all »:
  576. ssluse.c:(.text+0x3cb1): référence indéfinie vers « ENGINE_finish »
  577. ssluse.c:(.text+0x3cbd): référence indéfinie vers « ENGINE_free »
  578. /usr/local/lib/libcurl.a(libcurl_la-ssluse.o): dans la fonction « Curl_ossl_data_pending »:
  579. ssluse.c:(.text+0x3d1b): référence indéfinie vers « SSL_pending »
  580. /usr/local/lib/libcurl.a(libcurl_la-ssluse.o): dans la fonction « Curl_ossl_version »:
  581. ssluse.c:(.text+0x3d42): référence indéfinie vers « SSLeay »
  582. /usr/local/lib/libcurl.a(libcurl_la-ssluse.o): dans la fonction « Curl_ossl_md5sum »:
  583. ssluse.c:(.text+0x3e17): référence indéfinie vers « MD5_Init »
  584. ssluse.c:(.text+0x3e25): référence indéfinie vers « MD5_Update »
  585. ssluse.c:(.text+0x3e30): référence indéfinie vers « MD5_Final »
  586. /usr/local/lib/libcurl.a(libcurl_la-ssluse.o): dans la fonction « Curl_ossl_cleanup »:
  587. ssluse.c:(.text+0x378f): référence indéfinie vers « ERR_remove_thread_state »
  588. /usr/local/lib/libcurl.a(libcurl_la-ssluse.o): dans la fonction « Curl_ossl_session_free »:
  589. ssluse.c:(.text+0x3c91): référence indéfinie vers « SSL_SESSION_free »
  590. /usr/local/lib/libcurl.a(libcurl_la-ssluse.o): dans la fonction « Curl_ossl_random »:
  591. ssluse.c:(.text+0x3df5): référence indéfinie vers « RAND_bytes »
  592. /usr/local/lib/libcurl.a(libcurl_la-md5.o): dans la fonction « Curl_md5it »:
  593. md5.c:(.text+0x12): référence indéfinie vers « MD5_Init »
  594. md5.c:(.text+0x2f): référence indéfinie vers « MD5_Update »
  595. md5.c:(.text+0x3a): référence indéfinie vers « MD5_Final »
  596. /usr/local/lib/libcurl.a(libcurl_la-md5.o):(.data.rel.ro+0x0): référence indéfinie vers « MD5_Init »
  597. /usr/local/lib/libcurl.a(libcurl_la-md5.o):(.data.rel.ro+0x8): référence indéfinie vers « MD5_Update »
  598. /usr/local/lib/libcurl.a(libcurl_la-md5.o):(.data.rel.ro+0x10): référence indéfinie vers « MD5_Final »
  599. /usr/local/lib/libcurl.a(libcurl_la-md5.o):(.data.rel.ro+0x20): référence indéfinie vers « MD5_Init »
  600. /usr/local/lib/libcurl.a(libcurl_la-md5.o):(.data.rel.ro+0x28): référence indéfinie vers « MD5_Update »
  601. /usr/local/lib/libcurl.a(libcurl_la-md5.o):(.data.rel.ro+0x30): référence indéfinie vers « MD5_Final »
  602. /usr/local/lib/libcurl.a(libcurl_la-curl_ntlm_core.o): dans la fonction « setup_des_key »:
  603. curl_ntlm_core.c:(.text+0x94): référence indéfinie vers « DES_set_odd_parity »
  604. curl_ntlm_core.c:(.text+0x9f): référence indéfinie vers « DES_set_key »
  605. /usr/local/lib/libcurl.a(libcurl_la-curl_ntlm_core.o): dans la fonction « Curl_ntlm_core_lm_resp »:
  606. curl_ntlm_core.c:(.text+0xed): référence indéfinie vers « DES_ecb_encrypt »
  607. curl_ntlm_core.c:(.text+0x10e): référence indéfinie vers « DES_ecb_encrypt »
  608. curl_ntlm_core.c:(.text+0x12f): référence indéfinie vers « DES_ecb_encrypt »
  609. /usr/local/lib/libcurl.a(libcurl_la-curl_ntlm_core.o): dans la fonction « Curl_ntlm_core_mk_lm_hash »:
  610. curl_ntlm_core.c:(.text+0x1d8): référence indéfinie vers « DES_ecb_encrypt »
  611. curl_ntlm_core.c:(.text+0x1fd): référence indéfinie vers « DES_ecb_encrypt »
  612. /usr/local/lib/libcurl.a(libcurl_la-curl_ntlm_core.o): dans la fonction « Curl_ntlm_core_mk_nt_hash »:
  613. curl_ntlm_core.c:(.text+0x2b3): référence indéfinie vers « MD4_Init »
  614. curl_ntlm_core.c:(.text+0x2c1): référence indéfinie vers « MD4_Update »
  615. curl_ntlm_core.c:(.text+0x2cc): référence indéfinie vers « MD4_Final »
  616. collect2: error: ld returned 1 exit status
  617. src/CMakeFiles/minetest.dir/build.make:5567: recipe for target '../../bin/minetest' failed
  618. make[2]: *** [../../bin/minetest] Error 1
  619. CMakeFiles/Makefile2:166: recipe for target 'src/CMakeFiles/minetest.dir/all' failed
  620. make[1]: *** [src/CMakeFiles/minetest.dir/all] Error 2
  621. Makefile:136: recipe for target 'all' failed
  622. make: *** [all] Error 2
  623. ⌂85% θ86° mael@mael-GE60:~/projets/minetest/build/linux master* 1m43s 2 ±
RAW Paste Data
We use cookies for various purposes including analytics. By continuing to use Pastebin, you agree to our use of cookies as described in the Cookies Policy. OK, I Understand
Top