Guest User

Untitled

a guest
May 14th, 2016
86
Never
Not a member of Pastebin yet? Sign Up, it unlocks many cool features!
  1. [INFO] ------------------------------------------------------------------------
  2. [INFO] Building UnleashedAPI 1.0
  3. [INFO] ------------------------------------------------------------------------
  4. [WARNING] The artifact org.apache.commons:commons-io:jar:1.3.2 has been relocated to commons-io:commons-io:jar:1.3.2
  5. [INFO]
  6. [INFO] --- maven-clean-plugin:2.5:clean (default-clean) @ UnleashedAPI ---
  7. [INFO] Deleting /var/lib/jenkins/jobs/UnleashedAPI/workspace/target
  8. [INFO]
  9. [INFO] --- maven-resources-plugin:2.6:resources (default-resources) @ UnleashedAPI ---
  10. [INFO] Using 'UTF-8' encoding to copy filtered resources.
  11. [INFO] Copying 0 resource
  12. [INFO]
  13. [INFO] --- maven-compiler-plugin:3.3:compile (default-compile) @ UnleashedAPI ---
  14. [INFO] Changes detected - recompiling the module!
  15. [INFO] Compiling 68 source files to /var/lib/jenkins/jobs/UnleashedAPI/workspace/target/classes
  16. [INFO] /var/lib/jenkins/jobs/UnleashedAPI/workspace/src/database/EmptyResultSet.java: /var/lib/jenkins/jobs/UnleashedAPI/workspace/src/database/EmptyResultSet.java uses or overrides a deprecated API.
  17. [INFO] /var/lib/jenkins/jobs/UnleashedAPI/workspace/src/database/EmptyResultSet.java: Recompile with -Xlint:deprecation for details.
  18. [INFO] /var/lib/jenkins/jobs/UnleashedAPI/workspace/src/util/ArrayWrapper.java: Some input files use unchecked or unsafe operations.
  19. [INFO] /var/lib/jenkins/jobs/UnleashedAPI/workspace/src/util/ArrayWrapper.java: Recompile with -Xlint:unchecked for details.
  20. [INFO] -------------------------------------------------------------
  21. [ERROR] COMPILATION ERROR :
  22. [INFO] -------------------------------------------------------------
  23. [ERROR] /var/lib/jenkins/jobs/UnleashedAPI/workspace/src/items/EntireInventory.java:[5,25] package org.bukkit.entity does not exist
  24. [ERROR] /var/lib/jenkins/jobs/UnleashedAPI/workspace/src/items/EntireInventory.java:[6,28] package org.bukkit.inventory does not exist
  25. [ERROR] /var/lib/jenkins/jobs/UnleashedAPI/workspace/src/items/EntireInventory.java:[10,16] cannot find symbol
  26. symbol: class ItemStack
  27. location: class items.EntireInventory
  28. [ERROR] /var/lib/jenkins/jobs/UnleashedAPI/workspace/src/items/EntireInventory.java:[11,16] cannot find symbol
  29. symbol: class ItemStack
  30. location: class items.EntireInventory
  31. [ERROR] /var/lib/jenkins/jobs/UnleashedAPI/workspace/src/items/EntireInventory.java:[13,34] cannot find symbol
  32. symbol: class Player
  33. location: class items.EntireInventory
  34. [ERROR] /var/lib/jenkins/jobs/UnleashedAPI/workspace/src/items/EntireInventory.java:[18,32] cannot find symbol
  35. symbol: class ItemStack
  36. location: class items.EntireInventory
  37. [ERROR] /var/lib/jenkins/jobs/UnleashedAPI/workspace/src/items/EntireInventory.java:[18,52] cannot find symbol
  38. symbol: class ItemStack
  39. location: class items.EntireInventory
  40. [ERROR] /var/lib/jenkins/jobs/UnleashedAPI/workspace/src/items/EntireInventory.java:[23,47] cannot find symbol
  41. symbol: class Player
  42. location: class items.EntireInventory
  43. [ERROR] /var/lib/jenkins/jobs/UnleashedAPI/workspace/src/items/EntireInventory.java:[43,37] cannot find symbol
  44. symbol: class Player
  45. location: class items.EntireInventory
  46. [ERROR] /var/lib/jenkins/jobs/UnleashedAPI/workspace/src/cb/fanciful/TextualComponent.java:[8,46] package org.bukkit.configuration.serialization does not exist
  47. [ERROR] /var/lib/jenkins/jobs/UnleashedAPI/workspace/src/cb/fanciful/TextualComponent.java:[9,46] package org.bukkit.configuration.serialization does not exist
  48. [ERROR] /var/lib/jenkins/jobs/UnleashedAPI/workspace/src/cb/fanciful/TextualComponent.java:[11,30] package com.google.common.base does not exist
  49. [ERROR] /var/lib/jenkins/jobs/UnleashedAPI/workspace/src/cb/fanciful/TextualComponent.java:[12,33] package com.google.common.collect does not exist
  50. [ERROR] /var/lib/jenkins/jobs/UnleashedAPI/workspace/src/cb/fanciful/TextualComponent.java:[81,99] cannot find symbol
  51. symbol: class ConfigurationSerializable
  52. location: class cb.fanciful.TextualComponent
  53. [ERROR] /var/lib/jenkins/jobs/UnleashedAPI/workspace/src/cb/fanciful/TextualComponent.java:[143,97] cannot find symbol
  54. symbol: class ConfigurationSerializable
  55. location: class cb.fanciful.TextualComponent
  56. [ERROR] /var/lib/jenkins/jobs/UnleashedAPI/workspace/src/satchels/Satchels.java:[3,18] package org.bukkit does not exist
  57. [ERROR] /var/lib/jenkins/jobs/UnleashedAPI/workspace/src/satchels/Satchels.java:[4,31] package org.bukkit.enchantments does not exist
  58. [ERROR] /var/lib/jenkins/jobs/UnleashedAPI/workspace/src/satchels/Satchels.java:[5,28] package org.bukkit.inventory does not exist
  59. [ERROR] /var/lib/jenkins/jobs/UnleashedAPI/workspace/src/satchels/Satchels.java:[7,21] package ulmc.satchels does not exist
  60. [ERROR] /var/lib/jenkins/jobs/UnleashedAPI/workspace/src/satchels/Satchels.java:[10,23] cannot find symbol
  61. symbol: class ItemStack
  62. location: class satchels.Satchels
  63. [ERROR] /var/lib/jenkins/jobs/UnleashedAPI/workspace/src/satchels/Satchels.java:[20,23] cannot find symbol
  64. symbol: class ItemStack
  65. location: class satchels.Satchels
  66. [ERROR] /var/lib/jenkins/jobs/UnleashedAPI/workspace/src/satchels/Satchels.java:[30,23] cannot find symbol
  67. symbol: class ItemStack
  68. location: class satchels.Satchels
  69. [ERROR] /var/lib/jenkins/jobs/UnleashedAPI/workspace/src/satchels/Satchels.java:[40,23] cannot find symbol
  70. symbol: class ItemStack
  71. location: class satchels.Satchels
  72. [ERROR] /var/lib/jenkins/jobs/UnleashedAPI/workspace/src/satchels/Satchels.java:[50,23] cannot find symbol
  73. symbol: class ItemStack
  74. location: class satchels.Satchels
  75. [ERROR] /var/lib/jenkins/jobs/UnleashedAPI/workspace/src/satchels/Satchels.java:[60,23] cannot find symbol
  76. symbol: class ItemStack
  77. location: class satchels.Satchels
  78. [ERROR] /var/lib/jenkins/jobs/UnleashedAPI/workspace/src/util/ArrayWrapper.java:[7,31] package org.apache.commons.lang does not exist
  79. [ERROR] /var/lib/jenkins/jobs/UnleashedAPI/workspace/src/util/PlayerUtil.java:[11,18] package org.bukkit does not exist
  80. [ERROR] /var/lib/jenkins/jobs/UnleashedAPI/workspace/src/util/PlayerUtil.java:[12,25] package org.bukkit.entity does not exist
  81. [ERROR] /var/lib/jenkins/jobs/UnleashedAPI/workspace/src/util/PlayerUtil.java:[13,25] package org.bukkit.plugin does not exist
  82. [ERROR] /var/lib/jenkins/jobs/UnleashedAPI/workspace/src/util/PlayerUtil.java:[26,38] cannot find symbol
  83. symbol: class Player
  84. location: class util.PlayerUtil
  85. [ERROR] /var/lib/jenkins/jobs/UnleashedAPI/workspace/src/util/PlayerUtil.java:[37,37] cannot find symbol
  86. symbol: class Player
  87. location: class util.PlayerUtil
  88. [ERROR] /var/lib/jenkins/jobs/UnleashedAPI/workspace/src/util/PlayerUtil.java:[60,53] cannot find symbol
  89. symbol: class Location
  90. location: class util.PlayerUtil
  91. [ERROR] /var/lib/jenkins/jobs/UnleashedAPI/workspace/src/util/PlayerUtil.java:[84,41] cannot find symbol
  92. symbol: class Player
  93. location: class util.PlayerUtil
  94. [ERROR] /var/lib/jenkins/jobs/UnleashedAPI/workspace/src/util/PlayerUtil.java:[91,41] cannot find symbol
  95. symbol: class Player
  96. location: class util.PlayerUtil
  97. [ERROR] /var/lib/jenkins/jobs/UnleashedAPI/workspace/src/util/PlayerUtil.java:[95,40] cannot find symbol
  98. symbol: class Location
  99. location: class util.PlayerUtil
  100. [ERROR] /var/lib/jenkins/jobs/UnleashedAPI/workspace/src/util/PlayerUtil.java:[102,42] cannot find symbol
  101. symbol: class Player
  102. location: class util.PlayerUtil
  103. [ERROR] /var/lib/jenkins/jobs/UnleashedAPI/workspace/src/util/PlayerUtil.java:[110,41] cannot find symbol
  104. symbol: class Player
  105. location: class util.PlayerUtil
  106. [ERROR] /var/lib/jenkins/jobs/UnleashedAPI/workspace/src/players/PlayerDeath.java:[3,18] package org.bukkit does not exist
  107. [ERROR] /var/lib/jenkins/jobs/UnleashedAPI/workspace/src/players/PlayerDeath.java:[4,18] package org.bukkit does not exist
  108. [ERROR] /var/lib/jenkins/jobs/UnleashedAPI/workspace/src/players/PlayerDeath.java:[5,18] package org.bukkit does not exist
  109. [ERROR] /var/lib/jenkins/jobs/UnleashedAPI/workspace/src/players/PlayerDeath.java:[6,25] package org.bukkit.entity does not exist
  110. [ERROR] /var/lib/jenkins/jobs/UnleashedAPI/workspace/src/players/PlayerDeath.java:[7,24] package org.bukkit.event does not exist
  111. [ERROR] /var/lib/jenkins/jobs/UnleashedAPI/workspace/src/players/PlayerDeath.java:[8,24] package org.bukkit.event does not exist
  112. [ERROR] /var/lib/jenkins/jobs/UnleashedAPI/workspace/src/players/PlayerDeath.java:[9,31] package org.bukkit.event.entity does not exist
  113. [ERROR] /var/lib/jenkins/jobs/UnleashedAPI/workspace/src/players/PlayerDeath.java:[10,31] package org.bukkit.event.entity does not exist
  114. [ERROR] /var/lib/jenkins/jobs/UnleashedAPI/workspace/src/players/PlayerDeath.java:[11,28] package org.bukkit.inventory does not exist
  115. [ERROR] /var/lib/jenkins/jobs/UnleashedAPI/workspace/src/players/PlayerDeath.java:[12,33] package org.bukkit.inventory.meta does not exist
  116. [ERROR] /var/lib/jenkins/jobs/UnleashedAPI/workspace/src/players/PlayerDeath.java:[14,37] cannot find symbol
  117. symbol: class Listener
  118. [ERROR] /var/lib/jenkins/jobs/UnleashedAPI/workspace/src/players/PlayerDeath.java:[16,27] cannot find symbol
  119. symbol: class PlayerDeathEvent
  120. location: class players.PlayerDeath
  121. [ERROR] /var/lib/jenkins/jobs/UnleashedAPI/workspace/src/cb/fanciful/FancyMessage.java:[25,18] package org.bukkit does not exist
  122. [ERROR] /var/lib/jenkins/jobs/UnleashedAPI/workspace/src/cb/fanciful/FancyMessage.java:[26,18] package org.bukkit does not exist
  123. [ERROR] /var/lib/jenkins/jobs/UnleashedAPI/workspace/src/cb/fanciful/FancyMessage.java:[27,18] package org.bukkit does not exist
  124. [ERROR] /var/lib/jenkins/jobs/UnleashedAPI/workspace/src/cb/fanciful/FancyMessage.java:[28,18] package org.bukkit does not exist
  125. [ERROR] /var/lib/jenkins/jobs/UnleashedAPI/workspace/src/cb/fanciful/FancyMessage.java:[29,18] package org.bukkit does not exist
  126. [ERROR] /var/lib/jenkins/jobs/UnleashedAPI/workspace/src/cb/fanciful/FancyMessage.java:[30,28] package org.bukkit.Statistic does not exist
  127. [ERROR] /var/lib/jenkins/jobs/UnleashedAPI/workspace/src/cb/fanciful/FancyMessage.java:[31,26] package org.bukkit.command does not exist
  128. [ERROR] /var/lib/jenkins/jobs/UnleashedAPI/workspace/src/cb/fanciful/FancyMessage.java:[32,46] package org.bukkit.configuration.serialization does not exist
  129. [ERROR] /var/lib/jenkins/jobs/UnleashedAPI/workspace/src/cb/fanciful/FancyMessage.java:[33,46] package org.bukkit.configuration.serialization does not exist
  130. [ERROR] /var/lib/jenkins/jobs/UnleashedAPI/workspace/src/cb/fanciful/FancyMessage.java:[34,25] package org.bukkit.entity does not exist
  131. [ERROR] /var/lib/jenkins/jobs/UnleashedAPI/workspace/src/cb/fanciful/FancyMessage.java:[36,28] package org.bukkit.inventory does not exist
  132. [ERROR] /var/lib/jenkins/jobs/UnleashedAPI/workspace/src/cb/fanciful/MessagePart.java:[8,18] package org.bukkit does not exist
  133. [ERROR] /var/lib/jenkins/jobs/UnleashedAPI/workspace/src/cb/fanciful/MessagePart.java:[9,46] package org.bukkit.configuration.serialization does not exist
  134. [ERROR] /var/lib/jenkins/jobs/UnleashedAPI/workspace/src/cb/fanciful/MessagePart.java:[10,46] package org.bukkit.configuration.serialization does not exist
  135. [ERROR] /var/lib/jenkins/jobs/UnleashedAPI/workspace/src/cb/fanciful/MessagePart.java:[12,33] package com.google.common.collect does not exist
  136. [ERROR] /var/lib/jenkins/jobs/UnleashedAPI/workspace/src/cb/fanciful/MessagePart.java:[13,33] package com.google.common.collect does not exist
  137. [ERROR] /var/lib/jenkins/jobs/UnleashedAPI/workspace/src/cb/fanciful/MessagePart.java:[16,18] package org.bukkit does not exist
  138. [ERROR] /var/lib/jenkins/jobs/UnleashedAPI/workspace/src/cb/fanciful/MessagePart.java:[21,59] cannot find symbol
  139. symbol: class ConfigurationSerializable
  140. [ERROR] /var/lib/jenkins/jobs/UnleashedAPI/workspace/src/cb/fanciful/FancyMessage.java:[51,95] cannot find symbol
  141. symbol: class ConfigurationSerializable
  142. [ERROR] /var/lib/jenkins/jobs/UnleashedAPI/workspace/src/cb/fanciful/FancyMessage.java:[138,41] cannot find symbol
  143. symbol: class ChatColor
  144. location: class cb.fanciful.FancyMessage
  145. [ERROR] /var/lib/jenkins/jobs/UnleashedAPI/workspace/src/cb/fanciful/FancyMessage.java:[153,35] cannot find symbol
  146. symbol: class ChatColor
  147. location: class cb.fanciful.FancyMessage
  148. [ERROR] /var/lib/jenkins/jobs/UnleashedAPI/workspace/src/cb/fanciful/FancyMessage.java:[235,54] cannot find symbol
  149. symbol: class Achievement
  150. location: class cb.fanciful.FancyMessage
  151. [ERROR] /var/lib/jenkins/jobs/UnleashedAPI/workspace/src/cb/fanciful/FancyMessage.java:[258,52] cannot find symbol
  152. symbol: class Statistic
  153. location: class cb.fanciful.FancyMessage
  154. [ERROR] /var/lib/jenkins/jobs/UnleashedAPI/workspace/src/cb/fanciful/FancyMessage.java:[286,52] cannot find symbol
  155. symbol: class Statistic
  156. location: class cb.fanciful.FancyMessage
  157. [ERROR] /var/lib/jenkins/jobs/UnleashedAPI/workspace/src/cb/fanciful/FancyMessage.java:[286,69] cannot find symbol
  158. symbol: class Material
  159. location: class cb.fanciful.FancyMessage
  160. [ERROR] /var/lib/jenkins/jobs/UnleashedAPI/workspace/src/cb/fanciful/FancyMessage.java:[317,52] cannot find symbol
  161. symbol: class Statistic
  162. location: class cb.fanciful.FancyMessage
  163. [ERROR] /var/lib/jenkins/jobs/UnleashedAPI/workspace/src/cb/fanciful/FancyMessage.java:[317,69] cannot find symbol
  164. symbol: class EntityType
  165. location: class cb.fanciful.FancyMessage
  166. [ERROR] /var/lib/jenkins/jobs/UnleashedAPI/workspace/src/cb/fanciful/FancyMessage.java:[357,47] cannot find symbol
  167. symbol: class ItemStack
  168. location: class cb.fanciful.FancyMessage
  169. [ERROR] /var/lib/jenkins/jobs/UnleashedAPI/workspace/src/cb/fanciful/FancyMessage.java:[606,26] cannot find symbol
  170. symbol: class Player
  171. location: class cb.fanciful.FancyMessage
  172. [ERROR] /var/lib/jenkins/jobs/UnleashedAPI/workspace/src/cb/fanciful/FancyMessage.java:[610,27] cannot find symbol
  173. symbol: class CommandSender
  174. location: class cb.fanciful.FancyMessage
  175. [ERROR] /var/lib/jenkins/jobs/UnleashedAPI/workspace/src/cb/fanciful/FancyMessage.java:[683,26] cannot find symbol
  176. symbol: class CommandSender
  177. location: class cb.fanciful.FancyMessage
  178. [ERROR] /var/lib/jenkins/jobs/UnleashedAPI/workspace/src/cb/fanciful/FancyMessage.java:[692,51] cannot find symbol
  179. symbol: class CommandSender
  180. location: class cb.fanciful.FancyMessage
  181. [ERROR] /var/lib/jenkins/jobs/UnleashedAPI/workspace/src/cb/fanciful/MessagePart.java:[23,9] cannot find symbol
  182. symbol: class ChatColor
  183. location: class cb.fanciful.MessagePart
  184. [ERROR] /var/lib/jenkins/jobs/UnleashedAPI/workspace/src/cb/fanciful/MessagePart.java:[24,19] cannot find symbol
  185. symbol: class ChatColor
  186. location: class cb.fanciful.MessagePart
  187. [ERROR] /var/lib/jenkins/jobs/UnleashedAPI/workspace/src/cb/fanciful/MessagePart.java:[59,22] cannot find symbol
  188. symbol: class BiMap
  189. location: class cb.fanciful.MessagePart
  190. [ERROR] /var/lib/jenkins/jobs/UnleashedAPI/workspace/src/cb/fanciful/MessagePart.java:[59,28] cannot find symbol
  191. symbol: class ChatColor
  192. location: class cb.fanciful.MessagePart
  193. [ERROR] /var/lib/jenkins/jobs/UnleashedAPI/workspace/src/util/Reflection.java:[9,18] package org.bukkit does not exist
  194. [ERROR] /var/lib/jenkins/jobs/UnleashedAPI/workspace/src/items/MobDrop.java:[7,18] package org.bukkit does not exist
  195. [ERROR] /var/lib/jenkins/jobs/UnleashedAPI/workspace/src/items/MobDrop.java:[8,18] package org.bukkit does not exist
  196. [ERROR] /var/lib/jenkins/jobs/UnleashedAPI/workspace/src/items/MobDrop.java:[9,24] package org.bukkit.block does not exist
  197. [ERROR] /var/lib/jenkins/jobs/UnleashedAPI/workspace/src/items/MobDrop.java:[34,29] cannot find symbol
  198. symbol: class Location
  199. location: class items.MobDrop
  200. [ERROR] /var/lib/jenkins/jobs/UnleashedAPI/workspace/src/items/MobDrop.java:[34,41] cannot find symbol
  201. symbol: class Player
  202. location: class items.MobDrop
  203. [ERROR] /var/lib/jenkins/jobs/UnleashedAPI/workspace/src/items/MobDrop.java:[39,29] cannot find symbol
  204. symbol: class Location
  205. location: class items.MobDrop
  206. [ERROR] /var/lib/jenkins/jobs/UnleashedAPI/workspace/src/items/MobDrop.java:[39,41] cannot find symbol
  207. symbol: class Player
  208. location: class items.MobDrop
  209. [ERROR] /var/lib/jenkins/jobs/UnleashedAPI/workspace/src/items/MobDrop.java:[43,29] cannot find symbol
  210. symbol: class Location
  211. location: class items.MobDrop
  212. [ERROR] /var/lib/jenkins/jobs/UnleashedAPI/workspace/src/items/MobDrop.java:[43,41] cannot find symbol
  213. symbol: class Player
  214. location: class items.MobDrop
  215. [ERROR] /var/lib/jenkins/jobs/UnleashedAPI/workspace/src/items/MobDrop.java:[47,29] cannot find symbol
  216. symbol: class Location
  217. location: class items.MobDrop
  218. [ERROR] /var/lib/jenkins/jobs/UnleashedAPI/workspace/src/items/MobDrop.java:[47,41] cannot find symbol
  219. symbol: class Player
  220. location: class items.MobDrop
  221. [ERROR] /var/lib/jenkins/jobs/UnleashedAPI/workspace/src/items/MobDrop.java:[94,36] cannot find symbol
  222. symbol: class Location
  223. location: class items.MobDrop
  224. [ERROR] /var/lib/jenkins/jobs/UnleashedAPI/workspace/src/items/MobDrop.java:[94,48] cannot find symbol
  225. symbol: class Player
  226. location: class items.MobDrop
  227. [ERROR] /var/lib/jenkins/jobs/UnleashedAPI/workspace/src/items/MobDrop.java:[99,36] cannot find symbol
  228. symbol: class Location
  229. location: class items.MobDrop
  230. [INFO] 100 errors
  231. [INFO] -------------------------------------------------------------
  232. [INFO] ------------------------------------------------------------------------
  233. [INFO] BUILD FAILURE
  234. [INFO] ------------------------------------------------------------------------
  235. [INFO] Total time: 1.995 s
  236. [INFO] Finished at: 2016-05-15T00:41:24-04:00
  237. [INFO] Final Memory: 22M/412M
  238. [INFO] ------------------------------------------------------------------------
  239. [ERROR] Failed to execute goal org.apache.maven.plugins:maven-compiler-plugin:3.3:compile (default-compile) on project UnleashedAPI: Compilation failure: Compilation failure:
  240. [ERROR] /var/lib/jenkins/jobs/UnleashedAPI/workspace/src/items/EntireInventory.java:[5,25] package org.bukkit.entity does not exist
  241. [ERROR] /var/lib/jenkins/jobs/UnleashedAPI/workspace/src/items/EntireInventory.java:[6,28] package org.bukkit.inventory does not exist
  242. [ERROR] /var/lib/jenkins/jobs/UnleashedAPI/workspace/src/items/EntireInventory.java:[10,16] cannot find symbol
  243. [ERROR] symbol: class ItemStack
  244. [ERROR] location: class items.EntireInventory
  245. [ERROR] /var/lib/jenkins/jobs/UnleashedAPI/workspace/src/items/EntireInventory.java:[11,16] cannot find symbol
  246. [ERROR] symbol: class ItemStack
  247. [ERROR] location: class items.EntireInventory
  248. [ERROR] /var/lib/jenkins/jobs/UnleashedAPI/workspace/src/items/EntireInventory.java:[13,34] cannot find symbol
  249. [ERROR] symbol: class Player
  250. [ERROR] location: class items.EntireInventory
  251. [ERROR] /var/lib/jenkins/jobs/UnleashedAPI/workspace/src/items/EntireInventory.java:[18,32] cannot find symbol
  252. [ERROR] symbol: class ItemStack
  253. [ERROR] location: class items.EntireInventory
  254. [ERROR] /var/lib/jenkins/jobs/UnleashedAPI/workspace/src/items/EntireInventory.java:[18,52] cannot find symbol
  255. [ERROR] symbol: class ItemStack
  256. [ERROR] location: class items.EntireInventory
  257. [ERROR] /var/lib/jenkins/jobs/UnleashedAPI/workspace/src/items/EntireInventory.java:[23,47] cannot find symbol
  258. [ERROR] symbol: class Player
  259. [ERROR] location: class items.EntireInventory
  260. [ERROR] /var/lib/jenkins/jobs/UnleashedAPI/workspace/src/items/EntireInventory.java:[43,37] cannot find symbol
  261. [ERROR] symbol: class Player
  262. [ERROR] location: class items.EntireInventory
  263. [ERROR] /var/lib/jenkins/jobs/UnleashedAPI/workspace/src/cb/fanciful/TextualComponent.java:[8,46] package org.bukkit.configuration.serialization does not exist
  264. [ERROR] /var/lib/jenkins/jobs/UnleashedAPI/workspace/src/cb/fanciful/TextualComponent.java:[9,46] package org.bukkit.configuration.serialization does not exist
  265. [ERROR] /var/lib/jenkins/jobs/UnleashedAPI/workspace/src/cb/fanciful/TextualComponent.java:[11,30] package com.google.common.base does not exist
  266. [ERROR] /var/lib/jenkins/jobs/UnleashedAPI/workspace/src/cb/fanciful/TextualComponent.java:[12,33] package com.google.common.collect does not exist
  267. [ERROR] /var/lib/jenkins/jobs/UnleashedAPI/workspace/src/cb/fanciful/TextualComponent.java:[81,99] cannot find symbol
  268. [ERROR] symbol: class ConfigurationSerializable
  269. [ERROR] location: class cb.fanciful.TextualComponent
  270. [ERROR] /var/lib/jenkins/jobs/UnleashedAPI/workspace/src/cb/fanciful/TextualComponent.java:[143,97] cannot find symbol
  271. [ERROR] symbol: class ConfigurationSerializable
  272. [ERROR] location: class cb.fanciful.TextualComponent
  273. [ERROR] /var/lib/jenkins/jobs/UnleashedAPI/workspace/src/satchels/Satchels.java:[3,18] package org.bukkit does not exist
  274. [ERROR] /var/lib/jenkins/jobs/UnleashedAPI/workspace/src/satchels/Satchels.java:[4,31] package org.bukkit.enchantments does not exist
  275. [ERROR] /var/lib/jenkins/jobs/UnleashedAPI/workspace/src/satchels/Satchels.java:[5,28] package org.bukkit.inventory does not exist
  276. [ERROR] /var/lib/jenkins/jobs/UnleashedAPI/workspace/src/satchels/Satchels.java:[7,21] package ulmc.satchels does not exist
  277. [ERROR] /var/lib/jenkins/jobs/UnleashedAPI/workspace/src/satchels/Satchels.java:[10,23] cannot find symbol
  278. [ERROR] symbol: class ItemStack
  279. [ERROR] location: class satchels.Satchels
  280. [ERROR] /var/lib/jenkins/jobs/UnleashedAPI/workspace/src/satchels/Satchels.java:[20,23] cannot find symbol
  281. [ERROR] symbol: class ItemStack
  282. [ERROR] location: class satchels.Satchels
  283. [ERROR] /var/lib/jenkins/jobs/UnleashedAPI/workspace/src/satchels/Satchels.java:[30,23] cannot find symbol
  284. [ERROR] symbol: class ItemStack
  285. [ERROR] location: class satchels.Satchels
  286. [ERROR] /var/lib/jenkins/jobs/UnleashedAPI/workspace/src/satchels/Satchels.java:[40,23] cannot find symbol
  287. [ERROR] symbol: class ItemStack
  288. [ERROR] location: class satchels.Satchels
  289. [ERROR] /var/lib/jenkins/jobs/UnleashedAPI/workspace/src/satchels/Satchels.java:[50,23] cannot find symbol
  290. [ERROR] symbol: class ItemStack
  291. [ERROR] location: class satchels.Satchels
  292. [ERROR] /var/lib/jenkins/jobs/UnleashedAPI/workspace/src/satchels/Satchels.java:[60,23] cannot find symbol
  293. [ERROR] symbol: class ItemStack
  294. [ERROR] location: class satchels.Satchels
  295. [ERROR] /var/lib/jenkins/jobs/UnleashedAPI/workspace/src/util/ArrayWrapper.java:[7,31] package org.apache.commons.lang does not exist
  296. [ERROR] /var/lib/jenkins/jobs/UnleashedAPI/workspace/src/util/PlayerUtil.java:[11,18] package org.bukkit does not exist
  297. [ERROR] /var/lib/jenkins/jobs/UnleashedAPI/workspace/src/util/PlayerUtil.java:[12,25] package org.bukkit.entity does not exist
  298. [ERROR] /var/lib/jenkins/jobs/UnleashedAPI/workspace/src/util/PlayerUtil.java:[13,25] package org.bukkit.plugin does not exist
  299. [ERROR] /var/lib/jenkins/jobs/UnleashedAPI/workspace/src/util/PlayerUtil.java:[26,38] cannot find symbol
  300. [ERROR] symbol: class Player
  301. [ERROR] location: class util.PlayerUtil
  302. [ERROR] /var/lib/jenkins/jobs/UnleashedAPI/workspace/src/util/PlayerUtil.java:[37,37] cannot find symbol
  303. [ERROR] symbol: class Player
  304. [ERROR] location: class util.PlayerUtil
  305. [ERROR] /var/lib/jenkins/jobs/UnleashedAPI/workspace/src/util/PlayerUtil.java:[60,53] cannot find symbol
  306. [ERROR] symbol: class Location
  307. [ERROR] location: class util.PlayerUtil
  308. [ERROR] /var/lib/jenkins/jobs/UnleashedAPI/workspace/src/util/PlayerUtil.java:[84,41] cannot find symbol
  309. [ERROR] symbol: class Player
  310. [ERROR] location: class util.PlayerUtil
  311. [ERROR] /var/lib/jenkins/jobs/UnleashedAPI/workspace/src/util/PlayerUtil.java:[91,41] cannot find symbol
  312. [ERROR] symbol: class Player
  313. [ERROR] location: class util.PlayerUtil
  314. [ERROR] /var/lib/jenkins/jobs/UnleashedAPI/workspace/src/util/PlayerUtil.java:[95,40] cannot find symbol
  315. [ERROR] symbol: class Location
  316. [ERROR] location: class util.PlayerUtil
  317. [ERROR] /var/lib/jenkins/jobs/UnleashedAPI/workspace/src/util/PlayerUtil.java:[102,42] cannot find symbol
  318. [ERROR] symbol: class Player
  319. [ERROR] location: class util.PlayerUtil
  320. [ERROR] /var/lib/jenkins/jobs/UnleashedAPI/workspace/src/util/PlayerUtil.java:[110,41] cannot find symbol
  321. [ERROR] symbol: class Player
  322. [ERROR] location: class util.PlayerUtil
  323. [ERROR] /var/lib/jenkins/jobs/UnleashedAPI/workspace/src/players/PlayerDeath.java:[3,18] package org.bukkit does not exist
  324. [ERROR] /var/lib/jenkins/jobs/UnleashedAPI/workspace/src/players/PlayerDeath.java:[4,18] package org.bukkit does not exist
  325. [ERROR] /var/lib/jenkins/jobs/UnleashedAPI/workspace/src/players/PlayerDeath.java:[5,18] package org.bukkit does not exist
  326. [ERROR] /var/lib/jenkins/jobs/UnleashedAPI/workspace/src/players/PlayerDeath.java:[6,25] package org.bukkit.entity does not exist
  327. [ERROR] /var/lib/jenkins/jobs/UnleashedAPI/workspace/src/players/PlayerDeath.java:[7,24] package org.bukkit.event does not exist
  328. [ERROR] /var/lib/jenkins/jobs/UnleashedAPI/workspace/src/players/PlayerDeath.java:[8,24] package org.bukkit.event does not exist
  329. [ERROR] /var/lib/jenkins/jobs/UnleashedAPI/workspace/src/players/PlayerDeath.java:[9,31] package org.bukkit.event.entity does not exist
  330. [ERROR] /var/lib/jenkins/jobs/UnleashedAPI/workspace/src/players/PlayerDeath.java:[10,31] package org.bukkit.event.entity does not exist
  331. [ERROR] /var/lib/jenkins/jobs/UnleashedAPI/workspace/src/players/PlayerDeath.java:[11,28] package org.bukkit.inventory does not exist
  332. [ERROR] /var/lib/jenkins/jobs/UnleashedAPI/workspace/src/players/PlayerDeath.java:[12,33] package org.bukkit.inventory.meta does not exist
  333. [ERROR] /var/lib/jenkins/jobs/UnleashedAPI/workspace/src/players/PlayerDeath.java:[14,37] cannot find symbol
  334. [ERROR] symbol: class Listener
  335. [ERROR] /var/lib/jenkins/jobs/UnleashedAPI/workspace/src/players/PlayerDeath.java:[16,27] cannot find symbol
  336. [ERROR] symbol: class PlayerDeathEvent
  337. [ERROR] location: class players.PlayerDeath
  338. [ERROR] /var/lib/jenkins/jobs/UnleashedAPI/workspace/src/cb/fanciful/FancyMessage.java:[25,18] package org.bukkit does not exist
  339. [ERROR] /var/lib/jenkins/jobs/UnleashedAPI/workspace/src/cb/fanciful/FancyMessage.java:[26,18] package org.bukkit does not exist
  340. [ERROR] /var/lib/jenkins/jobs/UnleashedAPI/workspace/src/cb/fanciful/FancyMessage.java:[27,18] package org.bukkit does not exist
  341. [ERROR] /var/lib/jenkins/jobs/UnleashedAPI/workspace/src/cb/fanciful/FancyMessage.java:[28,18] package org.bukkit does not exist
  342. [ERROR] /var/lib/jenkins/jobs/UnleashedAPI/workspace/src/cb/fanciful/FancyMessage.java:[29,18] package org.bukkit does not exist
  343. [ERROR] /var/lib/jenkins/jobs/UnleashedAPI/workspace/src/cb/fanciful/FancyMessage.java:[30,28] package org.bukkit.Statistic does not exist
  344. [ERROR] /var/lib/jenkins/jobs/UnleashedAPI/workspace/src/cb/fanciful/FancyMessage.java:[31,26] package org.bukkit.command does not exist
  345. [ERROR] /var/lib/jenkins/jobs/UnleashedAPI/workspace/src/cb/fanciful/FancyMessage.java:[32,46] package org.bukkit.configuration.serialization does not exist
  346. [ERROR] /var/lib/jenkins/jobs/UnleashedAPI/workspace/src/cb/fanciful/FancyMessage.java:[33,46] package org.bukkit.configuration.serialization does not exist
  347. [ERROR] /var/lib/jenkins/jobs/UnleashedAPI/workspace/src/cb/fanciful/FancyMessage.java:[34,25] package org.bukkit.entity does not exist
  348. [ERROR] /var/lib/jenkins/jobs/UnleashedAPI/workspace/src/cb/fanciful/FancyMessage.java:[36,28] package org.bukkit.inventory does not exist
  349. [ERROR] /var/lib/jenkins/jobs/UnleashedAPI/workspace/src/cb/fanciful/MessagePart.java:[8,18] package org.bukkit does not exist
  350. [ERROR] /var/lib/jenkins/jobs/UnleashedAPI/workspace/src/cb/fanciful/MessagePart.java:[9,46] package org.bukkit.configuration.serialization does not exist
  351. [ERROR] /var/lib/jenkins/jobs/UnleashedAPI/workspace/src/cb/fanciful/MessagePart.java:[10,46] package org.bukkit.configuration.serialization does not exist
  352. [ERROR] /var/lib/jenkins/jobs/UnleashedAPI/workspace/src/cb/fanciful/MessagePart.java:[12,33] package com.google.common.collect does not exist
  353. [ERROR] /var/lib/jenkins/jobs/UnleashedAPI/workspace/src/cb/fanciful/MessagePart.java:[13,33] package com.google.common.collect does not exist
  354. [ERROR] /var/lib/jenkins/jobs/UnleashedAPI/workspace/src/cb/fanciful/MessagePart.java:[16,18] package org.bukkit does not exist
  355. [ERROR] /var/lib/jenkins/jobs/UnleashedAPI/workspace/src/cb/fanciful/MessagePart.java:[21,59] cannot find symbol
  356. [ERROR] symbol: class ConfigurationSerializable
  357. [ERROR] /var/lib/jenkins/jobs/UnleashedAPI/workspace/src/cb/fanciful/FancyMessage.java:[51,95] cannot find symbol
  358. [ERROR] symbol: class ConfigurationSerializable
  359. [ERROR] /var/lib/jenkins/jobs/UnleashedAPI/workspace/src/cb/fanciful/FancyMessage.java:[138,41] cannot find symbol
  360. [ERROR] symbol: class ChatColor
  361. [ERROR] location: class cb.fanciful.FancyMessage
  362. [ERROR] /var/lib/jenkins/jobs/UnleashedAPI/workspace/src/cb/fanciful/FancyMessage.java:[153,35] cannot find symbol
  363. [ERROR] symbol: class ChatColor
  364. [ERROR] location: class cb.fanciful.FancyMessage
  365. [ERROR] /var/lib/jenkins/jobs/UnleashedAPI/workspace/src/cb/fanciful/FancyMessage.java:[235,54] cannot find symbol
  366. [ERROR] symbol: class Achievement
  367. [ERROR] location: class cb.fanciful.FancyMessage
  368. [ERROR] /var/lib/jenkins/jobs/UnleashedAPI/workspace/src/cb/fanciful/FancyMessage.java:[258,52] cannot find symbol
  369. [ERROR] symbol: class Statistic
  370. [ERROR] location: class cb.fanciful.FancyMessage
  371. [ERROR] /var/lib/jenkins/jobs/UnleashedAPI/workspace/src/cb/fanciful/FancyMessage.java:[286,52] cannot find symbol
  372. [ERROR] symbol: class Statistic
  373. [ERROR] location: class cb.fanciful.FancyMessage
  374. [ERROR] /var/lib/jenkins/jobs/UnleashedAPI/workspace/src/cb/fanciful/FancyMessage.java:[286,69] cannot find symbol
  375. [ERROR] symbol: class Material
  376. [ERROR] location: class cb.fanciful.FancyMessage
  377. [ERROR] /var/lib/jenkins/jobs/UnleashedAPI/workspace/src/cb/fanciful/FancyMessage.java:[317,52] cannot find symbol
  378. [ERROR] symbol: class Statistic
  379. [ERROR] location: class cb.fanciful.FancyMessage
  380. [ERROR] /var/lib/jenkins/jobs/UnleashedAPI/workspace/src/cb/fanciful/FancyMessage.java:[317,69] cannot find symbol
  381. [ERROR] symbol: class EntityType
  382. [ERROR] location: class cb.fanciful.FancyMessage
  383. [ERROR] /var/lib/jenkins/jobs/UnleashedAPI/workspace/src/cb/fanciful/FancyMessage.java:[357,47] cannot find symbol
  384. [ERROR] symbol: class ItemStack
  385. [ERROR] location: class cb.fanciful.FancyMessage
  386. [ERROR] /var/lib/jenkins/jobs/UnleashedAPI/workspace/src/cb/fanciful/FancyMessage.java:[606,26] cannot find symbol
  387. [ERROR] symbol: class Player
  388. [ERROR] location: class cb.fanciful.FancyMessage
  389. [ERROR] /var/lib/jenkins/jobs/UnleashedAPI/workspace/src/cb/fanciful/FancyMessage.java:[610,27] cannot find symbol
  390. [ERROR] symbol: class CommandSender
  391. [ERROR] location: class cb.fanciful.FancyMessage
  392. [ERROR] /var/lib/jenkins/jobs/UnleashedAPI/workspace/src/cb/fanciful/FancyMessage.java:[683,26] cannot find symbol
  393. [ERROR] symbol: class CommandSender
  394. [ERROR] location: class cb.fanciful.FancyMessage
  395. [ERROR] /var/lib/jenkins/jobs/UnleashedAPI/workspace/src/cb/fanciful/FancyMessage.java:[692,51] cannot find symbol
  396. [ERROR] symbol: class CommandSender
  397. [ERROR] location: class cb.fanciful.FancyMessage
  398. [ERROR] /var/lib/jenkins/jobs/UnleashedAPI/workspace/src/cb/fanciful/MessagePart.java:[23,9] cannot find symbol
  399. [ERROR] symbol: class ChatColor
  400. [ERROR] location: class cb.fanciful.MessagePart
  401. [ERROR] /var/lib/jenkins/jobs/UnleashedAPI/workspace/src/cb/fanciful/MessagePart.java:[24,19] cannot find symbol
  402. [ERROR] symbol: class ChatColor
  403. [ERROR] location: class cb.fanciful.MessagePart
  404. [ERROR] /var/lib/jenkins/jobs/UnleashedAPI/workspace/src/cb/fanciful/MessagePart.java:[59,22] cannot find symbol
  405. [ERROR] symbol: class BiMap
  406. [ERROR] location: class cb.fanciful.MessagePart
  407. [ERROR] /var/lib/jenkins/jobs/UnleashedAPI/workspace/src/cb/fanciful/MessagePart.java:[59,28] cannot find symbol
  408. [ERROR] symbol: class ChatColor
  409. [ERROR] location: class cb.fanciful.MessagePart
  410. [ERROR] /var/lib/jenkins/jobs/UnleashedAPI/workspace/src/util/Reflection.java:[9,18] package org.bukkit does not exist
  411. [ERROR] /var/lib/jenkins/jobs/UnleashedAPI/workspace/src/items/MobDrop.java:[7,18] package org.bukkit does not exist
  412. [ERROR] /var/lib/jenkins/jobs/UnleashedAPI/workspace/src/items/MobDrop.java:[8,18] package org.bukkit does not exist
  413. [ERROR] /var/lib/jenkins/jobs/UnleashedAPI/workspace/src/items/MobDrop.java:[9,24] package org.bukkit.block does not exist
  414. [ERROR] /var/lib/jenkins/jobs/UnleashedAPI/workspace/src/items/MobDrop.java:[34,29] cannot find symbol
  415. [ERROR] symbol: class Location
  416. [ERROR] location: class items.MobDrop
  417. [ERROR] /var/lib/jenkins/jobs/UnleashedAPI/workspace/src/items/MobDrop.java:[34,41] cannot find symbol
  418. [ERROR] symbol: class Player
  419. [ERROR] location: class items.MobDrop
  420. [ERROR] /var/lib/jenkins/jobs/UnleashedAPI/workspace/src/items/MobDrop.java:[39,29] cannot find symbol
  421. [ERROR] symbol: class Location
  422. [ERROR] location: class items.MobDrop
  423. [ERROR] /var/lib/jenkins/jobs/UnleashedAPI/workspace/src/items/MobDrop.java:[39,41] cannot find symbol
  424. [ERROR] symbol: class Player
  425. [ERROR] location: class items.MobDrop
  426. [ERROR] /var/lib/jenkins/jobs/UnleashedAPI/workspace/src/items/MobDrop.java:[43,29] cannot find symbol
  427. [ERROR] symbol: class Location
  428. [ERROR] location: class items.MobDrop
  429. [ERROR] /var/lib/jenkins/jobs/UnleashedAPI/workspace/src/items/MobDrop.java:[43,41] cannot find symbol
  430. [ERROR] symbol: class Player
  431. [ERROR] location: class items.MobDrop
  432. [ERROR] /var/lib/jenkins/jobs/UnleashedAPI/workspace/src/items/MobDrop.java:[47,29] cannot find symbol
  433. [ERROR] symbol: class Location
  434. [ERROR] location: class items.MobDrop
  435. [ERROR] /var/lib/jenkins/jobs/UnleashedAPI/workspace/src/items/MobDrop.java:[47,41] cannot find symbol
  436. [ERROR] symbol: class Player
  437. [ERROR] location: class items.MobDrop
  438. [ERROR] /var/lib/jenkins/jobs/UnleashedAPI/workspace/src/items/MobDrop.java:[94,36] cannot find symbol
  439. [ERROR] symbol: class Location
  440. [ERROR] location: class items.MobDrop
  441. [ERROR] /var/lib/jenkins/jobs/UnleashedAPI/workspace/src/items/MobDrop.java:[94,48] cannot find symbol
  442. [ERROR] symbol: class Player
  443. [ERROR] location: class items.MobDrop
  444. [ERROR] /var/lib/jenkins/jobs/UnleashedAPI/workspace/src/items/MobDrop.java:[99,36] cannot find symbol
  445. [ERROR] symbol: class Location
  446. [ERROR] location: class items.MobDrop
  447. [ERROR] -> [Help 1]
  448. [ERROR]
  449. [ERROR] To see the full stack trace of the errors, re-run Maven with the -e switch.
  450. [ERROR] Re-run Maven using the -X switch to enable full debug logging.
  451. [ERROR]
  452. [ERROR] For more information about the errors and possible solutions, please read the following articles:
  453. [ERROR] [Help 1] http://cwiki.apache.org/confluence/display/MAVEN/MojoFailureException
  454. [JENKINS] Archiving /var/lib/jenkins/jobs/UnleashedAPI/workspace/pom.xml to UnleashedAPI/UnleashedAPI/1.0/UnleashedAPI-1.0.pom
  455. Archiving artifacts
  456. Finished: FAILURE
RAW Paste Data