Advertisement
Guest User

Installation using pybombs

a guest
Dec 4th, 2013
233
Never
Not a member of Pastebin yet? Sign Up, it unlocks many cool features!
  1. home/sandhya/pybombs/uhd/host/lib/convert/convert_fc32_item32.cpp: In member function ‘void convert_star_1_to_fc32_item32_1<type, towire>::operator()(const input_type&, const output_type&, size_t) [with type = double, uint32_t (* towire)(unsigned int) = uhd::ntohx [with T = unsigned int], uhd::convert::converter::input_type = uhd::ref_vector<const void*>, uhd::convert::converter::output_type = uhd::ref_vector<void*>, size_t = unsigned int]’:
  2. /home/sandhya/pybombs/uhd/host/lib/convert/convert_fc32_item32.cpp:113:1: instantiated from here
  3. /home/sandhya/pybombs/uhd/host/lib/convert/convert_fc32_item32.cpp:83:82: warning: dereferencing type-punned pointer will break strict-aliasing rules [-Wstrict-aliasing]
  4. /home/sandhya/pybombs/uhd/host/lib/convert/convert_fc32_item32.cpp:84:82: warning: dereferencing type-punned pointer will break strict-aliasing rules [-Wstrict-aliasing]
  5. /home/sandhya/pybombs/uhd/host/lib/convert/convert_fc32_item32.cpp: In member function ‘void convert_star_1_to_fc32_item32_1<type, towire>::operator()(const input_type&, const output_type&, size_t) [with type = double, uint32_t (* towire)(unsigned int) = uhd::wtohx [with T = unsigned int], uhd::convert::converter::input_type = uhd::ref_vector<const void*>, uhd::convert::converter::output_type = uhd::ref_vector<void*>, size_t = unsigned int]’:
  6. /home/sandhya/pybombs/uhd/host/lib/convert/convert_fc32_item32.cpp:113:1: instantiated from here
  7. /home/sandhya/pybombs/uhd/host/lib/convert/convert_fc32_item32.cpp:83:82: warning: dereferencing type-punned pointer will break strict-aliasing rules [-Wstrict-aliasing]
  8. /home/sandhya/pybombs/uhd/host/lib/convert/convert_fc32_item32.cpp:84:82: warning: dereferencing type-punned pointer will break strict-aliasing rules [-Wstrict-aliasing]
  9. /home/sandhya/pybombs/uhd/host/lib/convert/convert_fc32_item32.cpp: In member function ‘void convert_star_1_to_fc32_item32_1<type, towire>::operator()(const input_type&, const output_type&, size_t) [with type = float, uint32_t (* towire)(unsigned int) = uhd::ntohx [with T = unsigned int], uhd::convert::converter::input_type = uhd::ref_vector<const void*>, uhd::convert::converter::output_type = uhd::ref_vector<void*>, size_t = unsigned int]’:
  10. /home/sandhya/pybombs/uhd/host/lib/convert/convert_fc32_item32.cpp:113:1: instantiated from here
  11. /home/sandhya/pybombs/uhd/host/lib/convert/convert_fc32_item32.cpp:83:82: warning: dereferencing type-punned pointer will break strict-aliasing rules [-Wstrict-aliasing]
  12. /home/sandhya/pybombs/uhd/host/lib/convert/convert_fc32_item32.cpp:84:82: warning: dereferencing type-punned pointer will break strict-aliasing rules [-Wstrict-aliasing]
  13. /home/sandhya/pybombs/uhd/host/lib/convert/convert_fc32_item32.cpp: In member function ‘void convert_star_1_to_fc32_item32_1<type, towire>::operator()(const input_type&, const output_type&, size_t) [with type = float, uint32_t (* towire)(unsigned int) = uhd::wtohx [with T = unsigned int], uhd::convert::converter::input_type = uhd::ref_vector<const void*>, uhd::convert::converter::output_type = uhd::ref_vector<void*>, size_t = unsigned int]’:
  14. /home/sandhya/pybombs/uhd/host/lib/convert/convert_fc32_item32.cpp:113:1: instantiated from here
  15. /home/sandhya/pybombs/uhd/host/lib/convert/convert_fc32_item32.cpp:83:82: warning: dereferencing type-punned pointer will break strict-aliasing rules [-Wstrict-aliasing]
  16. /home/sandhya/pybombs/uhd/host/lib/convert/convert_fc32_item32.cpp:84:82: warning: dereferencing type-punned pointer will break strict-aliasing rules [-Wstrict-aliasing]
  17. /home/sandhya/pybombs/uhd/host/lib/convert/convert_fc32_item32.cpp: In member function ‘void convert_fc32_item32_1_to_star_1<type, tohost>::operator()(const input_type&, const output_type&, size_t) [with type = double, uint32_t (* tohost)(unsigned int) = uhd::ntohx [with T = unsigned int], uhd::convert::converter::input_type = uhd::ref_vector<const void*>, uhd::convert::converter::output_type = uhd::ref_vector<void*>, size_t = unsigned int]’:
  18. /home/sandhya/pybombs/uhd/host/lib/convert/convert_fc32_item32.cpp:113:1: instantiated from here
  19. /home/sandhya/pybombs/uhd/host/lib/convert/convert_fc32_item32.cpp:51:68: warning: dereferencing type-punned pointer will break strict-aliasing rules [-Wstrict-aliasing]
  20. /home/sandhya/pybombs/uhd/host/lib/convert/convert_fc32_item32.cpp:52:68: warning: dereferencing type-punned pointer will break strict-aliasing rules [-Wstrict-aliasing]
  21. /home/sandhya/pybombs/uhd/host/lib/convert/convert_fc32_item32.cpp: In member function ‘void convert_fc32_item32_1_to_star_1<type, tohost>::operator()(const input_type&, const output_type&, size_t) [with type = double, uint32_t (* tohost)(unsigned int) = uhd::wtohx [with T = unsigned int], uhd::convert::converter::input_type = uhd::ref_vector<const void*>, uhd::convert::converter::output_type = uhd::ref_vector<void*>, size_t = unsigned int]’:
  22. /home/sandhya/pybombs/uhd/host/lib/convert/convert_fc32_item32.cpp:113:1: instantiated from here
  23. /home/sandhya/pybombs/uhd/host/lib/convert/convert_fc32_item32.cpp:51:68: warning: dereferencing type-punned pointer will break strict-aliasing rules [-Wstrict-aliasing]
  24. /home/sandhya/pybombs/uhd/host/lib/convert/convert_fc32_item32.cpp:52:68: warning: dereferencing type-punned pointer will break strict-aliasing rules [-Wstrict-aliasing]
  25. /home/sandhya/pybombs/uhd/host/lib/convert/convert_fc32_item32.cpp: In member function ‘void convert_fc32_item32_1_to_star_1<type, tohost>::operator()(const input_type&, const output_type&, size_t) [with type = float, uint32_t (* tohost)(unsigned int) = uhd::ntohx [with T = unsigned int], uhd::convert::converter::input_type = uhd::ref_vector<const void*>, uhd::convert::converter::output_type = uhd::ref_vector<void*>, size_t = unsigned int]’:
  26. /home/sandhya/pybombs/uhd/host/lib/convert/convert_fc32_item32.cpp:113:1: instantiated from here
  27. /home/sandhya/pybombs/uhd/host/lib/convert/convert_fc32_item32.cpp:51:68: warning: dereferencing type-punned pointer will break strict-aliasing rules [-Wstrict-aliasing]
  28. /home/sandhya/pybombs/uhd/host/lib/convert/convert_fc32_item32.cpp:52:68: warning: dereferencing type-punned pointer will break strict-aliasing rules [-Wstrict-aliasing]
  29. /home/sandhya/pybombs/uhd/host/lib/convert/convert_fc32_item32.cpp: In member function ‘void convert_fc32_item32_1_to_star_1<type, tohost>::operator()(const input_type&, const output_type&, size_t) [with type = float, uint32_t (* tohost)(unsigned int) = uhd::wtohx [with T = unsigned int], uhd::convert::converter::input_type = uhd::ref_vector<const void*>, uhd::convert::converter::output_type = uhd::ref_vector<void*>, size_t = unsigned int]’:
  30. /home/sandhya/pybombs/uhd/host/lib/convert/convert_fc32_item32.cpp:113:1: instantiated from here
  31. /home/sandhya/pybombs/uhd/host/lib/convert/convert_fc32_item32.cpp:51:68: warning: dereferencing type-punned pointer will break strict-aliasing rules [-Wstrict-aliasing]
  32. /home/sandhya/pybombs/uhd/host/lib/convert/convert_fc32_item32.cpp:52:68: warning: dereferencing type-punned pointer will break strict-aliasing rules [-Wstrict-aliasing]
  33. [ 32%] Building CXX object lib/CMakeFiles/uhd.dir/transport/libusb1_control.cpp.o
  34. [ 32%] Building CXX object lib/CMakeFiles/uhd.dir/transport/libusb1_zero_copy.cpp.o
  35. [ 32%] Building CXX object lib/CMakeFiles/uhd.dir/transport/libusb1_base.cpp.o
  36. [ 33%] Building CXX object lib/CMakeFiles/uhd.dir/transport/udp_zero_copy.cpp.o
  37. [ 33%] Building CXX object lib/CMakeFiles/uhd.dir/transport/vrt_if_packet.cpp.o
  38. [ 34%] Building CXX object lib/CMakeFiles/uhd.dir/transport/buffer_pool.cpp.o
  39. [ 34%] Building CXX object lib/CMakeFiles/uhd.dir/transport/if_addrs.cpp.o
  40. [ 35%] Building CXX object lib/CMakeFiles/uhd.dir/transport/udp_simple.cpp.o
  41. [ 35%] Building CXX object lib/CMakeFiles/uhd.dir/usrp/dboard_base.cpp.o
  42. [ 36%] Building CXX object lib/CMakeFiles/uhd.dir/usrp/dboard_eeprom.cpp.o
  43. [ 36%] Building CXX object lib/CMakeFiles/uhd.dir/usrp/dboard_id.cpp.o
  44. [ 37%] Building CXX object lib/CMakeFiles/uhd.dir/usrp/dboard_iface.cpp.o
  45. [ 37%] Building CXX object lib/CMakeFiles/uhd.dir/usrp/dboard_manager.cpp.o
  46. [ 37%] Building CXX object lib/CMakeFiles/uhd.dir/usrp/gps_ctrl.cpp.o
  47. [ 38%] Building CXX object lib/CMakeFiles/uhd.dir/usrp/mboard_eeprom.cpp.o
  48. [ 38%] Building CXX object lib/CMakeFiles/uhd.dir/usrp/multi_usrp.cpp.o
  49. [ 39%] Building CXX object lib/CMakeFiles/uhd.dir/usrp/subdev_spec.cpp.o
  50. [ 39%] Building CXX object lib/CMakeFiles/uhd.dir/usrp/cores/gpio_core_200.cpp.o
  51. [ 40%] Building CXX object lib/CMakeFiles/uhd.dir/usrp/cores/i2c_core_100.cpp.o
  52. [ 40%] Building CXX object lib/CMakeFiles/uhd.dir/usrp/cores/i2c_core_200.cpp.o
  53. [ 41%] Building CXX object lib/CMakeFiles/uhd.dir/usrp/cores/spi_core_100.cpp.o
  54. [ 41%] Building CXX object lib/CMakeFiles/uhd.dir/usrp/cores/time64_core_200.cpp.o
  55. [ 42%] Building CXX object lib/CMakeFiles/uhd.dir/usrp/cores/rx_dsp_core_200.cpp.o
  56. [ 42%] Building CXX object lib/CMakeFiles/uhd.dir/usrp/cores/tx_dsp_core_200.cpp.o
  57. [ 42%] Building CXX object lib/CMakeFiles/uhd.dir/usrp/cores/rx_frontend_core_200.cpp.o
  58. [ 43%] Building CXX object lib/CMakeFiles/uhd.dir/usrp/cores/tx_frontend_core_200.cpp.o
  59. [ 43%] Building CXX object lib/CMakeFiles/uhd.dir/usrp/cores/user_settings_core_200.cpp.o
  60. [ 44%] Building CXX object lib/CMakeFiles/uhd.dir/usrp/cores/rx_vita_core_3000.cpp.o
  61. [ 44%] Building CXX object lib/CMakeFiles/uhd.dir/usrp/cores/tx_vita_core_3000.cpp.o
  62. [ 45%] Building CXX object lib/CMakeFiles/uhd.dir/usrp/cores/time_core_3000.cpp.o
  63. [ 45%] Building CXX object lib/CMakeFiles/uhd.dir/usrp/cores/spi_core_3000.cpp.o
  64. [ 46%] Building CXX object lib/CMakeFiles/uhd.dir/usrp/cores/i2c_core_100_wb32.cpp.o
  65. [ 46%] Building CXX object lib/CMakeFiles/uhd.dir/usrp/cores/rx_dsp_core_3000.cpp.o
  66. [ 47%] Building CXX object lib/CMakeFiles/uhd.dir/usrp/cores/tx_dsp_core_3000.cpp.o
  67. [ 47%] Building CXX object lib/CMakeFiles/uhd.dir/usrp/cores/radio_ctrl_core_3000.cpp.o
  68. [ 47%] Building CXX object lib/CMakeFiles/uhd.dir/usrp/dboard/db_basic_and_lf.cpp.o
  69. [ 48%] Building CXX object lib/CMakeFiles/uhd.dir/usrp/dboard/db_rfx.cpp.o
  70. [ 48%] Building CXX object lib/CMakeFiles/uhd.dir/usrp/dboard/db_xcvr2450.cpp.o
  71. [ 49%] Building CXX object lib/CMakeFiles/uhd.dir/usrp/dboard/db_sbx_common.cpp.o
  72. [ 49%] Building CXX object lib/CMakeFiles/uhd.dir/usrp/dboard/db_sbx_version3.cpp.o
  73. [ 50%] Building CXX object lib/CMakeFiles/uhd.dir/usrp/dboard/db_sbx_version4.cpp.o
  74. [ 50%] Building CXX object lib/CMakeFiles/uhd.dir/usrp/dboard/db_cbx.cpp.o
  75. [ 51%] Building CXX object lib/CMakeFiles/uhd.dir/usrp/dboard/db_wbx_common.cpp.o
  76. [ 51%] Building CXX object lib/CMakeFiles/uhd.dir/usrp/dboard/db_wbx_version2.cpp.o
  77. [ 52%] Building CXX object lib/CMakeFiles/uhd.dir/usrp/dboard/db_wbx_version3.cpp.o
  78. [ 52%] Building CXX object lib/CMakeFiles/uhd.dir/usrp/dboard/db_wbx_version4.cpp.o
  79. [ 52%] Building CXX object lib/CMakeFiles/uhd.dir/usrp/dboard/db_wbx_simple.cpp.o
  80. [ 53%] Building CXX object lib/CMakeFiles/uhd.dir/usrp/dboard/db_dbsrx.cpp.o
  81. [ 53%] Building CXX object lib/CMakeFiles/uhd.dir/usrp/dboard/db_unknown.cpp.o
  82. [ 54%] Building CXX object lib/CMakeFiles/uhd.dir/usrp/dboard/db_tvrx.cpp.o
  83. [ 54%] Building CXX object lib/CMakeFiles/uhd.dir/usrp/dboard/db_dbsrx2.cpp.o
  84. [ 55%] Building CXX object lib/CMakeFiles/uhd.dir/usrp/dboard/db_tvrx2.cpp.o
  85. [ 55%] Building CXX object lib/CMakeFiles/uhd.dir/usrp/common/fx2_ctrl.cpp.o
  86. [ 56%] Building CXX object lib/CMakeFiles/uhd.dir/usrp/common/adf4001_ctrl.cpp.o
  87. [ 56%] Building CXX object lib/CMakeFiles/uhd.dir/usrp/common/ad9361_ctrl.cpp.o
  88. [ 57%] Building CXX object lib/CMakeFiles/uhd.dir/usrp/common/apply_corrections.cpp.o
  89. [ 57%] Building CXX object lib/CMakeFiles/uhd.dir/usrp/common/validate_subdev_spec.cpp.o
  90. [ 57%] Building CXX object lib/CMakeFiles/uhd.dir/usrp/common/recv_packet_demuxer.cpp.o
  91. [ 58%] Building CXX object lib/CMakeFiles/uhd.dir/usrp/common/fifo_ctrl_excelsior.cpp.o
  92. [ 58%] Building CXX object lib/CMakeFiles/uhd.dir/usrp/usrp1/codec_ctrl.cpp.o
  93. [ 59%] Building CXX object lib/CMakeFiles/uhd.dir/usrp/usrp1/dboard_iface.cpp.o
  94. [ 59%] Building CXX object lib/CMakeFiles/uhd.dir/usrp/usrp1/io_impl.cpp.o
  95. [ 60%] Building CXX object lib/CMakeFiles/uhd.dir/usrp/usrp1/soft_time_ctrl.cpp.o
  96. [ 60%] Building CXX object lib/CMakeFiles/uhd.dir/usrp/usrp1/usrp1_iface.cpp.o
  97. [ 61%] Building CXX object lib/CMakeFiles/uhd.dir/usrp/usrp1/usrp1_impl.cpp.o
  98. [ 61%] Building CXX object lib/CMakeFiles/uhd.dir/usrp/usrp2/clock_ctrl.cpp.o
  99. [ 62%] Building CXX object lib/CMakeFiles/uhd.dir/usrp/usrp2/codec_ctrl.cpp.o
  100. [ 62%] Building CXX object lib/CMakeFiles/uhd.dir/usrp/usrp2/dboard_iface.cpp.o
  101. [ 62%] Building CXX object lib/CMakeFiles/uhd.dir/usrp/usrp2/io_impl.cpp.o
  102. [ 63%] Building CXX object lib/CMakeFiles/uhd.dir/usrp/usrp2/usrp2_iface.cpp.o
  103. [ 63%] Building CXX object lib/CMakeFiles/uhd.dir/usrp/usrp2/usrp2_impl.cpp.o
  104. [ 64%] Building CXX object lib/CMakeFiles/uhd.dir/usrp/usrp2/usrp2_fifo_ctrl.cpp.o
  105. [ 64%] Building CXX object lib/CMakeFiles/uhd.dir/usrp/b100/b100_impl.cpp.o
  106. [ 65%] Building CXX object lib/CMakeFiles/uhd.dir/usrp/b100/clock_ctrl.cpp.o
  107. [ 65%] Building CXX object lib/CMakeFiles/uhd.dir/usrp/b100/codec_ctrl.cpp.o
  108. [ 66%] Building CXX object lib/CMakeFiles/uhd.dir/usrp/b100/dboard_iface.cpp.o
  109. [ 66%] Building CXX object lib/CMakeFiles/uhd.dir/usrp/b100/io_impl.cpp.o
  110. [ 67%] Building CXX object lib/CMakeFiles/uhd.dir/usrp/b100/usb_zero_copy_wrapper.cpp.o
  111. [ 67%] Building CXX object lib/CMakeFiles/uhd.dir/usrp/e100/clock_ctrl.cpp.o
  112. [ 67%] Building CXX object lib/CMakeFiles/uhd.dir/usrp/e100/codec_ctrl.cpp.o
  113. [ 68%] Building CXX object lib/CMakeFiles/uhd.dir/usrp/e100/dboard_iface.cpp.o
  114. [ 68%] Building CXX object lib/CMakeFiles/uhd.dir/usrp/e100/e100_ctrl.cpp.o
  115. /home/sandhya/pybombs/uhd/host/lib/usrp/e100/e100_ctrl.cpp: In member function ‘bool e100_ctrl_impl::resp_read()’:
  116. /home/sandhya/pybombs/uhd/host/lib/usrp/e100/e100_ctrl.cpp:379:41: warning: ignoring return value of ‘ssize_t read(int, void*, size_t)’, declared with attribute warn_unused_result [-Wunused-result]
  117. [ 69%] Building CXX object lib/CMakeFiles/uhd.dir/usrp/e100/e100_impl.cpp.o
  118. [ 69%] Building CXX object lib/CMakeFiles/uhd.dir/usrp/e100/e100_mmap_zero_copy.cpp.o
  119. [ 70%] Building CXX object lib/CMakeFiles/uhd.dir/usrp/e100/fpga_downloader.cpp.o
  120. /home/sandhya/pybombs/uhd/host/lib/usrp/e100/fpga_downloader.cpp: In constructor ‘usrp_e_fpga_downloader_utility::spidev::spidev(std::string)’:
  121. /home/sandhya/pybombs/uhd/host/lib/usrp/e100/fpga_downloader.cpp:186:6: warning: variable ‘ret’ set but not used [-Wunused-but-set-variable]
  122. /home/sandhya/pybombs/uhd/host/lib/usrp/e100/fpga_downloader.cpp: In member function ‘void usrp_e_fpga_downloader_utility::spidev::send(char*, char*, unsigned int)’:
  123. /home/sandhya/pybombs/uhd/host/lib/usrp/e100/fpga_downloader.cpp:206:6: warning: variable ‘ret’ set but not used [-Wunused-but-set-variable]
  124. [ 70%] Building CXX object lib/CMakeFiles/uhd.dir/usrp/e100/io_impl.cpp.o
  125. [ 71%] Building CXX object lib/CMakeFiles/uhd.dir/usrp/b200/b200_impl.cpp.o
  126. /home/sandhya/pybombs/uhd/host/lib/usrp/b200/b200_impl.cpp: In constructor ‘b200_impl::b200_impl(const uhd::device_addr_t&)’:
  127. /home/sandhya/pybombs/uhd/host/lib/usrp/b200/b200_impl.cpp:162:62: warning: format ‘%x’ expects argument of type ‘unsigned int*’, but argument 3 has type ‘uint16_t* {aka short unsigned int*}’ [-Wformat]
  128. /home/sandhya/pybombs/uhd/host/lib/usrp/b200/b200_impl.cpp:164:62: warning: format ‘%x’ expects argument of type ‘unsigned int*’, but argument 3 has type ‘uint16_t* {aka short unsigned int*}’ [-Wformat]
  129. [ 71%] Building CXX object lib/CMakeFiles/uhd.dir/usrp/b200/b200_iface.cpp.o
  130. /home/sandhya/pybombs/uhd/host/lib/usrp/b200/b200_iface.cpp:222:10: warning: unused parameter ‘addr’ [-Wunused-parameter]
  131. /home/sandhya/pybombs/uhd/host/lib/usrp/b200/b200_iface.cpp:222:10: warning: unused parameter ‘bytes’ [-Wunused-parameter]
  132. /home/sandhya/pybombs/uhd/host/lib/usrp/b200/b200_iface.cpp:228:19: warning: unused parameter ‘addr’ [-Wunused-parameter]
  133. /home/sandhya/pybombs/uhd/host/lib/usrp/b200/b200_iface.cpp:228:19: warning: unused parameter ‘num_bytes’ [-Wunused-parameter]
  134. /home/sandhya/pybombs/uhd/host/lib/usrp/b200/b200_iface.cpp: In member function ‘virtual uhd::byte_vector_t b200_iface_impl::read_eeprom(uint16_t, uint16_t, size_t)’:
  135. /home/sandhya/pybombs/uhd/host/lib/usrp/b200/b200_iface.cpp:252:27: warning: comparison between signed and unsigned integer expressions [-Wsign-compare]
  136. /home/sandhya/pybombs/uhd/host/lib/usrp/b200/b200_iface.cpp: At global scope:
  137. /home/sandhya/pybombs/uhd/host/lib/usrp/b200/b200_iface.cpp:303:10: warning: unused parameter ‘force’ [-Wunused-parameter]
  138. [ 72%] Building CXX object lib/CMakeFiles/uhd.dir/usrp/b200/b200_io_impl.cpp.o
  139. [ 72%] Building CXX object lib/CMakeFiles/uhd.dir/usrp/b200/b200_uart.cpp.o
  140. [ 72%] Building CXX object lib/CMakeFiles/uhd.dir/utils/csv.cpp.o
  141. [ 73%] Building CXX object lib/CMakeFiles/uhd.dir/utils/gain_group.cpp.o
  142. [ 73%] Building CXX object lib/CMakeFiles/uhd.dir/utils/images.cpp.o
  143. [ 74%] Building CXX object lib/CMakeFiles/uhd.dir/utils/load_modules.cpp.o
  144. [ 74%] Building CXX object lib/CMakeFiles/uhd.dir/utils/log.cpp.o
  145. [ 75%] Building CXX object lib/CMakeFiles/uhd.dir/utils/msg.cpp.o
  146. [ 75%] Building CXX object lib/CMakeFiles/uhd.dir/utils/paths.cpp.o
  147. [ 76%] Building CXX object lib/CMakeFiles/uhd.dir/utils/static.cpp.o
  148. [ 76%] Building CXX object lib/CMakeFiles/uhd.dir/utils/tasks.cpp.o
  149. [ 77%] Building CXX object lib/CMakeFiles/uhd.dir/utils/thread_priority.cpp.o
  150. [ 77%] Building CXX object lib/CMakeFiles/uhd.dir/deprecated.cpp.o
  151. [ 77%] Building CXX object lib/CMakeFiles/uhd.dir/device.cpp.o
  152. [ 78%] Building CXX object lib/CMakeFiles/uhd.dir/stream.cpp.o
  153. [ 78%] Building CXX object lib/CMakeFiles/uhd.dir/exception.cpp.o
  154. [ 79%] Building CXX object lib/CMakeFiles/uhd.dir/property_tree.cpp.o
  155. [ 79%] Building CXX object lib/CMakeFiles/uhd.dir/version.cpp.o
  156. Linking CXX shared library libuhd.so
  157. [ 79%] Built target uhd
  158. Scanning dependencies of target benchmark_rate
  159. [ 80%] Building CXX object examples/CMakeFiles/benchmark_rate.dir/benchmark_rate.cpp.o
  160. Linking CXX executable benchmark_rate
  161. CMakeFiles/benchmark_rate.dir/benchmark_rate.cpp.o: In function `boost::program_options::basic_parsed_options<char> boost::program_options::parse_command_line<char>(int, char const* const*, boost::program_options::options_description const&, int, boost::function1<std::pair<std::basic_string<char, std::char_traits<char>, std::allocator<char> >, std::basic_string<char, std::char_traits<char>, std::allocator<char> > >, std::basic_string<char, std::char_traits<char>, std::allocator<char> > const&>) [clone .constprop.630]':
  162. benchmark_rate.cpp:(.text+0x2125): undefined reference to `boost::program_options::detail::cmdline::get_canonical_option_prefix()'
  163. CMakeFiles/benchmark_rate.dir/benchmark_rate.cpp.o: In function `boost::program_options::validation_error::validation_error(boost::program_options::validation_error::kind_t, std::basic_string<char, std::char_traits<char>, std::allocator<char> > const&, std::basic_string<char, std::char_traits<char>, std::allocator<char> > const&, int)':
  164. benchmark_rate.cpp:(.text._ZN5boost15program_options16validation_errorC2ENS1_6kind_tERKSsS4_i[_ZN5boost15program_options16validation_errorC5ENS1_6kind_tERKSsS4_i]+0x23): undefined reference to `boost::program_options::validation_error::get_template(boost::program_options::validation_error::kind_t)'
  165. benchmark_rate.cpp:(.text._ZN5boost15program_options16validation_errorC2ENS1_6kind_tERKSsS4_i[_ZN5boost15program_options16validation_errorC5ENS1_6kind_tERKSsS4_i]+0x4a): undefined reference to `boost::program_options::error_with_option_name::error_with_option_name(std::basic_string<char, std::char_traits<char>, std::allocator<char> > const&, std::basic_string<char, std::char_traits<char>, std::allocator<char> > const&, std::basic_string<char, std::char_traits<char>, std::allocator<char> > const&, int)'
  166. CMakeFiles/benchmark_rate.dir/benchmark_rate.cpp.o: In function `boost::program_options::error_with_option_name::~error_with_option_name()':
  167. benchmark_rate.cpp:(.text._ZN5boost15program_options22error_with_option_nameD2Ev[_ZN5boost15program_options22error_with_option_nameD5Ev]+0xd): undefined reference to `vtable for boost::program_options::error_with_option_name'
  168. CMakeFiles/benchmark_rate.dir/benchmark_rate.cpp.o: In function `boost::program_options::validation_error::validation_error(boost::program_options::validation_error const&)':
  169. benchmark_rate.cpp:(.text._ZN5boost15program_options16validation_errorC2ERKS1_[_ZN5boost15program_options16validation_errorC5ERKS1_]+0x2c): undefined reference to `vtable for boost::program_options::error_with_option_name'
  170. CMakeFiles/benchmark_rate.dir/benchmark_rate.cpp.o:(.rodata._ZTVN5boost15program_options16validation_errorE[vtable for boost::program_options::validation_error]+0x10): undefined reference to `boost::program_options::error_with_option_name::what() const'
  171. CMakeFiles/benchmark_rate.dir/benchmark_rate.cpp.o:(.rodata._ZTVN5boost15program_options16validation_errorE[vtable for boost::program_options::validation_error]+0x18): undefined reference to `boost::program_options::error_with_option_name::substitute_placeholders(std::basic_string<char, std::char_traits<char>, std::allocator<char> > const&) const'
  172. CMakeFiles/benchmark_rate.dir/benchmark_rate.cpp.o:(.rodata._ZTVN5boost16exception_detail19error_info_injectorINS_15program_options16validation_errorEEE[vtable for boost::exception_detail::error_info_injector<boost::program_options::validation_error>]+0x10): undefined reference to `boost::program_options::error_with_option_name::what() const'
  173. CMakeFiles/benchmark_rate.dir/benchmark_rate.cpp.o:(.rodata._ZTVN5boost16exception_detail19error_info_injectorINS_15program_options16validation_errorEEE[vtable for boost::exception_detail::error_info_injector<boost::program_options::validation_error>]+0x18): undefined reference to `boost::program_options::error_with_option_name::substitute_placeholders(std::basic_string<char, std::char_traits<char>, std::allocator<char> > const&) const'
  174. CMakeFiles/benchmark_rate.dir/benchmark_rate.cpp.o:(.rodata._ZTVN5boost16exception_detail10clone_implINS0_19error_info_injectorINS_15program_options16validation_errorEEEEE[vtable for boost::exception_detail::clone_impl<boost::exception_detail::error_info_injector<boost::program_options::validation_error> >]+0x14): undefined reference to `boost::program_options::error_with_option_name::what() const'
  175. CMakeFiles/benchmark_rate.dir/benchmark_rate.cpp.o:(.rodata._ZTVN5boost16exception_detail10clone_implINS0_19error_info_injectorINS_15program_options16validation_errorEEEEE[vtable for boost::exception_detail::clone_impl<boost::exception_detail::error_info_injector<boost::program_options::validation_error> >]+0x1c): undefined reference to `boost::program_options::error_with_option_name::substitute_placeholders(std::basic_string<char, std::char_traits<char>, std::allocator<char> > const&) const'
  176. CMakeFiles/benchmark_rate.dir/benchmark_rate.cpp.o:(.rodata._ZTVN5boost15program_options20invalid_option_valueE[vtable for boost::program_options::invalid_option_value]+0x10): undefined reference to `boost::program_options::error_with_option_name::what() const'
  177. CMakeFiles/benchmark_rate.dir/benchmark_rate.cpp.o:(.rodata._ZTVN5boost15program_options20invalid_option_valueE[vtable for boost::program_options::invalid_option_value]+0x18): undefined reference to `boost::program_options::error_with_option_name::substitute_placeholders(std::basic_string<char, std::char_traits<char>, std::allocator<char> > const&) const'
  178. CMakeFiles/benchmark_rate.dir/benchmark_rate.cpp.o:(.rodata._ZTVN5boost16exception_detail19error_info_injectorINS_15program_options20invalid_option_valueEEE[vtable for boost::exception_detail::error_info_injector<boost::program_options::invalid_option_value>]+0x10): undefined reference to `boost::program_options::error_with_option_name::what() const'
  179. CMakeFiles/benchmark_rate.dir/benchmark_rate.cpp.o:(.rodata._ZTVN5boost16exception_detail19error_info_injectorINS_15program_options20invalid_option_valueEEE[vtable for boost::exception_detail::error_info_injector<boost::program_options::invalid_option_value>]+0x18): undefined reference to `boost::program_options::error_with_option_name::substitute_placeholders(std::basic_string<char, std::char_traits<char>, std::allocator<char> > const&) const'
  180. CMakeFiles/benchmark_rate.dir/benchmark_rate.cpp.o:(.rodata._ZTVN5boost16exception_detail10clone_implINS0_19error_info_injectorINS_15program_options20invalid_option_valueEEEEE[vtable for boost::exception_detail::clone_impl<boost::exception_detail::error_info_injector<boost::program_options::invalid_option_value> >]+0x14): undefined reference to `boost::program_options::error_with_option_name::what() const'
  181. CMakeFiles/benchmark_rate.dir/benchmark_rate.cpp.o:(.rodata._ZTVN5boost16exception_detail10clone_implINS0_19error_info_injectorINS_15program_options20invalid_option_valueEEEEE[vtable for boost::exception_detail::clone_impl<boost::exception_detail::error_info_injector<boost::program_options::invalid_option_value> >]+0x1c): undefined reference to `boost::program_options::error_with_option_name::substitute_placeholders(std::basic_string<char, std::char_traits<char>, std::allocator<char> > const&) const'
  182. CMakeFiles/benchmark_rate.dir/benchmark_rate.cpp.o:(.rodata._ZTIN5boost15program_options16validation_errorE[typeinfo for boost::program_options::validation_error]+0x8): undefined reference to `typeinfo for boost::program_options::error_with_option_name'
  183. ../lib/libuhd.so.003.006: undefined reference to `boost::filesystem::detail::dir_itr_close(void*&, void*&)'
  184. ../lib/libuhd.so.003.006: undefined reference to `boost::filesystem::detail::system_complete(boost::filesystem::path const&, boost::system::error_code*)'
  185. ../lib/libuhd.so.003.006: undefined reference to `boost::filesystem::path::filename() const'
  186. ../lib/libuhd.so.003.006: undefined reference to `boost::filesystem::detail::directory_iterator_construct(boost::filesystem::directory_iterator&, boost::filesystem::path const&, boost::system::error_code*)'
  187. ../lib/libuhd.so.003.006: undefined reference to `boost::filesystem::path::compare(boost::filesystem::path const&) const'
  188. ../lib/libuhd.so.003.006: undefined reference to `boost::filesystem::detail::directory_iterator_increment(boost::filesystem::directory_iterator&, boost::system::error_code*)'
  189. ../lib/libuhd.so.003.006: undefined reference to `boost::filesystem::detail::status(boost::filesystem::path const&, boost::system::error_code*)'
  190. ../lib/libuhd.so.003.006: undefined reference to `boost::filesystem::path::operator/=(boost::filesystem::path const&)'
  191. ../lib/libuhd.so.003.006: undefined reference to `boost::filesystem::path::parent_path() const'
  192. collect2: ld returned 1 exit status
  193. make[2]: *** [examples/benchmark_rate] Error 1
  194. make[1]: *** [examples/CMakeFiles/benchmark_rate.dir/all] Error 2
  195. make: *** [all] Error 2
  196. sandhya@ubuntu:~/pybombs/uhd/host/build$
Advertisement
Advertisement
Advertisement
RAW Paste Data Copied
Advertisement