SHARE
TWEET

Gnuradio/Volk/Builderror/rotator

mrberman87 Oct 28th, 2013 64 Never
Not a member of Pastebin yet? Sign Up, it unlocks many cool features!
  1. [  5%] Building C object volk/lib/CMakeFiles/volk.dir/volk_machine_sse4_1_64_orc.c.o
  2. [  5%] Building C object volk/lib/CMakeFiles/volk.dir/volk_machine_sse4_2_64_orc.c.o
  3. [  5%] Building C object volk/lib/CMakeFiles/volk.dir/volk_machine_avx_64_mmx_orc.c.o
  4. In file included from /home/michael/Devel/gr-setup/gnuradio/build/volk/lib/volk_machine_avx_64_mmx_orc.c:78:0:
  5. /home/michael/Devel/gr-setup/gnuradio/volk/kernels/volk/volk_32fc_s32fc_rotatorpuppet_32fc.h: In function ‘volk_32fc_s32fc_rotatorpuppet_32fc_a_avx’:
  6. /home/michael/Devel/gr-setup/gnuradio/volk/kernels/volk/volk_32fc_s32fc_rotatorpuppet_32fc.h:59:5: warning: implicit declaration of function ‘volk_32fc_s32fc_x2_rotator_32fc_avx’ [-Wimplicit-function-declaration]
  7. Linking C shared library libvolk.so
  8. [  5%] Built target volk
  9. Scanning dependencies of target test_all
  10. [  5%] Building CXX object volk/lib/CMakeFiles/test_all.dir/testqa.cc.o
  11. [  5%] Building CXX object volk/lib/CMakeFiles/test_all.dir/qa_utils.cc.o
  12. Linking CXX executable test_all
  13. libvolk.so.0.0.0: undefined reference to `volk_32fc_s32fc_x2_rotator_32fc_avx'
  14. collect2: ld returned 1 exit status
  15. make[2]: *** [volk/lib/test_all] Error 1
  16. make[1]: *** [volk/lib/CMakeFiles/test_all.dir/all] Error 2
  17. make: *** [all] Error 2
  18. make failed
  19. Exiting Gnu Radio build/install
  20. Send success/fail info to sbrac.org?n
RAW Paste Data
We use cookies for various purposes including analytics. By continuing to use Pastebin, you agree to our use of cookies as described in the Cookies Policy. OK, I Understand
 
Top