Guest User

Untitled

a guest
Apr 11th, 2018
201
Never
Not a member of Pastebin yet? Sign Up, it unlocks many cool features!
  1. Script started on Wed 11 Apr 2018 04:54:11 PM CEST
  2. ]0;curv@vulpecula:~/tmp/nodebb
  3. [11.Apr 16:54:11] --- [~/tmp/nodebb] ---
  4. curv@vulpecula: % yarn
  5. yarn install v1.6.0-20180405.1011
  6. info No lockfile found.
  7. [1/5] Validating package.json...
  8. [2/5] Resolving packages...
  9. ⠁ ⠂ async@~1.4.2⠄ bcryptjs@~2.2.1⡀ type-is@~1.6.15⢀ statuses@>= 1.4.0 < 2⠠ statuses@>= 1.3.1 < 2⠐ colors@^1.1.0⠈ vary@~1.1.2⠁ connect-ensure-login@^0.1.1⠂ type-is@~1.6.15⠄ cookie-signature@1.0.6⡀ csurf@^1.6.1⢀ csurf@^1.6.1⠠ csurf@^1.6.1⠐ csurf@^1.6.1⠈ csurf@^1.6.1⠁ statuses@>= 1.3.1 < 2⠂ statuses@>= 1.3.1 < 2⠄ uid-safe@2.1.4⡀ express@^4.9.5⢀ vary@~1.1.2⠠ unpipe@~1.0.0⠐ send@0.16.2⠈ random-bytes@~1.0.0⠁ yargs-parser@^4.2.0⠂ lcid@^1.0.0⠄ path-type@^1.0.0⡀ validate-npm-package-license@^3.0.1⢀ less@^2.0.0⠠ asap@~2.0.3⠐ uuid@^3.0.0⠈ sshpk@^1.7.0⠁ verror@1.10.0⠂ hoek@2.x.x⠄ json-stable-stringify@^1.0.1⡀ logrotate-stream@^0.2.3⢀ logrotate-stream@^0.2.3⠠ minimist@~0.0.1⠐ minimist@~0.0.1⠈ minimist@~0.0.1⠁ lwip@0.0.7warning lwip > decree > lodash-node@2.4.1: This package is discontinued. Use lodash@^4.0.0.
  10. ⠂ mmmagic@^0.4.0⠄ nconf@~0.7.1⡀ wordwrap@0.0.2⢀ nodebb-plugin-composer-default@1.0.14⠠ nodebb-plugin-composer-default@1.0.14⠐ nodebb-plugin-composer-default@1.0.14⠈ nodebb-plugin-composer-default@1.0.14⠁ nodebb-plugin-composer-default@1.0.14⠂ nodebb-plugin-dbsearch@0.2.16⠄ nodebb-plugin-dbsearch@0.2.16⡀ nodebb-plugin-dbsearch@0.2.16⢀ nodebb-plugin-dbsearch@0.2.16⠠ nodebb-plugin-dbsearch@0.2.16⠐ stack-trace@0.0.x⠈ emoji-parser@~0.1.1⠁ emoji-parser@~0.1.1⠂ emoji-parser@~0.1.1⠄ emoji-parser@~0.1.1⡀ emoji-parser@~0.1.1warning nodebb-plugin-emoji-extended > emoji-parser > wrench@1.5.9: wrench.js is deprecated! You should check out fs-extra (https://github.com/jprichardson/node-fs-extra) for any operations you were using wrench for. Thanks for all the usage over the years.
  11. ⢀ nodebb-plugin-markdown@4.0.5⠠ nodebb-plugin-markdown@4.0.5⠐ nodebb-plugin-markdown@4.0.5⠈ nodebb-plugin-markdown@4.0.5⠁ nodebb-plugin-markdown@4.0.5⠂ sprintf-js@~1.0.2⠄ nodebb-plugin-mentions@1.0.2⡀ nodebb-plugin-mentions@1.0.2⢀ nodebb-plugin-soundpack-default@0.1.4⠠ nodebb-plugin-soundpack-default@0.1.4⠐ nodebb-plugin-spam-be-gone@0.4.2⠈ nodebb-plugin-spam-be-gone@0.4.2⠁ nodebb-plugin-spam-be-gone@0.4.2⠂ simple-recaptcha@git://github.com/wzrdtales/simple-recaptcha#v1.0.0⠄ simple-recaptcha@git://github.com/wzrdtales/simple-recaptcha#v1.0.0⡀ simple-recaptcha@git://github.com/wzrdtales/simple-recaptcha#v1.0.0⢀ simple-recaptcha@git://github.com/wzrdtales/simple-recaptcha#v1.0.0⠠ simple-recaptcha@git://github.com/wzrdtales/simple-recaptcha#v1.0.0⠐ simple-recaptcha@git://github.com/wzrdtales/simple-recaptcha#v1.0.0⠈ simple-recaptcha@git://github.com/wzrdtales/simple-recaptcha#v1.0.0⠁ simple-recaptcha@git://github.com/wzrdtales/simple-recaptcha#v1.0.0⠂ simple-recaptcha@git://github.com/wzrdtales/simple-recaptcha#v1.0.0⠄ simple-recaptcha@git://github.com/wzrdtales/simple-recaptcha#v1.0.0⡀ simple-recaptcha@git://github.com/wzrdtales/simple-recaptcha#v1.0.0⢀ simple-recaptcha@git://github.com/wzrdtales/simple-recaptcha#v1.0.0⠠ simple-recaptcha@git://github.com/wzrdtales/simple-recaptcha#v1.0.0⠐ simple-recaptcha@git://github.com/wzrdtales/simple-recaptcha#v1.0.0⠈ simple-recaptcha@git://github.com/wzrdtales/simple-recaptcha#v1.0.0⠁ simple-recaptcha@git://github.com/wzrdtales/simple-recaptcha#v1.0.0⠂ simple-recaptcha@git://github.com/wzrdtales/simple-recaptcha#v1.0.0⠄ simple-recaptcha@git://github.com/wzrdtales/simple-recaptcha#v1.0.0⡀ simple-recaptcha@git://github.com/wzrdtales/simple-recaptcha#v1.0.0⢀ simple-recaptcha@git://github.com/wzrdtales/simple-recaptcha#v1.0.0⠠ simple-recaptcha@git://github.com/wzrdtales/simple-recaptcha#v1.0.0⠐ simple-recaptcha@git://github.com/wzrdtales/simple-recaptcha#v1.0.0⠈ simple-recaptcha@git://github.com/wzrdtales/simple-recaptcha#v1.0.0⠁ simple-recaptcha@git://github.com/wzrdtales/simple-recaptcha#v1.0.0⠂ simple-recaptcha@git://github.com/wzrdtales/simple-recaptcha#v1.0.0⠄ simple-recaptcha@git://github.com/wzrdtales/simple-recaptcha#v1.0.0⡀ simple-recaptcha@git://github.com/wzrdtales/simple-recaptcha#v1.0.0⢀ simple-recaptcha@git://github.com/wzrdtales/simple-recaptcha#v1.0.0⠠ simple-recaptcha@git://github.com/wzrdtales/simple-recaptcha#v1.0.0⠐ simple-recaptcha@git://github.com/wzrdtales/simple-recaptcha#v1.0.0⠈ simple-recaptcha@git://github.com/wzrdtales/simple-recaptcha#v1.0.0⠁ nodebb-rewards-essentials@0.0.5⠂ nodebb-theme-lavender@2.0.1⠄ nodebb-theme-persona@3.0.13⡀ nodebb-theme-persona@3.0.13⢀ nodebb-theme-persona@3.0.13⠠ nodebb-theme-persona@3.0.13⠐ nodebb-theme-vanilla@4.0.8⠈ nodebb-theme-vanilla@4.0.8⠁ nodebb-theme-vanilla@4.0.8⠂ nodebb-theme-vanilla@4.0.8⠄ nodebb-theme-vanilla@4.0.8⡀ nodebb-widget-essentials@2.0.1⢀ lodash@^4.14.0⠠ rimraf@^2.5.2⠐ path-is-absolute@^1.0.0⠈ validate-npm-package-name@^3.0.0⠁ graceful-fs@^4.1.2⠂ readable-stream@^2.0.2⠄ graceful-fs@^4.1.2⡀ slide@^1.1.5warning npm > request > node-uuid@1.4.8: Use uuid module instead
  12. ⢀ xtend@^4.0.0⠠ wide-align@^1.1.0⠐ typedarray@^0.0.6⠈ clone@^1.0.2⠁ passport@^0.3.0⠂ winston@0.8.x⠄ rss@^1.0.0⡀ sitemap@^1.0.0⢀ ms@0.7.2⠠ to-array@0.1.4⠐ ultron@1.0.x⠈ yeast@0.1.2⠁ benchmark@1.0.0⠂ socketio-wildcard@~0.1.1⠄ uglify-js@^2.4.24⡀ window-size@0.1.0⢀ xregexp@~2.0.0warning mocha > glob > minimatch@0.2.14: Please update to minimatch 3.0.2 or higher to avoid a RegExp DoS issue
  13. warning mocha > glob > graceful-fs@2.0.3: please upgrade to graceful-fs 4 for compatibility with current and future versions of Node.js
  14. â   sigmund@~1.0.0warning mocha > jade@0.26.3: Jade has been renamed to pug, please install the latest version of pug instead of jade
  15. ⠐ grunt@~0.4.5warning grunt > minimatch@0.2.14: Please update to minimatch 3.0.2 or higher to avoid a RegExp DoS issue
  16. warning grunt > glob > minimatch@0.2.14: Please update to minimatch 3.0.2 or higher to avoid a RegExp DoS issue
  17. warning grunt > glob > graceful-fs@1.2.3: please upgrade to graceful-fs 4 for compatibility with current and future versions of Node.js
  18. â ˆ inherits@1warning grunt > coffee-script@1.3.3: CoffeeScript on NPM has moved to "coffeescript" (no hyphen)
  19. warning grunt > findup-sync > glob > minimatch@0.3.0: Please update to minimatch 3.0.2 or higher to avoid a RegExp DoS issue
  20. ⠁ sigmund@~1.0.0⠂ underscore.string@~2.3.3⠄ debug@~0.7.0warning grunt-contrib-watch > gaze > globule > minimatch@0.2.14: Please update to minimatch 3.0.2 or higher to avoid a RegExp DoS issue
  21. [3/5] Fetching packages...
  22. [----------------------------------------------------------------------------------------------------------------------------------------------------------------------------------------------------------------------------------------------------------------] 0/562[##################---------------------------------------------------------------------------------------------------------------------------------------------------------------------------------------------------------------------------------------------] 40/562[##################################-----------------------------------------------------------------------------------------------------------------------------------------------------------------------------------------------------------------------------] 76/562[#########################################################-----------------------------------------------------------------------------------------------------------------------------------------------------------------------------------------------------] 127/562[########################################################################--------------------------------------------------------------------------------------------------------------------------------------------------------------------------------------] 160/562[#############################################################################################-----------------------------------------------------------------------------------------------------------------------------------------------------------------] 205/562[################################################################################################################----------------------------------------------------------------------------------------------------------------------------------------------] 248/562[########################################################################################################################################----------------------------------------------------------------------------------------------------------------------] 300/562[########################################################################################################################################################------------------------------------------------------------------------------------------------------] 336/562[####################################################################################################################################################################################--------------------------------------------------------------------------] 398/562[##########################################################################################################################################################################################################----------------------------------------------------] 448/562[################################################################################################################################################################################################################################------------------------------] 496/562[######################################################################################################################################################################################################################################################--------] 544/562[##############################################################################################################################################################################################################################################################] 562/562[4/5] Linking dependencies...
  23. warning " > nodebb-plugin-dbsearch@0.2.16" has unmet peer dependency "redisearch@^0.0.4".
  24. [----------------------------------------------------------------------------------------------------------------------------------------------------------------------------------------------------------------------------------------------------------------] 0/606[--------------------------------------------------------------------------------------------------------------------------------] 0/128[####################################--------------------------------------------------------------------------------------------] 36/128[#######################################################################---------------------------------------------------------] 71/128[########################################################################################################------------------------] 104/128[################################################################################################################################] 128/128[---------------------------------------------------------------------------------------------------------------------------------------------------------------------------------------------------------------------------------------------------------------] 0/1051[#############################################----------------------------------------------------------------------------------------------------------------------------------------------------------------------------------------------------------------] 185/1051[###############################################################----------------------------------------------------------------------------------------------------------------------------------------------------------------------------------------------] 262/1051[################################################################################-----------------------------------------------------------------------------------------------------------------------------------------------------------------------------] 333/1051[####################################################################################-------------------------------------------------------------------------------------------------------------------------------------------------------------------------] 347/1051[########################################################################################################################################---------------------------------------------------------------------------------------------------------------------] 567/1051[#######################################################################################################################################################------------------------------------------------------------------------------------------------------] 627/1051[5/5] Building fresh packages...
  25. [#########################################################################################################################################################----------------------------------------------------------------------------------------------------] 634/1051
  26. 
  27. 
  28. 
  29. ⠁ ⠁ ⠁ ⠁ ⠁ [-/2] ⠂ waiting...[-/2] ⠂ waiting...[-/2] ⠂ waiting...[2/2] ⠂ mmmagic[1/2] ⠂ lwip[-/2] ⠄ waiting...[-/2] ⠄ waiting...[-/2] ⠄ waiting...[2/2] ⠄ mmmagic[1/2] ⠄ lwip[-/2] ⡀ waiting...[-/2] ⡀ waiting...[-/2] ⡀ waiting...[2/2] ⡀ mmmagic[1/2] ⡀ lwip[-/2] ⢀ waiting...[-/2] ⢀ waiting...[-/2] ⢀ waiting...[2/2] ⢀ mmmagic[1/2] ⢀ lwip[-/2] ⠠ waiting...[-/2] ⠠ waiting...[-/2] ⠠ waiting...[2/2] ⠠ mmmagic[1/2] ⠠ lwip[-/2] ⠐ waiting...[-/2] ⠐ waiting...[-/2] ⠐ waiting...[2/2] ⠐ mmmagic[1/2] ⠐ lwip: using node@6.13.1 | linux | x64[-/2] ⠈ waiting...[-/2] ⠈ waiting...[-/2] ⠈ waiting...[2/2] ⠈ mmmagic: node@6.13.1 | linux | x64[1/2] ⠈ lwip: using node@6.13.1 | linux | x64[-/2] ⠁ waiting...[-/2] ⠁ waiting...[-/2] ⠁ waiting...[2/2] ⠁ mmmagic: node@6.13.1 | linux | x64[1/2] ⠁ lwip: using node@6.13.1 | linux | x64[-/2] ⠂ waiting...[-/2] ⠂ waiting...[-/2] ⠂ waiting...[2/2] ⠂ mmmagic: node@6.13.1 | linux | x64[1/2] ⠂ lwip: using node@6.13.1 | linux | x64[-/2] ⠄ waiting...[-/2] ⠄ waiting...[-/2] ⠄ waiting...[2/2] ⠄ mmmagic: node@6.13.1 | linux | x64[1/2] ⠄ lwip: using node@6.13.1 | linux | x64[-/2] ⡀ waiting...[-/2] ⡀ waiting...[-/2] ⡀ waiting...[2/2] ⡀ mmmagic: node@6.13.1 | linux | x64[1/2] ⡀ lwip: using node@6.13.1 | linux | x64[-/2] ⢀ waiting...[-/2] ⢀ waiting...[-/2] ⢀ waiting...[2/2] ⢀ mmmagic: node@6.13.1 | linux | x64[1/2] ⢀ lwip: using node@6.13.1 | linux | x64[-/2] ⠠ waiting...[-/2] ⠠ waiting...[-/2] ⠠ waiting...[2/2] ⠠ mmmagic: node@6.13.1 | linux | x64[1/2] ⠠ lwip: using node@6.13.1 | linux | x64[-/2] ⠐ waiting...[-/2] ⠐ waiting...[-/2] ⠐ waiting...[2/2] ⠐ mmmagic: http GET https://nodejs.org/download/release/v6.13.1/node-v6.13.1-headers.tar.gz[1/2] ⠐ lwip: https://nodejs.org/download/release/v6.13.1/node-v6.13.1-headers.tar.gz[-/2] ⠈ waiting...[-/2] ⠈ waiting...[-/2] ⠈ waiting...[2/2] ⠈ mmmagic: http GET https://nodejs.org/download/release/v6.13.1/node-v6.13.1-headers.tar.gz[1/2] ⠈ lwip: https://nodejs.org/download/release/v6.13.1/node-v6.13.1-headers.tar.gz[-/2] ⠁ waiting...[-/2] ⠁ waiting...[-/2] ⠁ waiting...[2/2] ⠁ mmmagic: http GET https://nodejs.org/download/release/v6.13.1/node-v6.13.1-headers.tar.gz[1/2] ⠁ lwip: https://nodejs.org/download/release/v6.13.1/node-v6.13.1-headers.tar.gz[-/2] ⠂ waiting...[-/2] ⠂ waiting...[-/2] ⠂ waiting...[2/2] ⠂ mmmagic: http GET https://nodejs.org/download/release/v6.13.1/node-v6.13.1-headers.tar.gz[1/2] ⠂ lwip: https://nodejs.org/download/release/v6.13.1/node-v6.13.1-headers.tar.gz[-/2] ⠄ waiting...[-/2] ⠄ waiting...[-/2] ⠄ waiting...[2/2] ⠄ mmmagic: http GET https://nodejs.org/download/release/v6.13.1/node-v6.13.1-headers.tar.gz[1/2] ⠄ lwip: https://nodejs.org/download/release/v6.13.1/node-v6.13.1-headers.tar.gz[-/2] ⡀ waiting...[-/2] ⡀ waiting...[-/2] ⡀ waiting...[2/2] ⡀ mmmagic: http GET https://nodejs.org/download/release/v6.13.1/node-v6.13.1-headers.tar.gz[1/2] ⡀ lwip: https://nodejs.org/download/release/v6.13.1/node-v6.13.1-headers.tar.gz[-/2] ⢀ waiting...[-/2] ⢀ waiting...[-/2] ⢀ waiting...[2/2] ⢀ mmmagic: http GET https://nodejs.org/download/release/v6.13.1/node-v6.13.1-headers.tar.gz[1/2] ⢀ lwip: https://nodejs.org/download/release/v6.13.1/node-v6.13.1-headers.tar.gz[-/2] ⠠ waiting...[-/2] ⠠ waiting...[-/2] ⠠ waiting...[2/2] ⠠ mmmagic: http GET https://nodejs.org/download/release/v6.13.1/node-v6.13.1-headers.tar.gz[1/2] ⠠ lwip: https://nodejs.org/download/release/v6.13.1/node-v6.13.1-headers.tar.gz[-/2] ⠐ waiting...[-/2] ⠐ waiting...[-/2] ⠐ waiting...[2/2] ⠐ mmmagic: http GET https://nodejs.org/download/release/v6.13.1/node-v6.13.1-headers.tar.gz[1/2] ⠐ lwip: https://nodejs.org/download/release/v6.13.1/node-v6.13.1-headers.tar.gz[-/2] ⠈ waiting...[-/2] ⠈ waiting...[-/2] ⠈ waiting...[2/2] ⠈ mmmagic: http GET https://nodejs.org/download/release/v6.13.1/node-v6.13.1-headers.tar.gz[1/2] ⠈ lwip: 200 https://nodejs.org/download/release/v6.13.1/node-v6.13.1-headers.tar.gz[-/2] ⠁ waiting...[-/2] ⠁ waiting...[-/2] ⠁ waiting...[2/2] ⠁ mmmagic: http 200 https://nodejs.org/download/release/v6.13.1/node-v6.13.1-headers.tar.gz[1/2] ⠁ lwip: 200 https://nodejs.org/download/release/v6.13.1/node-v6.13.1-headers.tar.gz[-/2] ⠂ waiting...[-/2] ⠂ waiting...[-/2] ⠂ waiting...[2/2] ⠂ mmmagic: http 200 https://nodejs.org/download/release/v6.13.1/node-v6.13.1-headers.tar.gz[1/2] ⠂ lwip: 200 https://nodejs.org/download/release/v6.13.1/node-v6.13.1-headers.tar.gz[-/2] ⠄ waiting...[-/2] ⠄ waiting...[-/2] ⠄ waiting...[2/2] ⠄ mmmagic: http 200 https://nodejs.org/download/release/v6.13.1/node-v6.13.1-headers.tar.gz[1/2] ⠄ lwip: 200 https://nodejs.org/download/release/v6.13.1/node-v6.13.1-headers.tar.gz[-/2] ⡀ waiting...[-/2] ⡀ waiting...[-/2] ⡀ waiting...[2/2] ⡀ mmmagic: http 200 https://nodejs.org/download/release/v6.13.1/node-v6.13.1-headers.tar.gz[1/2] ⡀ lwip: 200 https://nodejs.org/download/release/v6.13.1/node-v6.13.1-headers.tar.gz[-/2] ⢀ waiting...[-/2] ⢀ waiting...[-/2] ⢀ waiting...[2/2] ⢀ mmmagic: http 200 https://nodejs.org/download/release/v6.13.1/node-v6.13.1-headers.tar.gz[1/2] ⢀ lwip: 200 https://nodejs.org/download/release/v6.13.1/node-v6.13.1-headers.tar.gz[-/2] ⠠ waiting...[-/2] ⠠ waiting...[-/2] ⠠ waiting...[2/2] ⠠ mmmagic: http 200 https://nodejs.org/download/release/v6.13.1/node-v6.13.1-headers.tar.gz[1/2] ⠠ lwip: 200 https://nodejs.org/download/release/v6.13.1/node-v6.13.1-headers.tar.gz[-/2] ⠐ waiting...[-/2] ⠐ waiting...[-/2] ⠐ waiting...[2/2] ⠐ mmmagic: http 200 https://nodejs.org/download/release/v6.13.1/node-v6.13.1-headers.tar.gz[1/2] ⠐ lwip: 200 https://nodejs.org/download/release/v6.13.1/node-v6.13.1-headers.tar.gz[-/2] ⠈ waiting...[-/2] ⠈ waiting...[-/2] ⠈ waiting...[2/2] ⠈ mmmagic: http 200 https://nodejs.org/download/release/v6.13.1/node-v6.13.1-headers.tar.gz[1/2] ⠈ lwip: http GET https://nodejs.org/download/release/v6.13.1/SHASUMS256.txt[-/2] ⠁ waiting...[-/2] ⠁ waiting...[-/2] ⠁ waiting...[2/2] ⠁ mmmagic: http 200 https://nodejs.org/download/release/v6.13.1/node-v6.13.1-headers.tar.gz[1/2] ⠁ lwip: spawn args[-/2] ⠂ waiting...[-/2] ⠂ waiting...[-/2] ⠂ waiting...[2/2] ⠂ mmmagic: http 200 https://nodejs.org/download/release/v6.13.1/node-v6.13.1-headers.tar.gz[1/2] ⠂ lwip: gyp info spawn args '-Goutput_dir=.' ][-/2] ⠄ waiting...[-/2] ⠄ waiting...[-/2] ⠄ waiting...[2/2] ⠄ mmmagic: gyp info spawn args '-Goutput_dir=.' ][1/2] ⠄ lwip: gyp info spawn args '-Goutput_dir=.' ][-/2] ⡀ waiting...[-/2] ⡀ waiting...[-/2] ⡀ waiting...[2/2] ⡀ mmmagic: gyp info spawn args '-Goutput_dir=.' ][1/2] ⡀ lwip: gyp info spawn args '-Goutput_dir=.' ][-/2] ⢀ waiting...[-/2] ⢀ waiting...[-/2] ⢀ waiting...[2/2] ⢀ mmmagic: gyp info spawn args '-Goutput_dir=.' ][1/2] ⢀ lwip: gyp info spawn args '-Goutput_dir=.' ][-/2] ⠠ waiting...[-/2] ⠠ waiting...[-/2] ⠠ waiting...[2/2] ⠠ mmmagic: gyp info spawn args '-Goutput_dir=.' ][1/2] ⠠ lwip: gyp info spawn args '-Goutput_dir=.' ][-/2] ⠐ waiting...[-/2] ⠐ waiting...[-/2] ⠐ waiting...[2/2] ⠐ mmmagic: gyp info spawn args '-Goutput_dir=.' ][1/2] ⠐ lwip: gyp info spawn args '-Goutput_dir=.' ][-/2] ⠈ waiting...[-/2] ⠈ waiting...[-/2] ⠈ waiting...[2/2] ⠈ mmmagic: gyp info spawn args '-Goutput_dir=.' ][1/2] ⠈ lwip: gyp info spawn args '-Goutput_dir=.' ][-/2] ⠁ waiting...[-/2] ⠁ waiting...[-/2] ⠁ waiting...[2/2] ⠁ mmmagic: gyp info spawn args '-Goutput_dir=.' ][1/2] ⠁ lwip: CXX(target) Release/obj.target/lwip_decoder/src/decoder/init.o[-/2] ⠂ waiting...[-/2] ⠂ waiting...[-/2] ⠂ waiting...[2/2] ⠂ mmmagic: gyp[1/2] ⠂ lwip: CXX(target) Release/obj.target/lwip_decoder/src/decoder/init.o[-/2] ⠄ waiting...[-/2] ⠄ waiting...[-/2] ⠄ waiting...[2/2] ⠄ mmmagic: CC(target) Release/obj.target/libmagic/deps/libmagic/src/apprentice.o[1/2] ⠄ lwip: CXX(target) Release/obj.target/lwip_decoder/src/decoder/init.o[-/2] ⡀ waiting...[-/2] ⡀ waiting...[-/2] ⡀ waiting...[2/2] ⡀ mmmagic: CC(target) Release/obj.target/libmagic/deps/libmagic/src/apprentice.o[1/2] ⡀ lwip: CXX(target) Release/obj.target/lwip_decoder/src/decoder/init.o[-/2] ⢀ waiting...[-/2] ⢀ waiting...[-/2] ⢀ waiting...[2/2] ⢀ mmmagic: CC(target) Release/obj.target/libmagic/deps/libmagic/src/apprentice.o[1/2] ⢀ lwip: CXX(target) Release/obj.target/lwip_decoder/src/decoder/init.o[-/2] ⠠ waiting...[-/2] ⠠ waiting...[-/2] ⠠ waiting...[2/2] ⠠ mmmagic: CC(target) Release/obj.target/libmagic/deps/libmagic/src/apprentice.o[1/2] ⠠ lwip: CXX(target) Release/obj.target/lwip_decoder/src/decoder/init.o[-/2] ⠐ waiting...[-/2] ⠐ waiting...[-/2] ⠐ waiting...[2/2] ⠐ mmmagic: CC(target) Release/obj.target/libmagic/deps/libmagic/src/apprentice.o[1/2] ⠐ lwip: CXX(target) Release/obj.target/lwip_decoder/src/decoder/init.o[-/2] ⠈ waiting...[-/2] ⠈ waiting...[-/2] ⠈ waiting...[2/2] ⠈ mmmagic: CC(target) Release/obj.target/libmagic/deps/libmagic/src/apprentice.o[1/2] ⠈ lwip: /home/curv/.node-gyp/6.13.1/include/node/v8.h:4515: error: ‘nullptr’ was not declared in this scope[-/2] ⠁ waiting...[-/2] ⠁ waiting...[-/2] ⠁ waiting...[2/2] ⠁ mmmagic: CC(target) Release/obj.target/libmagic/deps/libmagic/src/apprentice.o[1/2] ⠁ lwip: /home/curv/.node-gyp/6.13.1/include/node/v8.h:7544: error: ‘nullptr’ was not declared in this scope[-/2] ⠂ waiting...[-/2] ⠂ waiting...[-/2] ⠂ waiting...[2/2] ⠂ mmmagic: CC(target) Release/obj.target/libmagic/deps/libmagic/src/apprentice.o[1/2] ⠂ lwip: ../../nan/nan.h:1814: error: initializing argument 2 of ‘v8::Local<v8::Value> NanCallback::Call(int, int) const’[-/2] ⠄ waiting...[-/2] ⠄ waiting...[-/2] ⠄ waiting...[2/2] ⠄ mmmagic: CC(target) Release/obj.target/libmagic/deps/libmagic/src/apprentice.o[1/2] ⠄ lwip: build errorerror /home/curv/tmp/nodebb/node_modules/lwip: Command failed.
  30. Exit code: 1
  31. Command: node-gyp rebuild
  32. Arguments:
  33. Directory: /home/curv/tmp/nodebb/node_modules/lwip
  34. Output:
  35. gyp info it worked if it ends with ok
  36. gyp info using node-gyp@3.4.0
  37. gyp info using node@6.13.1 | linux | x64
  38. gyp http GET https://nodejs.org/download/release/v6.13.1/node-v6.13.1-headers.tar.gz
  39. gyp http 200 https://nodejs.org/download/release/v6.13.1/node-v6.13.1-headers.tar.gz
  40. gyp http GET https://nodejs.org/download/release/v6.13.1/SHASUMS256.txt
  41. gyp http 200 https://nodejs.org/download/release/v6.13.1/SHASUMS256.txt
  42. gyp info spawn /usr/bin/python2
  43. gyp info spawn args [ '/package/host/localhost/nodejs-6.13.1/lib/node_modules/npm/node_modules/node-gyp/gyp/gyp_main.py',
  44. gyp info spawn args 'binding.gyp',
  45. gyp info spawn args '-f',
  46. gyp info spawn args 'make',
  47. gyp info spawn args '-I',
  48. gyp info spawn args '/home/curv/tmp/nodebb/node_modules/lwip/build/config.gypi',
  49. gyp info spawn args '-I',
  50. gyp info spawn args '/package/host/localhost/nodejs-6.13.1/lib/node_modules/npm/node_modules/node-gyp/addon.gypi',
  51. gyp info spawn args '-I',
  52. gyp info spawn args '/home/curv/.node-gyp/6.13.1/include/node/common.gypi',
  53. gyp info spawn args '-Dlibrary=shared_library',
  54. gyp info spawn args '-Dvisibility=default',
  55. gyp info spawn args '-Dnode_root_dir=/home/curv/.node-gyp/6.13.1',
  56. gyp info spawn args '-Dnode_gyp_dir=/package/host/localhost/nodejs-6.13.1/lib/node_modules/npm/node_modules/node-gyp',
  57. gyp info spawn args '-Dnode_lib_file=node.lib',
  58. gyp info spawn args '-Dmodule_root_dir=/home/curv/tmp/nodebb/node_modules/lwip',
  59. gyp info spawn args '--depth=.',
  60. gyp info spawn args '--no-parallel',
  61. gyp info spawn args '--generator-output',
  62. gyp info spawn args 'build',
  63. gyp info spawn args '-Goutput_dir=.' ]
  64. gyp info spawn make
  65. gyp info spawn args [ 'BUILDTYPE=Release', '-C', 'build' ]
  66. make: Entering directory `/home/curv/tmp/nodebb/node_modules/lwip/build'
  67. CXX(target) Release/obj.target/lwip_decoder/src/decoder/init.o
  68. In file included from /home/curv/.node-gyp/6.13.1/include/node/node.h:42,
  69. from ../src/decoder/decoder.h:11,
  70. from ../src/decoder/init.cpp:1:
  71. /home/curv/.node-gyp/6.13.1/include/node/v8.h:345: error: expected unqualified-id before ‘using’
  72. /home/curv/.node-gyp/6.13.1/include/node/v8.h: In constructor ‘v8::MaybeLocal<T>::MaybeLocal()’:
  73. /home/curv/.node-gyp/6.13.1/include/node/v8.h:362: error: ‘nullptr’ was not declared in this scope
  74. /home/curv/.node-gyp/6.13.1/include/node/v8.h: In member function ‘bool v8::MaybeLocal<T>::IsEmpty() const’:
  75. /home/curv/.node-gyp/6.13.1/include/node/v8.h:369: error: ‘nullptr’ was not declared in this scope
  76. /home/curv/.node-gyp/6.13.1/include/node/v8.h: In member function ‘bool v8::MaybeLocal<T>::ToLocal(v8::Local<S>*) const’:
  77. /home/curv/.node-gyp/6.13.1/include/node/v8.h:373: error: ‘nullptr’ was not declared in this scope
  78. /home/curv/.node-gyp/6.13.1/include/node/v8.h: In member function ‘bool v8::WeakCallbackInfo<T>::IsFirstPass() const’:
  79. /home/curv/.node-gyp/6.13.1/include/node/v8.h:441: error: ‘nullptr’ was not declared in this scope
  80. /home/curv/.node-gyp/6.13.1/include/node/v8.h: At global scope:
  81. /home/curv/.node-gyp/6.13.1/include/node/v8.h:481: error: expected unqualified-id before ‘using’
  82. /home/curv/.node-gyp/6.13.1/include/node/v8.h: In constructor ‘v8::Global<T>::Global()’:
  83. /home/curv/.node-gyp/6.13.1/include/node/v8.h:820: error: ‘nullptr’ was not declared in this scope
  84. /home/curv/.node-gyp/6.13.1/include/node/v8.h: In constructor ‘v8::Global<T>::Global(v8::Global<T>&&)’:
  85. /home/curv/.node-gyp/6.13.1/include/node/v8.h:845: error: ‘nullptr’ was not declared in this scope
  86. /home/curv/.node-gyp/6.13.1/include/node/v8.h: In member function ‘v8::Global<T>& v8::Global<T>::operator=(v8::Global<S>&&)’:
  87. /home/curv/.node-gyp/6.13.1/include/node/v8.h:857: error: ‘nullptr’ was not declared in this scope
  88. /home/curv/.node-gyp/6.13.1/include/node/v8.h: At global scope:
  89. /home/curv/.node-gyp/6.13.1/include/node/v8.h:882: error: expected unqualified-id before ‘using’
  90. /home/curv/.node-gyp/6.13.1/include/node/v8.h:1119: error: ‘nullptr’ was not declared in this scope
  91. /home/curv/.node-gyp/6.13.1/include/node/v8.h:1125: error: ‘nullptr’ was not declared in this scope
  92. /home/curv/.node-gyp/6.13.1/include/node/v8.h: In member function ‘v8::MaybeLocal<v8::Object> v8::Function::NewInstance(v8::Local<v8::Context>) const’:
  93. /home/curv/.node-gyp/6.13.1/include/node/v8.h:3279: error: ‘nullptr’ was not declared in this scope
  94. /home/curv/.node-gyp/6.13.1/include/node/v8.h: At global scope:
  95. /home/curv/.node-gyp/6.13.1/include/node/v8.h:4499: error: ‘nullptr’ was not declared in this scope
  96. /home/curv/.node-gyp/6.13.1/include/node/v8.h:4515: error: ‘nullptr’ was not declared in this scope
  97. /home/curv/.node-gyp/6.13.1/include/node/v8.h: In member function ‘v8::Local<T> v8::MaybeLocal<T>::ToLocalChecked()’:
  98. /home/curv/.node-gyp/6.13.1/include/node/v8.h:7544: error: ‘nullptr’ was not declared in this scope
  99. In file included from ../../nan/nan.h:111,
  100. from ../src/decoder/decoder.h:13,
  101. from ../src/decoder/init.cpp:1:
  102. ../../nan/nan_new.h: At global scope:
  103. ../../nan/nan_new.h:24: error: template declaration of ‘v8::Local<T> Nan::imp::To’
  104. ../../nan/nan_new.h:24: error: ‘Handle’ is not a member of ‘v8’
  105. ../../nan/nan_new.h:24: error: expected primary-expression before ‘>’ token
  106. ../../nan/nan_new.h:24: error: ‘i’ was not declared in this scope
  107. ../../nan/nan_new.h:29: error: expected initializer before ‘<’ token
  108. ../../nan/nan_new.h:34: error: expected initializer before ‘<’ token
  109. ../../nan/nan_new.h:39: error: expected initializer before ‘<’ token
  110. ../../nan/nan_new.h:66: error: ‘v8::Handle’ has not been declared
  111. ../../nan/nan_new.h:66: error: expected ‘,’ or ‘...’ before ‘<’ token
  112. ../../nan/nan_new.h:65: error: default argument missing for parameter 2 of ‘static v8::Local<v8::Context> Nan::imp::Factory<v8::Context>::New(v8::ExtensionConfiguration*, int)’
  113. ../../nan/nan_new.h:85: error: ‘v8::Handle’ has not been declared
  114. ../../nan/nan_new.h:85: error: expected ‘,’ or ‘...’ before ‘<’ token
  115. ../../nan/nan_new.h:93: error: ‘v8::Handle’ has not been declared
  116. ../../nan/nan_new.h:93: error: expected ‘,’ or ‘...’ before ‘<’ token
  117. ../../nan/nan_new.h:92: error: default argument missing for parameter 2 of ‘static v8::Local<v8::FunctionTemplate> Nan::imp::Factory<v8::FunctionTemplate>::New(void (*)(const v8::FunctionCallbackInfo<v8::Value>&), int)’
  118. ../../nan/nan_new.h:139: error: ‘v8::Handle’ has not been declared
  119. ../../nan/nan_new.h:139: error: expected ‘,’ or ‘...’ before ‘<’ token
  120. ../../nan/nan_new.h:151: error: ISO C++ forbids declaration of ‘Handle’ with no type
  121. ../../nan/nan_new.h:151: error: typedef name may not be a nested-name-specifier
  122. ../../nan/nan_new.h:151: error: expected ‘;’ before ‘<’ token
  123. ../../nan/nan_new.h:152: error: ‘FTH’ has not been declared
  124. ../../nan/nan_new.h:152: error: ‘FTH’ was not declared in this scope
  125. ../../nan/nan_new.h:171: error: ‘v8::Handle’ has not been declared
  126. ../../nan/nan_new.h:171: error: expected ‘,’ or ‘...’ before ‘<’ token
  127. In file included from ../../nan/nan_new.h:191,
  128. from ../../nan/nan.h:111,
  129. from ../src/decoder/decoder.h:13,
  130. from ../src/decoder/init.cpp:1:
  131. ../../nan/nan_implementation_12_inl.h: In static member function ‘static v8::Local<v8::BooleanObject> Nan::imp::Factory<v8::BooleanObject>::New(bool)’:
  132. ../../nan/nan_implementation_12_inl.h:49: warning: ‘static v8::Local<v8::Value> v8::BooleanObject::New(bool)’ is deprecated (declared at /home/curv/.node-gyp/6.13.1/include/node/v8.h:4009)
  133. ../../nan/nan_implementation_12_inl.h: At global scope:
  134. ../../nan/nan_implementation_12_inl.h:56: error: ‘v8::Handle’ has not been declared
  135. ../../nan/nan_implementation_12_inl.h:56: error: expected ‘,’ or ‘...’ before ‘<’ token
  136. ../../nan/nan_implementation_12_inl.h: In static member function ‘static v8::Local<v8::Context> Nan::imp::Factory<v8::Context>::New(v8::ExtensionConfiguration*, int)’:
  137. ../../nan/nan_implementation_12_inl.h:58: error: ‘tmpl’ was not declared in this scope
  138. ../../nan/nan_implementation_12_inl.h:58: error: ‘obj’ was not declared in this scope
  139. ../../nan/nan_implementation_12_inl.h: At global scope:
  140. ../../nan/nan_implementation_12_inl.h:79: error: ‘v8::Handle’ has not been declared
  141. ../../nan/nan_implementation_12_inl.h:79: error: expected ‘,’ or ‘...’ before ‘<’ token
  142. ../../nan/nan_implementation_12_inl.h: In static member function ‘static v8::Local<v8::Function> Nan::imp::Factory<v8::Function>::New(void (*)(const v8::FunctionCallbackInfo<v8::Value>&), int)’:
  143. ../../nan/nan_implementation_12_inl.h:82: error: ‘data’ was not declared in this scope
  144. ../../nan/nan_implementation_12_inl.h: At global scope:
  145. ../../nan/nan_implementation_12_inl.h:89: error: ‘v8::Handle’ has not been declared
  146. ../../nan/nan_implementation_12_inl.h:89: error: expected ‘,’ or ‘...’ before ‘<’ token
  147. ../../nan/nan_implementation_12_inl.h: In static member function ‘static v8::Local<v8::FunctionTemplate> Nan::imp::Factory<v8::FunctionTemplate>::New(void (*)(const v8::FunctionCallbackInfo<v8::Value>&), int)’:
  148. ../../nan/nan_implementation_12_inl.h:93: error: ‘data’ was not declared in this scope
  149. ../../nan/nan_implementation_12_inl.h:94: error: ‘signature’ was not declared in this scope
  150. ../../nan/nan_implementation_12_inl.h: In static member function ‘static typename Nan::imp::IntegerFactory<T>::return_t Nan::imp::IntegerFactory<T>::New(int32_t)’:
  151. ../../nan/nan_implementation_12_inl.h:117: error: ‘To’ was not declared in this scope
  152. ../../nan/nan_implementation_12_inl.h:117: error: expected primary-expression before ‘>’ token
  153. ../../nan/nan_implementation_12_inl.h: In static member function ‘static typename Nan::imp::IntegerFactory<T>::return_t Nan::imp::IntegerFactory<T>::New(uint32_t)’:
  154. ../../nan/nan_implementation_12_inl.h:123: error: ‘To’ was not declared in this scope
  155. ../../nan/nan_implementation_12_inl.h:123: error: expected primary-expression before ‘>’ token
  156. ../../nan/nan_implementation_12_inl.h: In static member function ‘static v8::Local<v8::Uint32> Nan::imp::Factory<v8::Uint32>::New(int32_t)’:
  157. ../../nan/nan_implementation_12_inl.h:128: error: ‘To’ was not declared in this scope
  158. ../../nan/nan_implementation_12_inl.h:128: error: expected primary-expression before ‘>’ token
  159. ../../nan/nan_implementation_12_inl.h: In static member function ‘static v8::Local<v8::Uint32> Nan::imp::Factory<v8::Uint32>::New(uint32_t)’:
  160. ../../nan/nan_implementation_12_inl.h:134: error: ‘To’ was not declared in this scope
  161. ../../nan/nan_implementation_12_inl.h:134: error: expected primary-expression before ‘>’ token
  162. ../../nan/nan_implementation_12_inl.h: At global scope:
  163. ../../nan/nan_implementation_12_inl.h:156: error: ‘v8::Local<v8::RegExp> Nan::imp::Factory<v8::RegExp>::New’ is not a static member of ‘struct Nan::imp::Factory<v8::RegExp>’
  164. ../../nan/nan_implementation_12_inl.h:156: error: ‘Handle’ is not a member of ‘v8’
  165. ../../nan/nan_implementation_12_inl.h:156: error: expected primary-expression before ‘>’ token
  166. ../../nan/nan_implementation_12_inl.h:156: error: ‘pattern’ was not declared in this scope
  167. ../../nan/nan_implementation_12_inl.h:157: error: expected primary-expression before ‘flags’
  168. ../../nan/nan_implementation_12_inl.h:157: error: expected ‘,’ or ‘;’ before ‘{’ token
  169. ../../nan/nan_implementation_12_inl.h: In static member function ‘static v8::Local<v8::Script> Nan::imp::Factory<v8::Script>::New(v8::Local<v8::String>)’:
  170. ../../nan/nan_implementation_12_inl.h:166: warning: ‘static v8::Local<v8::Script> v8::ScriptCompiler::Compile(v8::Isolate*, v8::ScriptCompiler::Source*, v8::ScriptCompiler::CompileOptions)’ is deprecated (declared at /home/curv/.node-gyp/6.13.1/include/node/v8.h:1352)
  171. ../../nan/nan_implementation_12_inl.h: In static member function ‘static v8::Local<v8::Script> Nan::imp::Factory<v8::Script>::New(v8::Local<v8::String>, const v8::ScriptOrigin&)’:
  172. ../../nan/nan_implementation_12_inl.h:173: warning: ‘static v8::Local<v8::Script> v8::ScriptCompiler::Compile(v8::Isolate*, v8::ScriptCompiler::Source*, v8::ScriptCompiler::CompileOptions)’ is deprecated (declared at /home/curv/.node-gyp/6.13.1/include/node/v8.h:1352)
  173. ../../nan/nan_implementation_12_inl.h: At global scope:
  174. ../../nan/nan_implementation_12_inl.h:179: error: ‘v8::Local<v8::Signature> Nan::imp::Factory<v8::Signature>::New’ is not a static member of ‘struct Nan::imp::Factory<v8::Signature>’
  175. ../../nan/nan_implementation_12_inl.h:179: error: ‘FTH’ is not a member of ‘Nan::imp::Factory<v8::Signature>’
  176. ../../nan/nan_implementation_12_inl.h:179: error: expected ‘,’ or ‘;’ before ‘{’ token
  177. ../../nan/nan_implementation_12_inl.h: In static member function ‘static v8::Local<v8::String> Nan::imp::Factory<v8::String>::New(const uint8_t*, int)’:
  178. ../../nan/nan_implementation_12_inl.h:206: warning: ‘static v8::Local<v8::String> v8::String::NewFromOneByte(v8::Isolate*, const uint8_t*, v8::String::NewStringType, int)’ is deprecated (declared at /home/curv/.node-gyp/6.13.1/include/node/v8.h:2332)
  179. ../../nan/nan_implementation_12_inl.h: In static member function ‘static v8::Local<v8::String> Nan::imp::Factory<v8::String>::New(v8::String::ExternalStringResource*)’:
  180. ../../nan/nan_implementation_12_inl.h:217: warning: ‘static v8::Local<v8::String> v8::String::NewExternal(v8::Isolate*, v8::String::ExternalStringResource*)’ is deprecated (declared at /home/curv/.node-gyp/6.13.1/include/node/v8.h:2371)
  181. ../../nan/nan_implementation_12_inl.h: At global scope:
  182. ../../nan/nan_implementation_12_inl.h:228: error: ‘v8::Local<v8::StringObject> Nan::imp::Factory<v8::StringObject>::New’ is not a static member of ‘struct Nan::imp::Factory<v8::StringObject>’
  183. ../../nan/nan_implementation_12_inl.h:228: error: ‘Handle’ is not a member of ‘v8’
  184. ../../nan/nan_implementation_12_inl.h:228: error: expected primary-expression before ‘>’ token
  185. ../../nan/nan_implementation_12_inl.h:228: error: ‘value’ was not declared in this scope
  186. ../../nan/nan_implementation_12_inl.h:228: error: expected ‘,’ or ‘;’ before ‘{’ token
  187. ../../nan/nan_implementation_12_inl.h: In static member function ‘static v8::Local<v8::UnboundScript> Nan::imp::Factory<v8::UnboundScript>::New(v8::Local<v8::String>)’:
  188. ../../nan/nan_implementation_12_inl.h:237: warning: ‘static v8::Local<v8::UnboundScript> v8::ScriptCompiler::CompileUnbound(v8::Isolate*, v8::ScriptCompiler::Source*, v8::ScriptCompiler::CompileOptions)’ is deprecated (declared at /home/curv/.node-gyp/6.13.1/include/node/v8.h:1333)
  189. ../../nan/nan_implementation_12_inl.h: In static member function ‘static v8::Local<v8::UnboundScript> Nan::imp::Factory<v8::UnboundScript>::New(v8::Local<v8::String>, const v8::ScriptOrigin&)’:
  190. ../../nan/nan_implementation_12_inl.h:244: warning: ‘static v8::Local<v8::UnboundScript> v8::ScriptCompiler::CompileUnbound(v8::Isolate*, v8::ScriptCompiler::Source*, v8::ScriptCompiler::CompileOptions)’ is deprecated (declared at /home/curv/.node-gyp/6.13.1/include/node/v8.h:1333)
  191. ../../nan/nan_implementation_12_inl.h: At global scope:
  192. ../../nan/nan_implementation_12_inl.h:253: error: ‘NanNew’ declared as an ‘inline’ variable
  193. ../../nan/nan_implementation_12_inl.h:253: error: template declaration of ‘v8::Local<T> NanNew’
  194. ../../nan/nan_implementation_12_inl.h:253: error: ‘Handle’ is not a member of ‘v8’
  195. ../../nan/nan_implementation_12_inl.h:253: error: expected primary-expression before ‘>’ token
  196. ../../nan/nan_implementation_12_inl.h:253: error: ‘h’ was not declared in this scope
  197. In file included from ../../nan/nan.h:111,
  198. from ../src/decoder/decoder.h:13,
  199. from ../src/decoder/init.cpp:1:
  200. ../../nan/nan_new.h:240: error: ‘v8::Handle’ has not been declared
  201. ../../nan/nan_new.h:240: error: expected ‘,’ or ‘...’ before ‘<’ token
  202. ../../nan/nan_new.h: In function ‘typename Nan::imp::Factory<T>::return_t NanNew(void (*)(const v8::FunctionCallbackInfo<v8::Value>&), int)’:
  203. ../../nan/nan_new.h:241: error: ‘data’ was not declared in this scope
  204. ../../nan/nan_new.h: At global scope:
  205. ../../nan/nan_new.h:248: error: ‘v8::Handle’ has not been declared
  206. ../../nan/nan_new.h:248: error: expected ‘,’ or ‘...’ before ‘<’ token
  207. ../../nan/nan_new.h: In function ‘typename Nan::imp::Factory<T>::return_t NanNew(void (*)(const v8::FunctionCallbackInfo<v8::Value>&), int)’:
  208. ../../nan/nan_new.h:250: error: ‘data’ was not declared in this scope
  209. ../../nan/nan_new.h:250: error: ‘a2’ was not declared in this scope
  210. ../../nan/nan_new.h: At global scope:
  211. ../../nan/nan_new.h:255: error: ‘NanNew’ declared as an ‘inline’ variable
  212. ../../nan/nan_new.h:255: error: template declaration of ‘v8::Local<T> NanNew’
  213. ../../nan/nan_new.h:255: error: ‘Handle’ is not a member of ‘v8’
  214. ../../nan/nan_new.h:255: error: expected primary-expression before ‘>’ token
  215. ../../nan/nan_new.h:255: error: ‘h’ was not declared in this scope
  216. ../../nan/nan_new.h:326: error: ‘NanNew’ declared as an ‘inline’ variable
  217. ../../nan/nan_new.h:326: error: ‘v8::Local<v8::RegExp> NanNew’ redeclared as different kind of symbol
  218. ../../nan/nan_new.h:320: error: previous declaration of ‘v8::Local<v8::String> NanNew(NanExternalOneByteStringResource*)’
  219. ../../nan/nan_new.h:326: error: ‘Handle’ is not a member of ‘v8’
  220. ../../nan/nan_new.h:326: error: expected primary-expression before ‘>’ token
  221. ../../nan/nan_new.h:326: error: ‘pattern’ was not declared in this scope
  222. ../../nan/nan_new.h:326: error: expected primary-expression before ‘flags’
  223. In file included from ../src/decoder/decoder.h:13,
  224. from ../src/decoder/init.cpp:1:
  225. ../../nan/nan.h:250: error: ‘v8::Handle’ has not been declared
  226. ../../nan/nan.h:250: error: expected ‘,’ or ‘...’ before ‘<’ token
  227. ../../nan/nan.h: In function ‘bool Nan::imp::NanBooleanOptionValue(v8::Local<v8::Object>, int)’:
  228. ../../nan/nan.h:252: error: ‘def’ was not declared in this scope
  229. ../../nan/nan.h:254: error: ‘opt’ was not declared in this scope
  230. ../../nan/nan.h:258: error: ‘opt’ was not declared in this scope
  231. ../../nan/nan.h: At global scope:
  232. ../../nan/nan.h:283: error: ‘v8::Handle’ has not been declared
  233. ../../nan/nan.h:283: error: expected ‘,’ or ‘...’ before ‘<’ token
  234. ../../nan/nan.h: In function ‘bool NanBooleanOptionValue(v8::Local<v8::Object>, int)’:
  235. ../../nan/nan.h:285: error: ‘opt’ was not declared in this scope
  236. ../../nan/nan.h:285: error: ‘def’ was not declared in this scope
  237. ../../nan/nan.h: At global scope:
  238. ../../nan/nan.h:290: error: ‘v8::Handle’ has not been declared
  239. ../../nan/nan.h:290: error: expected ‘,’ or ‘...’ before ‘<’ token
  240. ../../nan/nan.h: In function ‘bool NanBooleanOptionValue(v8::Local<v8::Object>, int)’:
  241. ../../nan/nan.h:288: error: redefinition of ‘bool NanBooleanOptionValue(v8::Local<v8::Object>, int)’
  242. ../../nan/nan.h:281: error: ‘bool NanBooleanOptionValue(v8::Local<v8::Object>, int)’ previously defined here
  243. ../../nan/nan.h:292: error: ‘opt’ was not declared in this scope
  244. ../../nan/nan.h: At global scope:
  245. ../../nan/nan.h:297: error: ‘v8::Handle’ has not been declared
  246. ../../nan/nan.h:297: error: expected ‘,’ or ‘...’ before ‘<’ token
  247. ../../nan/nan.h: In function ‘uint32_t NanUInt32OptionValue(v8::Local<v8::Object>, int)’:
  248. ../../nan/nan.h:301: error: ‘opt’ was not declared in this scope
  249. ../../nan/nan.h:304: error: ‘def’ was not declared in this scope
  250. ../../nan/nan.h: At global scope:
  251. ../../nan/nan.h:308: error: template declaration of ‘v8::Local<T> NanNew’
  252. ../../nan/nan.h:308: error: ‘Handle’ is not a member of ‘v8’
  253. ../../nan/nan.h:308: error: expected primary-expression before ‘>’ token
  254. ../../nan/nan.h:308: error: expected primary-expression before ‘)’ token
  255. ../../nan/nan.h:319: error: expected initializer before ‘<’ token
  256. ../../nan/nan.h:344: error: expected unqualified-id before ‘<’ token
  257. ../../nan/nan.h:344: error: expected ‘)’ before ‘<’ token
  258. ../../nan/nan.h:344: error: expected initializer before ‘<’ token
  259. ../../nan/nan.h: In function ‘bool NanIdleNotification(int)’:
  260. ../../nan/nan.h:374: warning: ‘bool v8::Isolate::IdleNotification(int)’ is deprecated (declared at /home/curv/.node-gyp/6.13.1/include/node/v8.h:6115)
  261. ../../nan/nan.h: In function ‘v8::Local<v8::Primitive> NanUndefined()’:
  262. ../../nan/nan.h:501: error: no matching function for call to ‘NanNew(v8::Local<v8::Primitive>)’
  263. ../../nan/nan_new.h:260: note: candidates are: v8::Local<v8::Boolean> NanNew(bool)
  264. ../../nan/nan_new.h:266: note: v8::Local<v8::Int32> NanNew(int32_t)
  265. ../../nan/nan_new.h:272: note: v8::Local<v8::Uint32> NanNew(uint32_t)
  266. ../../nan/nan_new.h:278: note: v8::Local<v8::Number> NanNew(double)
  267. ../../nan/nan_new.h:284: note: v8::Local<v8::String> NanNew(const std::string&)
  268. ../../nan/nan_new.h:290: note: v8::Local<v8::String> NanNew(const char*, int)
  269. ../../nan/nan_new.h:296: note: v8::Local<v8::String> NanNew(const char*)
  270. ../../nan/nan_new.h:302: note: v8::Local<v8::String> NanNew(const uint8_t*)
  271. ../../nan/nan_new.h:308: note: v8::Local<v8::String> NanNew(const uint16_t*)
  272. ../../nan/nan_new.h:314: note: v8::Local<v8::String> NanNew(v8::String::ExternalStringResource*)
  273. ../../nan/nan_new.h:320: note: v8::Local<v8::String> NanNew(NanExternalOneByteStringResource*)
  274. ../../nan/nan.h: In function ‘v8::Local<v8::Primitive> NanNull()’:
  275. ../../nan/nan.h:506: error: no matching function for call to ‘NanNew(v8::Local<v8::Primitive>)’
  276. ../../nan/nan_new.h:260: note: candidates are: v8::Local<v8::Boolean> NanNew(bool)
  277. ../../nan/nan_new.h:266: note: v8::Local<v8::Int32> NanNew(int32_t)
  278. ../../nan/nan_new.h:272: note: v8::Local<v8::Uint32> NanNew(uint32_t)
  279. ../../nan/nan_new.h:278: note: v8::Local<v8::Number> NanNew(double)
  280. ../../nan/nan_new.h:284: note: v8::Local<v8::String> NanNew(const std::string&)
  281. ../../nan/nan_new.h:290: note: v8::Local<v8::String> NanNew(const char*, int)
  282. ../../nan/nan_new.h:296: note: v8::Local<v8::String> NanNew(const char*)
  283. ../../nan/nan_new.h:302: note: v8::Local<v8::String> NanNew(const uint8_t*)
  284. ../../nan/nan_new.h:308: note: v8::Local<v8::String> NanNew(const uint16_t*)
  285. ../../nan/nan_new.h:314: note: v8::Local<v8::String> NanNew(v8::String::ExternalStringResource*)
  286. ../../nan/nan_new.h:320: note: v8::Local<v8::String> NanNew(NanExternalOneByteStringResource*)
  287. ../../nan/nan.h: In function ‘v8::Local<v8::Boolean> NanTrue()’:
  288. ../../nan/nan.h:511: error: no matching function for call to ‘NanNew(v8::Local<v8::Boolean>)’
  289. ../../nan/nan_new.h:260: note: candidates are: v8::Local<v8::Boolean> NanNew(bool)
  290. ../../nan/nan_new.h:266: note: v8::Local<v8::Int32> NanNew(int32_t)
  291. ../../nan/nan_new.h:272: note: v8::Local<v8::Uint32> NanNew(uint32_t)
  292. ../../nan/nan_new.h:278: note: v8::Local<v8::Number> NanNew(double)
  293. ../../nan/nan_new.h:284: note: v8::Local<v8::String> NanNew(const std::string&)
  294. ../../nan/nan_new.h:290: note: v8::Local<v8::String> NanNew(const char*, int)
  295. ../../nan/nan_new.h:296: note: v8::Local<v8::String> NanNew(const char*)
  296. ../../nan/nan_new.h:302: note: v8::Local<v8::String> NanNew(const uint8_t*)
  297. ../../nan/nan_new.h:308: note: v8::Local<v8::String> NanNew(const uint16_t*)
  298. ../../nan/nan_new.h:314: note: v8::Local<v8::String> NanNew(v8::String::ExternalStringResource*)
  299. ../../nan/nan_new.h:320: note: v8::Local<v8::String> NanNew(NanExternalOneByteStringResource*)
  300. ../../nan/nan.h: In function ‘v8::Local<v8::Boolean> NanFalse()’:
  301. ../../nan/nan.h:516: error: no matching function for call to ‘NanNew(v8::Local<v8::Boolean>)’
  302. ../../nan/nan_new.h:260: note: candidates are: v8::Local<v8::Boolean> NanNew(bool)
  303. ../../nan/nan_new.h:266: note: v8::Local<v8::Int32> NanNew(int32_t)
  304. ../../nan/nan_new.h:272: note: v8::Local<v8::Uint32> NanNew(uint32_t)
  305. ../../nan/nan_new.h:278: note: v8::Local<v8::Number> NanNew(double)
  306. ../../nan/nan_new.h:284: note: v8::Local<v8::String> NanNew(const std::string&)
  307. ../../nan/nan_new.h:290: note: v8::Local<v8::String> NanNew(const char*, int)
  308. ../../nan/nan_new.h:296: note: v8::Local<v8::String> NanNew(const char*)
  309. ../../nan/nan_new.h:302: note: v8::Local<v8::String> NanNew(const uint8_t*)
  310. ../../nan/nan_new.h:308: note: v8::Local<v8::String> NanNew(const uint16_t*)
  311. ../../nan/nan_new.h:314: note: v8::Local<v8::String> NanNew(v8::String::ExternalStringResource*)
  312. ../../nan/nan_new.h:320: note: v8::Local<v8::String> NanNew(NanExternalOneByteStringResource*)
  313. ../../nan/nan.h: At global scope:
  314. ../../nan/nan.h:525: error: variable or field ‘NanSetTemplate’ declared void
  315. ../../nan/nan.h:525: error: ‘Handle’ is not a member of ‘v8’
  316. ../../nan/nan.h:525: error: expected primary-expression before ‘>’ token
  317. ../../nan/nan.h:525: error: ‘templ’ was not declared in this scope
  318. ../../nan/nan.h:526: error: expected primary-expression before ‘const’
  319. ../../nan/nan.h:527: error: ‘Handle’ is not a member of ‘v8’
  320. ../../nan/nan.h:527: error: expected primary-expression before ‘>’ token
  321. ../../nan/nan.h:527: error: ‘value’ was not declared in this scope
  322. ../../nan/nan.h:532: error: variable or field ‘NanSetTemplate’ declared void
  323. ../../nan/nan.h:532: error: ‘Handle’ is not a member of ‘v8’
  324. ../../nan/nan.h:532: error: expected primary-expression before ‘>’ token
  325. ../../nan/nan.h:532: error: ‘templ’ was not declared in this scope
  326. ../../nan/nan.h:533: error: ‘Handle’ is not a member of ‘v8’
  327. ../../nan/nan.h:533: error: expected primary-expression before ‘>’ token
  328. ../../nan/nan.h:533: error: ‘name’ was not declared in this scope
  329. ../../nan/nan.h:534: error: ‘Handle’ is not a member of ‘v8’
  330. ../../nan/nan.h:534: error: expected primary-expression before ‘>’ token
  331. ../../nan/nan.h:534: error: ‘value’ was not declared in this scope
  332. ../../nan/nan.h:535: error: expected primary-expression before ‘attributes’
  333. ../../nan/nan.h:544: error: ‘NanGetInternalFieldPointer’ declared as an ‘inline’ variable
  334. ../../nan/nan.h:544: warning: ‘always_inline’ attribute ignored
  335. ../../nan/nan.h:544: error: ‘Handle’ is not a member of ‘v8’
  336. ../../nan/nan.h:544: error: expected primary-expression before ‘>’ token
  337. ../../nan/nan.h:544: error: ‘object’ was not declared in this scope
  338. ../../nan/nan.h:545: error: expected primary-expression before ‘int’
  339. ../../nan/nan.h:545: error: initializer expression list treated as compound expression
  340. ../../nan/nan.h:545: error: expected ‘,’ or ‘;’ before ‘{’ token
  341. ../../nan/nan.h:550: error: variable or field ‘NanSetInternalFieldPointer’ declared void
  342. ../../nan/nan.h:550: error: ‘Handle’ is not a member of ‘v8’
  343. ../../nan/nan.h:550: error: expected primary-expression before ‘>’ token
  344. ../../nan/nan.h:550: error: ‘object’ was not declared in this scope
  345. ../../nan/nan.h:551: error: expected primary-expression before ‘int’
  346. ../../nan/nan.h:552: error: expected primary-expression before ‘void’
  347. ../../nan/nan.h:560: error: variable or field ‘NanAddGCEpilogueCallback’ declared void
  348. ../../nan/nan.h:560: error: ‘GCEpilogueCallback’ is not a member of ‘v8::Isolate’
  349. ../../nan/nan.h:561: error: expected primary-expression before ‘gc_type_filter’
  350. ../../nan/nan.h:566: error: variable or field ‘NanRemoveGCEpilogueCallback’ declared void
  351. ../../nan/nan.h:566: error: ‘GCEpilogueCallback’ is not a member of ‘v8::Isolate’
  352. ../../nan/nan.h:571: error: variable or field ‘NanAddGCPrologueCallback’ declared void
  353. ../../nan/nan.h:571: error: ‘GCPrologueCallback’ is not a member of ‘v8::Isolate’
  354. ../../nan/nan.h:572: error: expected primary-expression before ‘gc_type_filter’
  355. ../../nan/nan.h:577: error: variable or field ‘NanRemoveGCPrologueCallback’ declared void
  356. ../../nan/nan.h:577: error: ‘GCPrologueCallback’ is not a member of ‘v8::Isolate’
  357. ../../nan/nan.h:594: error: ‘v8::Handle’ has not been declared
  358. ../../nan/nan.h:594: error: expected ‘,’ or ‘...’ before ‘<’ token
  359. ../../nan/nan.h: In function ‘void NanAssignPersistent(v8::Persistent<T, v8::NonCopyablePersistentTraits<T> >&, int)’:
  360. ../../nan/nan.h:595: error: ‘obj’ was not declared in this scope
  361. ../../nan/nan.h: At global scope:
  362. ../../nan/nan.h:611: error: expected ‘)’ before ‘<’ token
  363. ../../nan/nan.h:675: error: ‘NanMakeWeakPersistent’ declared as an ‘inline’ variable
  364. ../../nan/nan.h:675: warning: ‘always_inline’ attribute ignored
  365. ../../nan/nan.h:675: error: template declaration of ‘_NanWeakCallbackInfo<T, P>* NanMakeWeakPersistent’
  366. ../../nan/nan.h:675: error: ‘Handle’ is not a member of ‘v8’
  367. ../../nan/nan.h:675: error: expected primary-expression before ‘>’ token
  368. ../../nan/nan.h:675: error: ‘handle’ was not declared in this scope
  369. ../../nan/nan.h:676: error: expected primary-expression before ‘*’ token
  370. ../../nan/nan.h:676: error: ‘parameter’ was not declared in this scope
  371. ../../nan/nan.h:677: error: expected ‘(’ before ‘callback’
  372. ../../nan/nan.h:711: error: ‘NanError’ declared as an ‘inline’ variable
  373. ../../nan/nan.h:711: warning: ‘always_inline’ attribute ignored
  374. ../../nan/nan.h:711: error: ‘v8::Local<v8::Value> NanError’ redeclared as different kind of symbol
  375. ../../nan/nan.h:711: error: previous declaration of ‘v8::Local<v8::Value> NanError(const char*)’
  376. ../../nan/nan.h:711: error: ‘Handle’ is not a member of ‘v8’
  377. ../../nan/nan.h:711: error: expected primary-expression before ‘>’ token
  378. ../../nan/nan.h:711: error: ‘errmsg’ was not declared in this scope
  379. ../../nan/nan.h:711: error: variable or field ‘NanThrowError’ declared void
  380. ../../nan/nan.h:711: error: ‘Handle’ is not a member of ‘v8’
  381. ../../nan/nan.h:711: error: expected primary-expression before ‘>’ token
  382. ../../nan/nan.h:711: error: ‘errmsg’ was not declared in this scope
  383. ../../nan/nan.h:712: error: ‘NanRangeError’ declared as an ‘inline’ variable
  384. ../../nan/nan.h:712: warning: ‘always_inline’ attribute ignored
  385. ../../nan/nan.h:712: error: ‘v8::Local<v8::Value> NanRangeError’ redeclared as different kind of symbol
  386. ../../nan/nan.h:712: error: previous declaration of ‘v8::Local<v8::Value> NanRangeError(const char*)’
  387. ../../nan/nan.h:712: error: ‘Handle’ is not a member of ‘v8’
  388. ../../nan/nan.h:712: error: expected primary-expression before ‘>’ token
  389. ../../nan/nan.h:712: error: ‘errmsg’ was not declared in this scope
  390. ../../nan/nan.h:712: error: variable or field ‘NanThrowRangeError’ declared void
  391. ../../nan/nan.h:712: error: ‘Handle’ is not a member of ‘v8’
  392. ../../nan/nan.h:712: error: expected primary-expression before ‘>’ token
  393. ../../nan/nan.h:712: error: ‘errmsg’ was not declared in this scope
  394. ../../nan/nan.h:713: error: ‘NanReferenceError’ declared as an ‘inline’ variable
  395. ../../nan/nan.h:713: warning: ‘always_inline’ attribute ignored
  396. ../../nan/nan.h:713: error: ‘v8::Local<v8::Value> NanReferenceError’ redeclared as different kind of symbol
  397. ../../nan/nan.h:713: error: previous declaration of ‘v8::Local<v8::Value> NanReferenceError(const char*)’
  398. ../../nan/nan.h:713: error: ‘Handle’ is not a member of ‘v8’
  399. ../../nan/nan.h:713: error: expected primary-expression before ‘>’ token
  400. ../../nan/nan.h:713: error: ‘errmsg’ was not declared in this scope
  401. ../../nan/nan.h:713: error: variable or field ‘NanThrowReferenceError’ declared void
  402. ../../nan/nan.h:713: error: ‘Handle’ is not a member of ‘v8’
  403. ../../nan/nan.h:713: error: expected primary-expression before ‘>’ token
  404. ../../nan/nan.h:713: error: ‘errmsg’ was not declared in this scope
  405. ../../nan/nan.h:714: error: ‘NanSyntaxError’ declared as an ‘inline’ variable
  406. ../../nan/nan.h:714: warning: ‘always_inline’ attribute ignored
  407. ../../nan/nan.h:714: error: ‘v8::Local<v8::Value> NanSyntaxError’ redeclared as different kind of symbol
  408. ../../nan/nan.h:714: error: previous declaration of ‘v8::Local<v8::Value> NanSyntaxError(const char*)’
  409. ../../nan/nan.h:714: error: ‘Handle’ is not a member of ‘v8’
  410. ../../nan/nan.h:714: error: expected primary-expression before ‘>’ token
  411. ../../nan/nan.h:714: error: ‘errmsg’ was not declared in this scope
  412. ../../nan/nan.h:714: error: variable or field ‘NanThrowSyntaxError’ declared void
  413. ../../nan/nan.h:714: error: ‘Handle’ is not a member of ‘v8’
  414. ../../nan/nan.h:714: error: expected primary-expression before ‘>’ token
  415. ../../nan/nan.h:714: error: ‘errmsg’ was not declared in this scope
  416. ../../nan/nan.h:715: error: ‘NanTypeError’ declared as an ‘inline’ variable
  417. ../../nan/nan.h:715: warning: ‘always_inline’ attribute ignored
  418. ../../nan/nan.h:715: error: ‘v8::Local<v8::Value> NanTypeError’ redeclared as different kind of symbol
  419. ../../nan/nan.h:715: error: previous declaration of ‘v8::Local<v8::Value> NanTypeError(const char*)’
  420. ../../nan/nan.h:715: error: ‘Handle’ is not a member of ‘v8’
  421. ../../nan/nan.h:715: error: expected primary-expression before ‘>’ token
  422. ../../nan/nan.h:715: error: ‘errmsg’ was not declared in this scope
  423. ../../nan/nan.h:715: error: variable or field ‘NanThrowTypeError’ declared void
  424. ../../nan/nan.h:715: error: ‘Handle’ is not a member of ‘v8’
  425. ../../nan/nan.h:715: error: expected primary-expression before ‘>’ token
  426. ../../nan/nan.h:715: error: ‘errmsg’ was not declared in this scope
  427. ../../nan/nan.h:719: error: variable or field ‘NanThrowError’ declared void
  428. ../../nan/nan.h:719: error: ‘Handle’ is not a member of ‘v8’
  429. ../../nan/nan.h:719: error: expected primary-expression before ‘>’ token
  430. ../../nan/nan.h:719: error: ‘error’ was not declared in this scope
  431. ../../nan/nan.h: In function ‘void NanThrowError(const char*, int)’:
  432. ../../nan/nan.h:745: error: no matching function for call to ‘NanThrowError(v8::Local<v8::Value>)’
  433. ../../nan/nan.h:711: note: candidates are: void NanThrowError(const char*)
  434. ../../nan/nan.h:741: note: void NanThrowError(const char*, int)
  435. ../../nan/nan.h: At global scope:
  436. ../../nan/nan.h:757: error: ‘node::smalloc’ has not been declared
  437. ../../nan/nan.h:757: error: expected ‘,’ or ‘...’ before ‘callback’
  438. ../../nan/nan.h: In function ‘v8::Local<v8::Object> NanNewBufferHandle(char*, size_t, int)’:
  439. ../../nan/nan.h:761: error: ‘callback’ was not declared in this scope
  440. ../../nan/nan.h:761: error: ‘hint’ was not declared in this scope
  441. ../../nan/nan.h: In function ‘v8::Local<v8::Object> NanNewBufferHandle(const char*, uint32_t)’:
  442. ../../nan/nan.h:768: error: invalid conversion from ‘const char*’ to ‘char*’
  443. ../../nan/nan.h:768: error: initializing argument 2 of ‘v8::MaybeLocal<v8::Object> node::Buffer::New(v8::Isolate*, char*, size_t)’
  444. ../../nan/nan.h:768: error: conversion from ‘v8::MaybeLocal<v8::Object>’ to non-scalar type ‘v8::Local<v8::Object>’ requested
  445. ../../nan/nan.h: In function ‘v8::Local<v8::Object> NanNewBufferHandle(uint32_t)’:
  446. ../../nan/nan.h:772: error: conversion from ‘v8::MaybeLocal<v8::Object>’ to non-scalar type ‘v8::Local<v8::Object>’ requested
  447. ../../nan/nan.h: In function ‘v8::Local<v8::Object> NanBufferUse(char*, uint32_t)’:
  448. ../../nan/nan.h:779: error: ‘Use’ is not a member of ‘node::Buffer’
  449. ../../nan/nan.h: At global scope:
  450. ../../nan/nan.h:784: error: ‘v8::Handle’ has not been declared
  451. ../../nan/nan.h:784: error: expected ‘,’ or ‘...’ before ‘<’ token
  452. ../../nan/nan.h: In function ‘bool NanHasInstance(const v8::Persistent<v8::FunctionTemplate, v8::NonCopyablePersistentTraits<v8::FunctionTemplate> >&, int)’:
  453. ../../nan/nan.h:786: error: ‘value’ was not declared in this scope
  454. ../../nan/nan.h: At global scope:
  455. ../../nan/nan.h:791: error: ‘v8::Handle’ has not been declared
  456. ../../nan/nan.h:791: error: expected ‘,’ or ‘...’ before ‘<’ token
  457. ../../nan/nan.h: In function ‘v8::Local<v8::Context> NanNewContextHandle(v8::ExtensionConfiguration*, int)’:
  458. ../../nan/nan.h:789: error: default argument missing for parameter 2 of ‘v8::Local<v8::Context> NanNewContextHandle(v8::ExtensionConfiguration*, int)’
  459. ../../nan/nan.h:797: error: ‘tmpl’ was not declared in this scope
  460. ../../nan/nan.h:797: error: ‘obj’ was not declared in this scope
  461. ../../nan/nan.h: In function ‘v8::Local<v8::Script> NanCompileScript(v8::Local<v8::String>, const v8::ScriptOrigin&)’:
  462. ../../nan/nan.h:806: warning: ‘static v8::Local<v8::Script> v8::ScriptCompiler::Compile(v8::Isolate*, v8::ScriptCompiler::Source*, v8::ScriptCompiler::CompileOptions)’ is deprecated (declared at /home/curv/.node-gyp/6.13.1/include/node/v8.h:1352)
  463. ../../nan/nan.h: In function ‘v8::Local<v8::Script> NanCompileScript(v8::Local<v8::String>)’:
  464. ../../nan/nan.h:813: warning: ‘static v8::Local<v8::Script> v8::ScriptCompiler::Compile(v8::Isolate*, v8::ScriptCompiler::Source*, v8::ScriptCompiler::CompileOptions)’ is deprecated (declared at /home/curv/.node-gyp/6.13.1/include/node/v8.h:1352)
  465. ../../nan/nan.h: At global scope:
  466. ../../nan/nan.h:817: error: ‘NanRunScript’ declared as an ‘inline’ variable
  467. ../../nan/nan.h:817: warning: ‘always_inline’ attribute ignored
  468. ../../nan/nan.h:817: error: ‘Handle’ is not a member of ‘v8’
  469. ../../nan/nan.h:817: error: expected primary-expression before ‘>’ token
  470. ../../nan/nan.h:817: error: ‘script’ was not declared in this scope
  471. ../../nan/nan.h:818: error: expected ‘,’ or ‘;’ before ‘{’ token
  472. ../../nan/nan.h:823: error: ‘NanRunScript’ declared as an ‘inline’ variable
  473. ../../nan/nan.h:823: warning: ‘always_inline’ attribute ignored
  474. ../../nan/nan.h:823: error: redefinition of ‘v8::Local<v8::Value> NanRunScript’
  475. ../../nan/nan.h:817: error: ‘v8::Local<v8::Value> NanRunScript’ previously declared here
  476. ../../nan/nan.h:823: error: ‘Handle’ is not a member of ‘v8’
  477. ../../nan/nan.h:823: error: expected primary-expression before ‘>’ token
  478. ../../nan/nan.h:823: error: ‘script’ was not declared in this scope
  479. ../../nan/nan.h:829: error: ‘NanMakeCallback’ declared as an ‘inline’ variable
  480. ../../nan/nan.h:829: warning: ‘always_inline’ attribute ignored
  481. ../../nan/nan.h:829: error: ‘Handle’ is not a member of ‘v8’
  482. ../../nan/nan.h:829: error: expected primary-expression before ‘>’ token
  483. ../../nan/nan.h:829: error: ‘target’ was not declared in this scope
  484. ../../nan/nan.h:830: error: ‘Handle’ is not a member of ‘v8’
  485. ../../nan/nan.h:830: error: expected primary-expression before ‘>’ token
  486. ../../nan/nan.h:830: error: ‘func’ was not declared in this scope
  487. ../../nan/nan.h:831: error: expected primary-expression before ‘int’
  488. ../../nan/nan.h:832: error: ‘Handle’ is not a member of ‘v8’
  489. ../../nan/nan.h:832: error: expected primary-expression before ‘>’ token
  490. ../../nan/nan.h:832: error: ‘argv’ was not declared in this scope
  491. ../../nan/nan.h:832: error: expected ‘,’ or ‘;’ before ‘{’ token
  492. ../../nan/nan.h:838: error: ‘NanMakeCallback’ declared as an ‘inline’ variable
  493. ../../nan/nan.h:838: warning: ‘always_inline’ attribute ignored
  494. ../../nan/nan.h:838: error: redefinition of ‘v8::Local<v8::Value> NanMakeCallback’
  495. ../../nan/nan.h:829: error: ‘v8::Local<v8::Value> NanMakeCallback’ previously declared here
  496. ../../nan/nan.h:838: error: ‘Handle’ is not a member of ‘v8’
  497. ../../nan/nan.h:838: error: expected primary-expression before ‘>’ token
  498. ../../nan/nan.h:838: error: ‘target’ was not declared in this scope
  499. ../../nan/nan.h:839: error: ‘Handle’ is not a member of ‘v8’
  500. ../../nan/nan.h:839: error: expected primary-expression before ‘>’ token
  501. ../../nan/nan.h:839: error: ‘symbol’ was not declared in this scope
  502. ../../nan/nan.h:840: error: expected primary-expression before ‘int’
  503. ../../nan/nan.h:841: error: ‘Handle’ is not a member of ‘v8’
  504. ../../nan/nan.h:841: error: expected primary-expression before ‘>’ token
  505. ../../nan/nan.h:841: error: ‘argv’ was not declared in this scope
  506. ../../nan/nan.h:847: error: ‘NanMakeCallback’ declared as an ‘inline’ variable
  507. ../../nan/nan.h:847: warning: ‘always_inline’ attribute ignored
  508. ../../nan/nan.h:847: error: redefinition of ‘v8::Local<v8::Value> NanMakeCallback’
  509. ../../nan/nan.h:829: error: ‘v8::Local<v8::Value> NanMakeCallback’ previously declared here
  510. ../../nan/nan.h:847: error: ‘Handle’ is not a member of ‘v8’
  511. ../../nan/nan.h:847: error: expected primary-expression before ‘>’ token
  512. ../../nan/nan.h:847: error: ‘target’ was not declared in this scope
  513. ../../nan/nan.h:848: error: expected primary-expression before ‘const’
  514. ../../nan/nan.h:849: error: expected primary-expression before ‘int’
  515. ../../nan/nan.h:850: error: ‘Handle’ is not a member of ‘v8’
  516. ../../nan/nan.h:850: error: expected primary-expression before ‘>’ token
  517. ../../nan/nan.h:850: error: ‘argv’ was not declared in this scope
  518. ../../nan/nan.h:885: error: expected ‘)’ before ‘<’ token
  519. ../../nan/nan.h:917: error: expected ‘)’ before ‘<’ token
  520. ../../nan/nan.h:948: error: expected ‘)’ before ‘<’ token
  521. ../../nan/nan.h:1599: error: expected unqualified-id before ‘<’ token
  522. ../../nan/nan.h:1599: error: expected ‘)’ before ‘<’ token
  523. ../../nan/nan.h:1599: error: expected ‘;’ before ‘<’ token
  524. ../../nan/nan.h:1606: error: expected ‘;’ before ‘~’ token
  525. ../../nan/nan.h:1626: error: ‘v8::Handle’ has not been declared
  526. ../../nan/nan.h:1626: error: expected ‘,’ or ‘...’ before ‘<’ token
  527. ../../nan/nan.h:1634: error: ‘v8::Handle’ has not been declared
  528. ../../nan/nan.h:1634: error: expected ‘,’ or ‘...’ before ‘<’ token
  529. ../../nan/nan.h:1638: error: expected unqualified-id before ‘<’ token
  530. ../../nan/nan.h:1638: error: expected ‘)’ before ‘<’ token
  531. ../../nan/nan.h:1638: error: expected ‘;’ before ‘<’ token
  532. ../../nan/nan.h:1643: error: expected ‘;’ before ‘inline’
  533. ../../nan/nan.h:1655: error: ‘v8::Handle’ has not been declared
  534. ../../nan/nan.h:1655: error: expected ‘,’ or ‘...’ before ‘<’ token
  535. ../../nan/nan.h:1667: error: ‘v8::Handle’ has not been declared
  536. ../../nan/nan.h:1667: error: expected ‘,’ or ‘...’ before ‘<’ token
  537. ../../nan/nan.h:1683: error: ‘v8::Handle’ has not been declared
  538. ../../nan/nan.h:1683: error: expected ‘,’ or ‘...’ before ‘<’ token
  539. ../../nan/nan.h:1632: error: default argument missing for parameter 2 of ‘v8::Local<v8::Value> NanCallback::operator()(int, int) const’
  540. ../../nan/nan.h: In constructor ‘NanCallback::NanCallback()’:
  541. ../../nan/nan.h:1596: error: no matching function for call to ‘NanAssignPersistent(v8::Persistent<v8::Object, v8::NonCopyablePersistentTraits<v8::Object> >&, v8::Local<v8::Object>&)’
  542. ../../nan/nan.h: In member function ‘v8::Local<v8::Value> NanCallback::operator()(int) const’:
  543. ../../nan/nan.h:1629: error: ‘target’ was not declared in this scope
  544. ../../nan/nan.h:1629: error: ‘argc’ was not declared in this scope
  545. ../../nan/nan.h:1629: error: ‘argv’ was not declared in this scope
  546. ../../nan/nan.h: In member function ‘v8::Local<v8::Value> NanCallback::operator()(int, int) const’:
  547. ../../nan/nan.h:1635: error: ‘argv’ was not declared in this scope
  548. ../../nan/nan.h: In member function ‘v8::Local<v8::Value> NanCallback::Call(int) const’:
  549. ../../nan/nan.h:1660: error: ‘target’ was not declared in this scope
  550. ../../nan/nan.h:1660: error: ‘argc’ was not declared in this scope
  551. ../../nan/nan.h:1660: error: ‘argv’ was not declared in this scope
  552. ../../nan/nan.h: In member function ‘v8::Local<v8::Value> NanCallback::Call(int, int) const’:
  553. ../../nan/nan.h:1670: error: ‘argv’ was not declared in this scope
  554. ../../nan/nan.h: In member function ‘v8::Local<v8::Value> NanCallback::Call_(v8::Isolate*, int) const’:
  555. ../../nan/nan.h:1690: error: ‘target’ was not declared in this scope
  556. ../../nan/nan.h:1690: error: ‘argc’ was not declared in this scope
  557. ../../nan/nan.h:1690: error: ‘argv’ was not declared in this scope
  558. ../../nan/nan.h: At global scope:
  559. ../../nan/nan.h:1763: error: expected unqualified-id before ‘<’ token
  560. ../../nan/nan.h:1763: error: expected ‘)’ before ‘<’ token
  561. ../../nan/nan.h:1763: error: expected ‘;’ before ‘<’ token
  562. ../../nan/nan.h:1768: error: expected ‘;’ before ‘inline’
  563. ../../nan/nan.h: In constructor ‘NanAsyncWorker::NanAsyncWorker(NanCallback*)’:
  564. ../../nan/nan.h:1731: error: no matching function for call to ‘NanAssignPersistent(v8::Persistent<v8::Object, v8::NonCopyablePersistentTraits<v8::Object> >&, v8::Local<v8::Object>&)’
  565. ../../nan/nan.h: In member function ‘virtual void NanAsyncWorker::HandleErrorCallback()’:
  566. ../../nan/nan.h:1814: error: invalid conversion from ‘v8::Local<v8::Value>*’ to ‘int’
  567. ../../nan/nan.h:1814: error: initializing argument 2 of ‘v8::Local<v8::Value> NanCallback::Call(int, int) const’
  568. ../../nan/nan.h: At global scope:
  569. ../../nan/nan.h:2109: error: ‘Handle’ is not a member of ‘v8’
  570. ../../nan/nan.h:2109: error: expected primary-expression before ‘>’ token
  571. ../../nan/nan.h:2109: error: ‘val’ was not declared in this scope
  572. ../../nan/nan.h:2110: error: expected primary-expression before ‘const’
  573. ../../nan/nan.h:2111: error: expected primary-expression before ‘*’ token
  574. ../../nan/nan.h:2111: error: ‘len’ was not declared in this scope
  575. ../../nan/nan.h:2112: error: initializer expression list treated as compound expression
  576. ../../nan/nan.h:2112: error: expected ‘,’ or ‘;’ before ‘{’ token
  577. ../../nan/nan.h:2109: warning: ‘_NanGetExternalParts’ defined but not used
  578. make: *** [Release/obj.target/lwip_decoder/src/decoder/init.o] Error 1
  579. make: Leaving directory `/home/curv/tmp/nodebb/node_modules/lwip/build'
  580. gyp ERR! build error
  581. gyp ERR! stack Error: `make` failed with exit code: 2
  582. gyp ERR! stack at ChildProcess.onExit (/package/host/localhost/nodejs-6.13.1/lib/node_modules/npm/node_modules/node-gyp/lib/build.js:276:23)
  583. gyp ERR! stack at emitTwo (events.js:106:13)
  584. gyp ERR! stack at ChildProcess.emit (events.js:191:7)
  585. gyp ERR! stack at Process.ChildProcess._handle.onexit (internal/child_process.js:219:12)
  586. gyp ERR! System Linux 2.6.32-696.18.7.el6.x86_64
  587. gyp ERR! command "/package/host/localhost/nodejs-6.13.1/bin/node" "/package/host/localhost/nodejs-6.13.1/lib/node_modules/npm/node_modules/node-gyp/bin/node-gyp.js" "rebuild"
  588. gyp ERR! cwd /home/curv/tmp/nodebb/node_modules/lwip
  589. gyp ERR! node -v v6.13.1
  590. gyp ERR! node-gyp -v v3.4.0
  591. gyp ERR! not ok
  592. info Visit https://yarnpkg.com/en/docs/cli/install for documentation about this command.
  593. ]0;curv@vulpecula:~/tmp/nodebb
  594. [11.Apr 16:55:10] --- [~/tmp/nodebb] ---
  595. curv@vulpecula: % exit
  596.  
  597. Script done on Wed 11 Apr 2018 04:55:18 PM CEST
RAW Paste Data