Advertisement
Guest User

Untitled

a guest
Feb 25th, 2016
152
Never
Not a member of Pastebin yet? Sign Up, it unlocks many cool features!
text 2.12 KB | None
  1. python -c++ -modern -outdir QuantLib \
  2. -o QuantLib/quantlib_wrap.cpp ../SWIG/quantlib.i
  3. File "<string>", line 1
  4. ++
  5. ^
  6. SyntaxError: invalid syntax
  7. make: [QuantLib/quantlib_wrap.cpp] Error 1 (ignored)
  8. python -c++ -modern -outdir QuantLib \
  9. -o QuantLib/quantlib_wrap.cpp ../SWIG/quantlib.i
  10. File "<string>", line 1
  11. ++
  12. ^
  13. SyntaxError: invalid syntax
  14. make: [QuantLib/QuantLib.py] Error 1 (ignored)
  15. /Applications/Xcode.app/Contents/Developer/usr/bin/make install-am
  16. python -c++ -modern -outdir QuantLib \
  17. -o QuantLib/quantlib_wrap.cpp ../SWIG/quantlib.i
  18. File "<string>", line 1
  19. ++
  20. ^
  21. SyntaxError: invalid syntax
  22. make[1]: [QuantLib/quantlib_wrap.cpp] Error 1 (ignored)
  23. python -c++ -modern -outdir QuantLib \
  24. -o QuantLib/quantlib_wrap.cpp ../SWIG/quantlib.i
  25. File "<string>", line 1
  26. ++
  27. ^
  28. SyntaxError: invalid syntax
  29. make[1]: [QuantLib/QuantLib.py] Error 1 (ignored)
  30. CXXFLAGS="-g -O2 -fno-strict-aliasing -Wno-unused -Wno-uninitialized -Wno-sign-compare -Wno-write-strings" /usr/bin/python setup.py build
  31. running build
  32. running build_py
  33. file QuantLib/QuantLib.py (for module QuantLib.QuantLib) not found
  34. file QuantLib/QuantLib.py (for module QuantLib.QuantLib) not found
  35. running build_ext
  36. building 'QuantLib._QuantLib' extension
  37. cc -fno-strict-aliasing -fno-common -dynamic -arch x86_64 -arch i386 -g -Os -pipe -fno-common -fno-strict-aliasing -fwrapv -DENABLE_DTRACE -DMACOSX -DNDEBUG -Wall -Wstrict-prototypes -Wshorten-64-to-32 -DNDEBUG -g -fwrapv -Os -Wall -Wstrict-prototypes -DENABLE_DTRACE -arch x86_64 -arch i386 -pipe -I/System/Library/Frameworks/Python.framework/Versions/2.7/include/python2.7 -I/opt/local/include -I/opt/local/include -c QuantLib/quantlib_wrap.cpp -o build/temp.macosx-10.11-intel-2.7/QuantLib/quantlib_wrap.o -Wno-unused -g -O2 -fno-strict-aliasing -Wno-unused -Wno-uninitialized -Wno-sign-compare -Wno-write-strings
  38. clang: error: no such file or directory: 'QuantLib/quantlib_wrap.cpp'
  39. clang: error: no input files
  40. error: command 'cc' failed with exit status 1
  41. make[1]: *** [.build-stamp] Error 1
  42. make: *** [install] Error 2
Advertisement
RAW Paste Data Copied
Advertisement