daily pastebin goal
1%
SHARE
TWEET

libcaca build log

geekt Jun 13th, 2017 262 Never
Not a member of Pastebin yet? Sign Up, it unlocks many cool features!
  1.  * Package:    media-libs/libcaca-0.99_beta19
  2.  * Repository: gentoo
  3.  * Maintainer: media-video@gentoo.org
  4.  * USE:        X abi_x86_64 amd64 cxx elibc_glibc kernel_linux ncurses opengl python python_targets_python2_7 ruby_targets_ruby21 ruby_targets_ruby22 ruby_targets_ruby23 ruby_targets_ruby24 truetype userland_GNU
  5.  * FEATURES:   preserve-libs sandbox userpriv usersandbox
  6. >>> Unpacking source...
  7. >>> Unpacking libcaca-0.99.beta19.tar.gz to /var/tmp/portage/media-libs/libcaca-0.99_beta19/work
  8. >>> Source unpacked in /var/tmp/portage/media-libs/libcaca-0.99_beta19/work
  9. >>> Preparing source in /var/tmp/portage/media-libs/libcaca-0.99_beta19/work/libcaca-0.99.beta19 ...
  10.  * Applying libcaca-0.99_beta18-latex_hacks.patch ...
  11.  [ ok ]
  12.  * Applying libcaca-0.99_beta18-fix-tests.patch ...
  13.  [ ok ]
  14.  * Running eautoreconf in '/var/tmp/portage/media-libs/libcaca-0.99_beta19/work/libcaca-0.99.beta19' ...
  15.  * Running libtoolize --install --copy --force --automake ...
  16.  [ ok ]
  17.  * Running aclocal ...
  18.  [ ok ]
  19.  * Running autoconf --force ...
  20.  [ ok ]
  21.  * Running autoheader ...
  22.  [ ok ]
  23.  * Running automake --add-missing --copy --foreign --force-missing ...
  24.  [ ok ]
  25.  * Running elibtoolize in: libcaca-0.99.beta19/
  26.  * Running elibtoolize in: libcaca-0.99.beta19/.auto/
  27.  *   Applying portage/1.2.0 patch ...
  28.  *   Applying sed/1.5.6 patch ...
  29.  *   Applying as-needed/2.4.3 patch ...
  30. >>> Source prepared.
  31. >>> Configuring source in /var/tmp/portage/media-libs/libcaca-0.99_beta19/work/libcaca-0.99.beta19 ...
  32.  * abi_x86_64.amd64: running multilib-minimal_abi_src_configure
  33.  * econf: updating libcaca-0.99.beta19/.auto/config.guess with /usr/share/gnuconfig/config.guess
  34.  * econf: updating libcaca-0.99.beta19/.auto/config.sub with /usr/share/gnuconfig/config.sub
  35. /var/tmp/portage/media-libs/libcaca-0.99_beta19/work/libcaca-0.99.beta19/configure --prefix=/usr --build=x86_64-pc-linux-gnu --host=x86_64-pc-linux-gnu --mandir=/usr/share/man --infodir=/usr/share/info --datadir=/usr/share --sysconfdir=/etc --localstatedir=/var/lib --disable-dependency-tracking --disable-silent-rules --libdir=/usr/lib64 --disable-static --disable-slang --enable-ncurses --enable-x11 --with-x --x-libraries=/usr/lib64 --enable-gl --enable-cxx --disable-imlib2 --disable-cppunit --disable-java --disable-ruby --enable-python --disable-csharp --disable-doc
  36. checking build system type... x86_64-pc-linux-gnu
  37. checking host system type... x86_64-pc-linux-gnu
  38. checking target system type... x86_64-pc-linux-gnu
  39. checking for a BSD-compatible install... /usr/lib/portage/python3.5/ebuild-helpers/xattr/install -c
  40. checking whether build environment is sane... yes
  41. checking for a thread-safe mkdir -p... /bin/mkdir -p
  42. checking for gawk... gawk
  43. checking whether make sets $(MAKE)... yes
  44. checking whether make supports nested variables... yes
  45. checking whether UID '250' is supported by ustar format... yes
  46. checking whether GID '250' is supported by ustar format... yes
  47. checking how to create a ustar tar archive... gnutar
  48. checking for style of include used by make... GNU
  49. checking for x86_64-pc-linux-gnu-gcc... x86_64-pc-linux-gnu-gcc
  50. checking whether the C compiler works... yes
  51. checking for C compiler default output file name... a.out
  52. checking for suffix of executables...
  53. checking whether we are cross compiling... no
  54. checking for suffix of object files... o
  55. checking whether we are using the GNU C compiler... yes
  56. checking whether x86_64-pc-linux-gnu-gcc accepts -g... yes
  57. checking for x86_64-pc-linux-gnu-gcc option to accept ISO C89... none needed
  58. checking whether x86_64-pc-linux-gnu-gcc understands -c and -o together... yes
  59. checking dependency style of x86_64-pc-linux-gnu-gcc... none
  60. checking how to run the C preprocessor... x86_64-pc-linux-gnu-gcc -E
  61. checking for x86_64-pc-linux-gnu-g++... x86_64-pc-linux-gnu-g++
  62. checking whether we are using the GNU C++ compiler... yes
  63. checking whether x86_64-pc-linux-gnu-g++ accepts -g... yes
  64. checking dependency style of x86_64-pc-linux-gnu-g++... none
  65. checking how to run the C++ preprocessor... x86_64-pc-linux-gnu-g++ -E
  66. checking dependency style of ... none
  67. checking dependency style of x86_64-pc-linux-gnu-gcc... none
  68. checking how to print strings... printf
  69. checking for a sed that does not truncate output... /bin/sed
  70. checking for grep that handles long lines and -e... /bin/grep
  71. checking for egrep... /bin/grep -E
  72. checking for fgrep... /bin/grep -F
  73. checking for ld used by x86_64-pc-linux-gnu-gcc... /usr/x86_64-pc-linux-gnu/bin/ld
  74. checking if the linker (/usr/x86_64-pc-linux-gnu/bin/ld) is GNU ld... yes
  75. checking for BSD- or MS-compatible name lister (nm)... /usr/bin/x86_64-pc-linux-gnu-nm -B
  76. checking the name lister (/usr/bin/x86_64-pc-linux-gnu-nm -B) interface... BSD nm
  77. checking whether ln -s works... yes
  78. checking the maximum length of command line arguments... 1572864
  79. checking how to convert x86_64-pc-linux-gnu file names to x86_64-pc-linux-gnu format... func_convert_file_noop
  80. checking how to convert x86_64-pc-linux-gnu file names to toolchain format... func_convert_file_noop
  81. checking for /usr/x86_64-pc-linux-gnu/bin/ld option to reload object files... -r
  82. checking for x86_64-pc-linux-gnu-objdump... objdump
  83. checking how to recognize dependent libraries... pass_all
  84. checking for x86_64-pc-linux-gnu-dlltool... dlltool
  85. checking how to associate runtime and link libraries... printf %s\n
  86. checking for x86_64-pc-linux-gnu-ar... x86_64-pc-linux-gnu-ar
  87. checking for archiver @FILE support... @
  88. checking for x86_64-pc-linux-gnu-strip... x86_64-pc-linux-gnu-strip
  89. checking for x86_64-pc-linux-gnu-ranlib... x86_64-pc-linux-gnu-ranlib
  90. checking command to parse /usr/bin/x86_64-pc-linux-gnu-nm -B output from x86_64-pc-linux-gnu-gcc object... ok
  91. checking for sysroot... no
  92. checking for a working dd... /bin/dd
  93. checking how to truncate binary pipes... /bin/dd bs=4096 count=1
  94. checking for x86_64-pc-linux-gnu-mt... no
  95. checking for mt... no
  96. checking if : is a manifest tool... no
  97. checking for ANSI C header files... yes
  98. checking for sys/types.h... yes
  99. checking for sys/stat.h... yes
  100. checking for stdlib.h... yes
  101. checking for string.h... yes
  102. checking for memory.h... yes
  103. checking for strings.h... yes
  104. checking for inttypes.h... yes
  105. checking for stdint.h... yes
  106. checking for unistd.h... yes
  107. checking for dlfcn.h... yes
  108. checking for objdir... .libs
  109. checking if x86_64-pc-linux-gnu-gcc supports -fno-rtti -fno-exceptions... no
  110. checking for x86_64-pc-linux-gnu-gcc option to produce PIC... -fPIC -DPIC
  111. checking if x86_64-pc-linux-gnu-gcc PIC flag -fPIC -DPIC works... yes
  112. checking if x86_64-pc-linux-gnu-gcc static flag -static works... yes
  113. checking if x86_64-pc-linux-gnu-gcc supports -c -o file.o... yes
  114. checking if x86_64-pc-linux-gnu-gcc supports -c -o file.o... (cached) yes
  115. checking whether the x86_64-pc-linux-gnu-gcc linker (/usr/x86_64-pc-linux-gnu/bin/ld -m elf_x86_64) supports shared libraries... yes
  116. checking whether -lc should be explicitly linked in... no
  117. checking dynamic linker characteristics... GNU/Linux ld.so
  118. checking how to hardcode library paths into programs... immediate
  119. checking whether stripping libraries is possible... yes
  120. checking if libtool supports shared libraries... yes
  121. checking whether to build shared libraries... yes
  122. checking whether to build static libraries... no
  123. checking how to run the C++ preprocessor... x86_64-pc-linux-gnu-g++ -E
  124. checking for ld used by x86_64-pc-linux-gnu-g++... /usr/x86_64-pc-linux-gnu/bin/ld -m elf_x86_64
  125. checking if the linker (/usr/x86_64-pc-linux-gnu/bin/ld -m elf_x86_64) is GNU ld... yes
  126. checking whether the x86_64-pc-linux-gnu-g++ linker (/usr/x86_64-pc-linux-gnu/bin/ld -m elf_x86_64) supports shared libraries... yes
  127. checking for x86_64-pc-linux-gnu-g++ option to produce PIC... -fPIC -DPIC
  128. checking if x86_64-pc-linux-gnu-g++ PIC flag -fPIC -DPIC works... yes
  129. checking if x86_64-pc-linux-gnu-g++ static flag -static works... yes
  130. checking if x86_64-pc-linux-gnu-g++ supports -c -o file.o... yes
  131. checking if x86_64-pc-linux-gnu-g++ supports -c -o file.o... (cached) yes
  132. checking whether the x86_64-pc-linux-gnu-g++ linker (/usr/x86_64-pc-linux-gnu/bin/ld -m elf_x86_64) supports shared libraries... yes
  133. checking dynamic linker characteristics... (cached) GNU/Linux ld.so
  134. checking how to hardcode library paths into programs... immediate
  135. checking for an ANSI C-conforming const... yes
  136. checking for inline... inline
  137. checking return type of signal handlers... void
  138. checking for x86_64-pc-linux-gnu-pkg-config... /usr/bin/x86_64-pc-linux-gnu-pkg-config
  139. checking pkg-config is at least version 0.9.0... yes
  140. checking for suffix of libraries... .so.0
  141. checking stdio.h usability... yes
  142. checking stdio.h presence... yes
  143. checking for stdio.h... yes
  144. checking stdarg.h usability... yes
  145. checking stdarg.h presence... yes
  146. checking for stdarg.h... yes
  147. checking signal.h usability... yes
  148. checking signal.h presence... yes
  149. checking for signal.h... yes
  150. checking sys/ioctl.h usability... yes
  151. checking sys/ioctl.h presence... yes
  152. checking for sys/ioctl.h... yes
  153. checking sys/time.h usability... yes
  154. checking sys/time.h presence... yes
  155. checking for sys/time.h... yes
  156. checking endian.h usability... yes
  157. checking endian.h presence... yes
  158. checking for endian.h... yes
  159. checking for unistd.h... (cached) yes
  160. checking arpa/inet.h usability... yes
  161. checking arpa/inet.h presence... yes
  162. checking for arpa/inet.h... yes
  163. checking netinet/in.h usability... yes
  164. checking netinet/in.h presence... yes
  165. checking for netinet/in.h... yes
  166. checking winsock2.h usability... no
  167. checking winsock2.h presence... no
  168. checking for winsock2.h... no
  169. checking errno.h usability... yes
  170. checking errno.h presence... yes
  171. checking for errno.h... yes
  172. checking locale.h usability... yes
  173. checking locale.h presence... yes
  174. checking for locale.h... yes
  175. checking getopt.h usability... yes
  176. checking getopt.h presence... yes
  177. checking for getopt.h... yes
  178. checking for dlfcn.h... (cached) yes
  179. checking termios.h usability... yes
  180. checking termios.h presence... yes
  181. checking for termios.h... yes
  182. checking for signal... yes
  183. checking for ioctl... yes
  184. checking for snprintf... yes
  185. checking for sprintf_s... no
  186. checking for vsnprintf... yes
  187. checking for vsnprintf_s... no
  188. checking for getenv... yes
  189. checking for putenv... yes
  190. checking for strcasecmp... yes
  191. checking for htons... yes
  192. checking for usleep... yes
  193. checking for gettimeofday... yes
  194. checking for atexit... yes
  195. checking for getopt_long... yes
  196. checking for Sleep... no
  197. checking for fsin/fcos... yes
  198. checking for fldln2/fxch/fyl2x... yes
  199. checking zlib.h usability... yes
  200. checking zlib.h presence... yes
  201. checking for zlib.h... yes
  202. checking for gzopen in -lz... yes
  203. checking for sin in -lm... yes
  204. checking conio.h usability... no
  205. checking conio.h presence... no
  206. checking for conio.h... no
  207. checking windows.h usability... no
  208. checking windows.h presence... no
  209. checking for windows.h... no
  210. checking for X... libraries /usr/lib64, headers
  211. checking for XOpenDisplay in -lX11... yes
  212. checking X11/XKBlib.h usability... yes
  213. checking X11/XKBlib.h presence... yes
  214. checking for X11/XKBlib.h... yes
  215. checking GL/gl.h usability... yes
  216. checking GL/gl.h presence... yes
  217. checking for GL/gl.h... yes
  218. checking GL/glut.h usability... yes
  219. checking GL/glut.h presence... yes
  220. checking for GL/glut.h... yes
  221. checking for glutCloseFunc in -lglut... yes
  222. checking for glutMainLoopEvent in -lglut... yes
  223. checking for glutCheckLoop in -lglut... no
  224. checking for FTGL... yes
  225. checking Cocoa/Cocoa.h usability... no
  226. checking Cocoa/Cocoa.h presence... no
  227. checking for Cocoa/Cocoa.h... no
  228. checking ncursesw/ncurses.h usability... yes
  229. checking ncursesw/ncurses.h presence... yes
  230. checking for ncursesw/ncurses.h... yes
  231. checking for initscr in -lncursesw... yes
  232. checking for resizeterm... yes
  233. checking for resize_term... yes
  234. checking valid output drivers... x11 gl ncurses
  235. checking working <iostream>... yes
  236. checking whether /usr/bin/python2.7 version is >= 2.2... yes
  237. checking for /usr/bin/python2.7 version... 2.7
  238. checking for /usr/bin/python2.7 platform... linux2
  239. checking for /usr/bin/python2.7 script directory... ${prefix}/lib64/python2.7/site-packages
  240. checking for /usr/bin/python2.7 extension module directory... ${exec_prefix}/lib64/python2.7/site-packages
  241. checking available language bindings... C++
  242. checking sys/socket.h usability... yes
  243. checking sys/socket.h presence... yes
  244. checking for sys/socket.h... yes
  245. checking for PANGOFT2... yes
  246. checking for CPPUNIT... yes
  247. checking for zzuf... no
  248. checking that generated files are newer than configure... done
  249. configure: creating ./config.status
  250. config.status: creating Makefile
  251. config.status: creating kernel/Makefile
  252. config.status: creating caca/Makefile
  253. config.status: creating src/Makefile
  254. config.status: creating examples/Makefile
  255. config.status: creating test/Makefile
  256. config.status: creating tools/Makefile
  257. config.status: creating java/Makefile
  258. config.status: creating caca-sharp/Makefile
  259. config.status: creating cxx/Makefile
  260. config.status: creating python/Makefile
  261. config.status: creating ruby/Makefile
  262. config.status: creating doc/Makefile
  263. config.status: creating win32/Makefile
  264. config.status: creating caca/caca.pc
  265. config.status: creating caca-sharp/caca-sharp.dll.config
  266. config.status: creating cxx/caca++.pc
  267. config.status: creating doc/doxygen.cfg
  268. config.status: creating caca-config
  269. config.status: creating config.h
  270. config.status: executing depfiles commands
  271. config.status: executing libtool commands
  272. >>> Source configured.
  273. >>> Compiling source in /var/tmp/portage/media-libs/libcaca-0.99_beta19/work/libcaca-0.99.beta19 ...
  274.  * abi_x86_64.amd64: running multilib-minimal_abi_src_compile
  275. make -j9 -l8 V=1
  276. make  all-recursive
  277. make[1]: Entering directory '/var/tmp/portage/media-libs/libcaca-0.99_beta19/work/libcaca-0.99.beta19-abi_x86_64.amd64'
  278. Making all in kernel
  279. make[2]: Entering directory '/var/tmp/portage/media-libs/libcaca-0.99_beta19/work/libcaca-0.99.beta19-abi_x86_64.amd64/kernel'
  280. make[2]: Nothing to be done for 'all'.
  281. make[2]: Leaving directory '/var/tmp/portage/media-libs/libcaca-0.99_beta19/work/libcaca-0.99.beta19-abi_x86_64.amd64/kernel'
  282. Making all in caca
  283. make[2]: Entering directory '/var/tmp/portage/media-libs/libcaca-0.99_beta19/work/libcaca-0.99.beta19-abi_x86_64.amd64/caca'
  284. /bin/sh ../libtool  --tag=CC   --mode=compile x86_64-pc-linux-gnu-gcc -DHAVE_CONFIG_H -I. -I/var/tmp/portage/media-libs/libcaca-0.99_beta19/work/libcaca-0.99.beta19/caca -I..  -I/var/tmp/portage/media-libs/libcaca-0.99_beta19/work/libcaca-0.99.beta19 -DPLUGINDIR=\"\"    -I/usr/include/FTGL -I/usr/include/freetype2   -D__LIBCACA__   -march=sandybridge -O2 -pipe  -Wall -Wpointer-arith -Wcast-align -Wcast-qual -Wstrict-prototypes -Wshadow -Waggregate-return -Wmissing-prototypes -Wnested-externs -Wsign-compare -c -o libcaca_la-caca.lo `test -f 'caca.c' || echo '/var/tmp/portage/media-libs/libcaca-0.99_beta19/work/libcaca-0.99.beta19/caca/'`caca.c
  285. /bin/sh ../libtool  --tag=CC   --mode=compile x86_64-pc-linux-gnu-gcc -DHAVE_CONFIG_H -I. -I/var/tmp/portage/media-libs/libcaca-0.99_beta19/work/libcaca-0.99.beta19/caca -I..  -I/var/tmp/portage/media-libs/libcaca-0.99_beta19/work/libcaca-0.99.beta19 -DPLUGINDIR=\"\"    -I/usr/include/FTGL -I/usr/include/freetype2   -D__LIBCACA__   -march=sandybridge -O2 -pipe  -Wall -Wpointer-arith -Wcast-align -Wcast-qual -Wstrict-prototypes -Wshadow -Waggregate-return -Wmissing-prototypes -Wnested-externs -Wsign-compare -c -o libcaca_la-caca_conio.lo `test -f 'caca_conio.c' || echo '/var/tmp/portage/media-libs/libcaca-0.99_beta19/work/libcaca-0.99.beta19/caca/'`caca_conio.c
  286. /bin/sh ../libtool  --tag=CC   --mode=compile x86_64-pc-linux-gnu-gcc -DHAVE_CONFIG_H -I. -I/var/tmp/portage/media-libs/libcaca-0.99_beta19/work/libcaca-0.99.beta19/caca -I..  -I/var/tmp/portage/media-libs/libcaca-0.99_beta19/work/libcaca-0.99.beta19 -DPLUGINDIR=\"\"    -I/usr/include/FTGL -I/usr/include/freetype2   -D__LIBCACA__   -march=sandybridge -O2 -pipe  -Wall -Wpointer-arith -Wcast-align -Wcast-qual -Wstrict-prototypes -Wshadow -Waggregate-return -Wmissing-prototypes -Wnested-externs -Wsign-compare -c -o libcaca_la-caca0.lo `test -f 'caca0.c' || echo '/var/tmp/portage/media-libs/libcaca-0.99_beta19/work/libcaca-0.99.beta19/caca/'`caca0.c
  287. /bin/sh ../libtool  --tag=CC   --mode=compile x86_64-pc-linux-gnu-gcc -DHAVE_CONFIG_H -I. -I/var/tmp/portage/media-libs/libcaca-0.99_beta19/work/libcaca-0.99.beta19/caca -I..  -I/var/tmp/portage/media-libs/libcaca-0.99_beta19/work/libcaca-0.99.beta19 -DPLUGINDIR=\"\"    -I/usr/include/FTGL -I/usr/include/freetype2   -D__LIBCACA__   -march=sandybridge -O2 -pipe  -Wall -Wpointer-arith -Wcast-align -Wcast-qual -Wstrict-prototypes -Wshadow -Waggregate-return -Wmissing-prototypes -Wnested-externs -Wsign-compare -c -o libcaca_la-canvas.lo `test -f 'canvas.c' || echo '/var/tmp/portage/media-libs/libcaca-0.99_beta19/work/libcaca-0.99.beta19/caca/'`canvas.c
  288. /bin/sh ../libtool  --tag=CC   --mode=compile x86_64-pc-linux-gnu-gcc -DHAVE_CONFIG_H -I. -I/var/tmp/portage/media-libs/libcaca-0.99_beta19/work/libcaca-0.99.beta19/caca -I..  -I/var/tmp/portage/media-libs/libcaca-0.99_beta19/work/libcaca-0.99.beta19 -DPLUGINDIR=\"\"    -I/usr/include/FTGL -I/usr/include/freetype2   -D__LIBCACA__   -march=sandybridge -O2 -pipe  -Wall -Wpointer-arith -Wcast-align -Wcast-qual -Wstrict-prototypes -Wshadow -Waggregate-return -Wmissing-prototypes -Wnested-externs -Wsign-compare -c -o libcaca_la-dirty.lo `test -f 'dirty.c' || echo '/var/tmp/portage/media-libs/libcaca-0.99_beta19/work/libcaca-0.99.beta19/caca/'`dirty.c
  289. /bin/sh ../libtool  --tag=CC   --mode=compile x86_64-pc-linux-gnu-gcc -DHAVE_CONFIG_H -I. -I/var/tmp/portage/media-libs/libcaca-0.99_beta19/work/libcaca-0.99.beta19/caca -I..  -I/var/tmp/portage/media-libs/libcaca-0.99_beta19/work/libcaca-0.99.beta19 -DPLUGINDIR=\"\"    -I/usr/include/FTGL -I/usr/include/freetype2   -D__LIBCACA__   -march=sandybridge -O2 -pipe  -Wall -Wpointer-arith -Wcast-align -Wcast-qual -Wstrict-prototypes -Wshadow -Waggregate-return -Wmissing-prototypes -Wnested-externs -Wsign-compare -c -o libcaca_la-string.lo `test -f 'string.c' || echo '/var/tmp/portage/media-libs/libcaca-0.99_beta19/work/libcaca-0.99.beta19/caca/'`string.c
  290. /bin/sh ../libtool  --tag=CC   --mode=compile x86_64-pc-linux-gnu-gcc -DHAVE_CONFIG_H -I. -I/var/tmp/portage/media-libs/libcaca-0.99_beta19/work/libcaca-0.99.beta19/caca -I..  -I/var/tmp/portage/media-libs/libcaca-0.99_beta19/work/libcaca-0.99.beta19 -DPLUGINDIR=\"\"    -I/usr/include/FTGL -I/usr/include/freetype2   -D__LIBCACA__   -march=sandybridge -O2 -pipe  -Wall -Wpointer-arith -Wcast-align -Wcast-qual -Wstrict-prototypes -Wshadow -Waggregate-return -Wmissing-prototypes -Wnested-externs -Wsign-compare -c -o libcaca_la-legacy.lo `test -f 'legacy.c' || echo '/var/tmp/portage/media-libs/libcaca-0.99_beta19/work/libcaca-0.99.beta19/caca/'`legacy.c
  291. /bin/sh ../libtool  --tag=CC   --mode=compile x86_64-pc-linux-gnu-gcc -DHAVE_CONFIG_H -I. -I/var/tmp/portage/media-libs/libcaca-0.99_beta19/work/libcaca-0.99.beta19/caca -I..  -I/var/tmp/portage/media-libs/libcaca-0.99_beta19/work/libcaca-0.99.beta19 -DPLUGINDIR=\"\"    -I/usr/include/FTGL -I/usr/include/freetype2   -D__LIBCACA__   -march=sandybridge -O2 -pipe  -Wall -Wpointer-arith -Wcast-align -Wcast-qual -Wstrict-prototypes -Wshadow -Waggregate-return -Wmissing-prototypes -Wnested-externs -Wsign-compare -c -o libcaca_la-transform.lo `test -f 'transform.c' || echo '/var/tmp/portage/media-libs/libcaca-0.99_beta19/work/libcaca-0.99.beta19/caca/'`transform.c
  292. /bin/sh ../libtool  --tag=CC   --mode=compile x86_64-pc-linux-gnu-gcc -DHAVE_CONFIG_H -I. -I/var/tmp/portage/media-libs/libcaca-0.99_beta19/work/libcaca-0.99.beta19/caca -I..  -I/var/tmp/portage/media-libs/libcaca-0.99_beta19/work/libcaca-0.99.beta19 -DPLUGINDIR=\"\"    -I/usr/include/FTGL -I/usr/include/freetype2   -D__LIBCACA__   -march=sandybridge -O2 -pipe  -Wall -Wpointer-arith -Wcast-align -Wcast-qual -Wstrict-prototypes -Wshadow -Waggregate-return -Wmissing-prototypes -Wnested-externs -Wsign-compare -c -o libcaca_la-charset.lo `test -f 'charset.c' || echo '/var/tmp/portage/media-libs/libcaca-0.99_beta19/work/libcaca-0.99.beta19/caca/'`charset.c
  293. libtool: compile:  x86_64-pc-linux-gnu-gcc -DHAVE_CONFIG_H -I. -I/var/tmp/portage/media-libs/libcaca-0.99_beta19/work/libcaca-0.99.beta19/caca -I.. -I/var/tmp/portage/media-libs/libcaca-0.99_beta19/work/libcaca-0.99.beta19 -DPLUGINDIR=\"\" -I/usr/include/FTGL -I/usr/include/freetype2 -D__LIBCACA__ -march=sandybridge -O2 -pipe -Wall -Wpointer-arith -Wcast-align -Wcast-qual -Wstrict-prototypes -Wshadow -Waggregate-return -Wmissing-prototypes -Wnested-externs -Wsign-compare -c /var/tmp/portage/media-libs/libcaca-0.99_beta19/work/libcaca-0.99.beta19/caca/caca.c  -fPIC -DPIC -o .libs/libcaca_la-caca.o
  294. libtool: compile:  x86_64-pc-linux-gnu-gcc -DHAVE_CONFIG_H -I. -I/var/tmp/portage/media-libs/libcaca-0.99_beta19/work/libcaca-0.99.beta19/caca -I.. -I/var/tmp/portage/media-libs/libcaca-0.99_beta19/work/libcaca-0.99.beta19 -DPLUGINDIR=\"\" -I/usr/include/FTGL -I/usr/include/freetype2 -D__LIBCACA__ -march=sandybridge -O2 -pipe -Wall -Wpointer-arith -Wcast-align -Wcast-qual -Wstrict-prototypes -Wshadow -Waggregate-return -Wmissing-prototypes -Wnested-externs -Wsign-compare -c /var/tmp/portage/media-libs/libcaca-0.99_beta19/work/libcaca-0.99.beta19/caca/canvas.c  -fPIC -DPIC -o .libs/libcaca_la-canvas.o
  295. libtool: compile:  x86_64-pc-linux-gnu-gcc -DHAVE_CONFIG_H -I. -I/var/tmp/portage/media-libs/libcaca-0.99_beta19/work/libcaca-0.99.beta19/caca -I.. -I/var/tmp/portage/media-libs/libcaca-0.99_beta19/work/libcaca-0.99.beta19 -DPLUGINDIR=\"\" -I/usr/include/FTGL -I/usr/include/freetype2 -D__LIBCACA__ -march=sandybridge -O2 -pipe -Wall -Wpointer-arith -Wcast-align -Wcast-qual -Wstrict-prototypes -Wshadow -Waggregate-return -Wmissing-prototypes -Wnested-externs -Wsign-compare -c /var/tmp/portage/media-libs/libcaca-0.99_beta19/work/libcaca-0.99.beta19/caca/caca0.c  -fPIC -DPIC -o .libs/libcaca_la-caca0.o
  296. libtool: compile:  x86_64-pc-linux-gnu-gcc -DHAVE_CONFIG_H -I. -I/var/tmp/portage/media-libs/libcaca-0.99_beta19/work/libcaca-0.99.beta19/caca -I.. -I/var/tmp/portage/media-libs/libcaca-0.99_beta19/work/libcaca-0.99.beta19 -DPLUGINDIR=\"\" -I/usr/include/FTGL -I/usr/include/freetype2 -D__LIBCACA__ -march=sandybridge -O2 -pipe -Wall -Wpointer-arith -Wcast-align -Wcast-qual -Wstrict-prototypes -Wshadow -Waggregate-return -Wmissing-prototypes -Wnested-externs -Wsign-compare -c /var/tmp/portage/media-libs/libcaca-0.99_beta19/work/libcaca-0.99.beta19/caca/caca_conio.c  -fPIC -DPIC -o .libs/libcaca_la-caca_conio.o
  297. libtool: compile:  x86_64-pc-linux-gnu-gcc -DHAVE_CONFIG_H -I. -I/var/tmp/portage/media-libs/libcaca-0.99_beta19/work/libcaca-0.99.beta19/caca -I.. -I/var/tmp/portage/media-libs/libcaca-0.99_beta19/work/libcaca-0.99.beta19 -DPLUGINDIR=\"\" -I/usr/include/FTGL -I/usr/include/freetype2 -D__LIBCACA__ -march=sandybridge -O2 -pipe -Wall -Wpointer-arith -Wcast-align -Wcast-qual -Wstrict-prototypes -Wshadow -Waggregate-return -Wmissing-prototypes -Wnested-externs -Wsign-compare -c /var/tmp/portage/media-libs/libcaca-0.99_beta19/work/libcaca-0.99.beta19/caca/dirty.c  -fPIC -DPIC -o .libs/libcaca_la-dirty.o
  298. libtool: compile:  x86_64-pc-linux-gnu-gcc -DHAVE_CONFIG_H -I. -I/var/tmp/portage/media-libs/libcaca-0.99_beta19/work/libcaca-0.99.beta19/caca -I.. -I/var/tmp/portage/media-libs/libcaca-0.99_beta19/work/libcaca-0.99.beta19 -DPLUGINDIR=\"\" -I/usr/include/FTGL -I/usr/include/freetype2 -D__LIBCACA__ -march=sandybridge -O2 -pipe -Wall -Wpointer-arith -Wcast-align -Wcast-qual -Wstrict-prototypes -Wshadow -Waggregate-return -Wmissing-prototypes -Wnested-externs -Wsign-compare -c /var/tmp/portage/media-libs/libcaca-0.99_beta19/work/libcaca-0.99.beta19/caca/string.c  -fPIC -DPIC -o .libs/libcaca_la-string.o
  299. libtool: compile:  x86_64-pc-linux-gnu-gcc -DHAVE_CONFIG_H -I. -I/var/tmp/portage/media-libs/libcaca-0.99_beta19/work/libcaca-0.99.beta19/caca -I.. -I/var/tmp/portage/media-libs/libcaca-0.99_beta19/work/libcaca-0.99.beta19 -DPLUGINDIR=\"\" -I/usr/include/FTGL -I/usr/include/freetype2 -D__LIBCACA__ -march=sandybridge -O2 -pipe -Wall -Wpointer-arith -Wcast-align -Wcast-qual -Wstrict-prototypes -Wshadow -Waggregate-return -Wmissing-prototypes -Wnested-externs -Wsign-compare -c /var/tmp/portage/media-libs/libcaca-0.99_beta19/work/libcaca-0.99.beta19/caca/transform.c  -fPIC -DPIC -o .libs/libcaca_la-transform.o
  300. libtool: compile:  x86_64-pc-linux-gnu-gcc -DHAVE_CONFIG_H -I. -I/var/tmp/portage/media-libs/libcaca-0.99_beta19/work/libcaca-0.99.beta19/caca -I.. -I/var/tmp/portage/media-libs/libcaca-0.99_beta19/work/libcaca-0.99.beta19 -DPLUGINDIR=\"\" -I/usr/include/FTGL -I/usr/include/freetype2 -D__LIBCACA__ -march=sandybridge -O2 -pipe -Wall -Wpointer-arith -Wcast-align -Wcast-qual -Wstrict-prototypes -Wshadow -Waggregate-return -Wmissing-prototypes -Wnested-externs -Wsign-compare -c /var/tmp/portage/media-libs/libcaca-0.99_beta19/work/libcaca-0.99.beta19/caca/charset.c  -fPIC -DPIC -o .libs/libcaca_la-charset.o
  301. /var/tmp/portage/media-libs/libcaca-0.99_beta19/work/libcaca-0.99.beta19/caca/string.c: In function ‘caca_blit’:
  302. /var/tmp/portage/media-libs/libcaca-0.99_beta19/work/libcaca-0.99.beta19/caca/string.c:458:51: warning: variable ‘bleed_left’ set but not used [-Wunused-but-set-variable]
  303.      int i, j, starti, startj, endi, endj, stride, bleed_left, bleed_right;
  304.                                                    ^
  305. libtool: compile:  x86_64-pc-linux-gnu-gcc -DHAVE_CONFIG_H -I. -I/var/tmp/portage/media-libs/libcaca-0.99_beta19/work/libcaca-0.99.beta19/caca -I.. -I/var/tmp/portage/media-libs/libcaca-0.99_beta19/work/libcaca-0.99.beta19 -DPLUGINDIR=\"\" -I/usr/include/FTGL -I/usr/include/freetype2 -D__LIBCACA__ -march=sandybridge -O2 -pipe -Wall -Wpointer-arith -Wcast-align -Wcast-qual -Wstrict-prototypes -Wshadow -Waggregate-return -Wmissing-prototypes -Wnested-externs -Wsign-compare -c /var/tmp/portage/media-libs/libcaca-0.99_beta19/work/libcaca-0.99.beta19/caca/legacy.c  -fPIC -DPIC -o .libs/libcaca_la-legacy.o
  306. /bin/sh ../libtool  --tag=CC   --mode=compile x86_64-pc-linux-gnu-gcc -DHAVE_CONFIG_H -I. -I/var/tmp/portage/media-libs/libcaca-0.99_beta19/work/libcaca-0.99.beta19/caca -I..  -I/var/tmp/portage/media-libs/libcaca-0.99_beta19/work/libcaca-0.99.beta19 -DPLUGINDIR=\"\"    -I/usr/include/FTGL -I/usr/include/freetype2   -D__LIBCACA__   -march=sandybridge -O2 -pipe  -Wall -Wpointer-arith -Wcast-align -Wcast-qual -Wstrict-prototypes -Wshadow -Waggregate-return -Wmissing-prototypes -Wnested-externs -Wsign-compare -c -o libcaca_la-attr.lo `test -f 'attr.c' || echo '/var/tmp/portage/media-libs/libcaca-0.99_beta19/work/libcaca-0.99.beta19/caca/'`attr.c
  307. /bin/sh ../libtool  --tag=CC   --mode=compile x86_64-pc-linux-gnu-gcc -DHAVE_CONFIG_H -I. -I/var/tmp/portage/media-libs/libcaca-0.99_beta19/work/libcaca-0.99.beta19/caca -I..  -I/var/tmp/portage/media-libs/libcaca-0.99_beta19/work/libcaca-0.99.beta19 -DPLUGINDIR=\"\"    -I/usr/include/FTGL -I/usr/include/freetype2   -D__LIBCACA__   -march=sandybridge -O2 -pipe  -Wall -Wpointer-arith -Wcast-align -Wcast-qual -Wstrict-prototypes -Wshadow -Waggregate-return -Wmissing-prototypes -Wnested-externs -Wsign-compare -c -o libcaca_la-line.lo `test -f 'line.c' || echo '/var/tmp/portage/media-libs/libcaca-0.99_beta19/work/libcaca-0.99.beta19/caca/'`line.c
  308. /bin/sh ../libtool  --tag=CC   --mode=compile x86_64-pc-linux-gnu-gcc -DHAVE_CONFIG_H -I. -I/var/tmp/portage/media-libs/libcaca-0.99_beta19/work/libcaca-0.99.beta19/caca -I..  -I/var/tmp/portage/media-libs/libcaca-0.99_beta19/work/libcaca-0.99.beta19 -DPLUGINDIR=\"\"    -I/usr/include/FTGL -I/usr/include/freetype2   -D__LIBCACA__   -march=sandybridge -O2 -pipe  -Wall -Wpointer-arith -Wcast-align -Wcast-qual -Wstrict-prototypes -Wshadow -Waggregate-return -Wmissing-prototypes -Wnested-externs -Wsign-compare -c -o libcaca_la-box.lo `test -f 'box.c' || echo '/var/tmp/portage/media-libs/libcaca-0.99_beta19/work/libcaca-0.99.beta19/caca/'`box.c
  309. /bin/sh ../libtool  --tag=CC   --mode=compile x86_64-pc-linux-gnu-gcc -DHAVE_CONFIG_H -I. -I/var/tmp/portage/media-libs/libcaca-0.99_beta19/work/libcaca-0.99.beta19/caca -I..  -I/var/tmp/portage/media-libs/libcaca-0.99_beta19/work/libcaca-0.99.beta19 -DPLUGINDIR=\"\"    -I/usr/include/FTGL -I/usr/include/freetype2   -D__LIBCACA__   -march=sandybridge -O2 -pipe  -Wall -Wpointer-arith -Wcast-align -Wcast-qual -Wstrict-prototypes -Wshadow -Waggregate-return -Wmissing-prototypes -Wnested-externs -Wsign-compare -c -o libcaca_la-conic.lo `test -f 'conic.c' || echo '/var/tmp/portage/media-libs/libcaca-0.99_beta19/work/libcaca-0.99.beta19/caca/'`conic.c
  310. /bin/sh ../libtool  --tag=CC   --mode=compile x86_64-pc-linux-gnu-gcc -DHAVE_CONFIG_H -I. -I/var/tmp/portage/media-libs/libcaca-0.99_beta19/work/libcaca-0.99.beta19/caca -I..  -I/var/tmp/portage/media-libs/libcaca-0.99_beta19/work/libcaca-0.99.beta19 -DPLUGINDIR=\"\"    -I/usr/include/FTGL -I/usr/include/freetype2   -D__LIBCACA__   -march=sandybridge -O2 -pipe  -Wall -Wpointer-arith -Wcast-align -Wcast-qual -Wstrict-prototypes -Wshadow -Waggregate-return -Wmissing-prototypes -Wnested-externs -Wsign-compare -c -o libcaca_la-triangle.lo `test -f 'triangle.c' || echo '/var/tmp/portage/media-libs/libcaca-0.99_beta19/work/libcaca-0.99.beta19/caca/'`triangle.c
  311. /bin/sh ../libtool  --tag=CC   --mode=compile x86_64-pc-linux-gnu-gcc -DHAVE_CONFIG_H -I. -I/var/tmp/portage/media-libs/libcaca-0.99_beta19/work/libcaca-0.99.beta19/caca -I..  -I/var/tmp/portage/media-libs/libcaca-0.99_beta19/work/libcaca-0.99.beta19 -DPLUGINDIR=\"\"    -I/usr/include/FTGL -I/usr/include/freetype2   -D__LIBCACA__   -march=sandybridge -O2 -pipe  -Wall -Wpointer-arith -Wcast-align -Wcast-qual -Wstrict-prototypes -Wshadow -Waggregate-return -Wmissing-prototypes -Wnested-externs -Wsign-compare -c -o libcaca_la-frame.lo `test -f 'frame.c' || echo '/var/tmp/portage/media-libs/libcaca-0.99_beta19/work/libcaca-0.99.beta19/caca/'`frame.c
  312. /bin/sh ../libtool  --tag=CC   --mode=compile x86_64-pc-linux-gnu-gcc -DHAVE_CONFIG_H -I. -I/var/tmp/portage/media-libs/libcaca-0.99_beta19/work/libcaca-0.99.beta19/caca -I..  -I/var/tmp/portage/media-libs/libcaca-0.99_beta19/work/libcaca-0.99.beta19 -DPLUGINDIR=\"\"    -I/usr/include/FTGL -I/usr/include/freetype2   -D__LIBCACA__   -march=sandybridge -O2 -pipe  -Wall -Wpointer-arith -Wcast-align -Wcast-qual -Wstrict-prototypes -Wshadow -Waggregate-return -Wmissing-prototypes -Wnested-externs -Wsign-compare -c -o libcaca_la-dither.lo `test -f 'dither.c' || echo '/var/tmp/portage/media-libs/libcaca-0.99_beta19/work/libcaca-0.99.beta19/caca/'`dither.c
  313. /bin/sh ../libtool  --tag=CC   --mode=compile x86_64-pc-linux-gnu-gcc -DHAVE_CONFIG_H -I. -I/var/tmp/portage/media-libs/libcaca-0.99_beta19/work/libcaca-0.99.beta19/caca -I..  -I/var/tmp/portage/media-libs/libcaca-0.99_beta19/work/libcaca-0.99.beta19 -DPLUGINDIR=\"\"    -I/usr/include/FTGL -I/usr/include/freetype2   -D__LIBCACA__   -march=sandybridge -O2 -pipe  -Wall -Wpointer-arith -Wcast-align -Wcast-qual -Wstrict-prototypes -Wshadow -Waggregate-return -Wmissing-prototypes -Wnested-externs -Wsign-compare -c -o libcaca_la-font.lo `test -f 'font.c' || echo '/var/tmp/portage/media-libs/libcaca-0.99_beta19/work/libcaca-0.99.beta19/caca/'`font.c
  314. libtool: compile:  x86_64-pc-linux-gnu-gcc -DHAVE_CONFIG_H -I. -I/var/tmp/portage/media-libs/libcaca-0.99_beta19/work/libcaca-0.99.beta19/caca -I.. -I/var/tmp/portage/media-libs/libcaca-0.99_beta19/work/libcaca-0.99.beta19 -DPLUGINDIR=\"\" -I/usr/include/FTGL -I/usr/include/freetype2 -D__LIBCACA__ -march=sandybridge -O2 -pipe -Wall -Wpointer-arith -Wcast-align -Wcast-qual -Wstrict-prototypes -Wshadow -Waggregate-return -Wmissing-prototypes -Wnested-externs -Wsign-compare -c /var/tmp/portage/media-libs/libcaca-0.99_beta19/work/libcaca-0.99.beta19/caca/attr.c  -fPIC -DPIC -o .libs/libcaca_la-attr.o
  315. libtool: compile:  x86_64-pc-linux-gnu-gcc -DHAVE_CONFIG_H -I. -I/var/tmp/portage/media-libs/libcaca-0.99_beta19/work/libcaca-0.99.beta19/caca -I.. -I/var/tmp/portage/media-libs/libcaca-0.99_beta19/work/libcaca-0.99.beta19 -DPLUGINDIR=\"\" -I/usr/include/FTGL -I/usr/include/freetype2 -D__LIBCACA__ -march=sandybridge -O2 -pipe -Wall -Wpointer-arith -Wcast-align -Wcast-qual -Wstrict-prototypes -Wshadow -Waggregate-return -Wmissing-prototypes -Wnested-externs -Wsign-compare -c /var/tmp/portage/media-libs/libcaca-0.99_beta19/work/libcaca-0.99.beta19/caca/line.c  -fPIC -DPIC -o .libs/libcaca_la-line.o
  316. libtool: compile:  x86_64-pc-linux-gnu-gcc -DHAVE_CONFIG_H -I. -I/var/tmp/portage/media-libs/libcaca-0.99_beta19/work/libcaca-0.99.beta19/caca -I.. -I/var/tmp/portage/media-libs/libcaca-0.99_beta19/work/libcaca-0.99.beta19 -DPLUGINDIR=\"\" -I/usr/include/FTGL -I/usr/include/freetype2 -D__LIBCACA__ -march=sandybridge -O2 -pipe -Wall -Wpointer-arith -Wcast-align -Wcast-qual -Wstrict-prototypes -Wshadow -Waggregate-return -Wmissing-prototypes -Wnested-externs -Wsign-compare -c /var/tmp/portage/media-libs/libcaca-0.99_beta19/work/libcaca-0.99.beta19/caca/triangle.c  -fPIC -DPIC -o .libs/libcaca_la-triangle.o
  317. libtool: compile:  x86_64-pc-linux-gnu-gcc -DHAVE_CONFIG_H -I. -I/var/tmp/portage/media-libs/libcaca-0.99_beta19/work/libcaca-0.99.beta19/caca -I.. -I/var/tmp/portage/media-libs/libcaca-0.99_beta19/work/libcaca-0.99.beta19 -DPLUGINDIR=\"\" -I/usr/include/FTGL -I/usr/include/freetype2 -D__LIBCACA__ -march=sandybridge -O2 -pipe -Wall -Wpointer-arith -Wcast-align -Wcast-qual -Wstrict-prototypes -Wshadow -Waggregate-return -Wmissing-prototypes -Wnested-externs -Wsign-compare -c /var/tmp/portage/media-libs/libcaca-0.99_beta19/work/libcaca-0.99.beta19/caca/box.c  -fPIC -DPIC -o .libs/libcaca_la-box.o
  318. libtool: compile:  x86_64-pc-linux-gnu-gcc -DHAVE_CONFIG_H -I. -I/var/tmp/portage/media-libs/libcaca-0.99_beta19/work/libcaca-0.99.beta19/caca -I.. -I/var/tmp/portage/media-libs/libcaca-0.99_beta19/work/libcaca-0.99.beta19 -DPLUGINDIR=\"\" -I/usr/include/FTGL -I/usr/include/freetype2 -D__LIBCACA__ -march=sandybridge -O2 -pipe -Wall -Wpointer-arith -Wcast-align -Wcast-qual -Wstrict-prototypes -Wshadow -Waggregate-return -Wmissing-prototypes -Wnested-externs -Wsign-compare -c /var/tmp/portage/media-libs/libcaca-0.99_beta19/work/libcaca-0.99.beta19/caca/frame.c  -fPIC -DPIC -o .libs/libcaca_la-frame.o
  319. libtool: compile:  x86_64-pc-linux-gnu-gcc -DHAVE_CONFIG_H -I. -I/var/tmp/portage/media-libs/libcaca-0.99_beta19/work/libcaca-0.99.beta19/caca -I.. -I/var/tmp/portage/media-libs/libcaca-0.99_beta19/work/libcaca-0.99.beta19 -DPLUGINDIR=\"\" -I/usr/include/FTGL -I/usr/include/freetype2 -D__LIBCACA__ -march=sandybridge -O2 -pipe -Wall -Wpointer-arith -Wcast-align -Wcast-qual -Wstrict-prototypes -Wshadow -Waggregate-return -Wmissing-prototypes -Wnested-externs -Wsign-compare -c /var/tmp/portage/media-libs/libcaca-0.99_beta19/work/libcaca-0.99.beta19/caca/conic.c  -fPIC -DPIC -o .libs/libcaca_la-conic.o
  320. /bin/sh ../libtool  --tag=CC   --mode=compile x86_64-pc-linux-gnu-gcc -DHAVE_CONFIG_H -I. -I/var/tmp/portage/media-libs/libcaca-0.99_beta19/work/libcaca-0.99.beta19/caca -I..  -I/var/tmp/portage/media-libs/libcaca-0.99_beta19/work/libcaca-0.99.beta19 -DPLUGINDIR=\"\"    -I/usr/include/FTGL -I/usr/include/freetype2   -D__LIBCACA__   -march=sandybridge -O2 -pipe  -Wall -Wpointer-arith -Wcast-align -Wcast-qual -Wstrict-prototypes -Wshadow -Waggregate-return -Wmissing-prototypes -Wnested-externs -Wsign-compare -c -o libcaca_la-file.lo `test -f 'file.c' || echo '/var/tmp/portage/media-libs/libcaca-0.99_beta19/work/libcaca-0.99.beta19/caca/'`file.c
  321. libtool: compile:  x86_64-pc-linux-gnu-gcc -DHAVE_CONFIG_H -I. -I/var/tmp/portage/media-libs/libcaca-0.99_beta19/work/libcaca-0.99.beta19/caca -I.. -I/var/tmp/portage/media-libs/libcaca-0.99_beta19/work/libcaca-0.99.beta19 -DPLUGINDIR=\"\" -I/usr/include/FTGL -I/usr/include/freetype2 -D__LIBCACA__ -march=sandybridge -O2 -pipe -Wall -Wpointer-arith -Wcast-align -Wcast-qual -Wstrict-prototypes -Wshadow -Waggregate-return -Wmissing-prototypes -Wnested-externs -Wsign-compare -c /var/tmp/portage/media-libs/libcaca-0.99_beta19/work/libcaca-0.99.beta19/caca/dither.c  -fPIC -DPIC -o .libs/libcaca_la-dither.o
  322. /bin/sh ../libtool  --tag=CC   --mode=compile x86_64-pc-linux-gnu-gcc -DHAVE_CONFIG_H -I. -I/var/tmp/portage/media-libs/libcaca-0.99_beta19/work/libcaca-0.99.beta19/caca -I..  -I/var/tmp/portage/media-libs/libcaca-0.99_beta19/work/libcaca-0.99.beta19 -DPLUGINDIR=\"\"    -I/usr/include/FTGL -I/usr/include/freetype2   -D__LIBCACA__   -march=sandybridge -O2 -pipe  -Wall -Wpointer-arith -Wcast-align -Wcast-qual -Wstrict-prototypes -Wshadow -Waggregate-return -Wmissing-prototypes -Wnested-externs -Wsign-compare -c -o libcaca_la-figfont.lo `test -f 'figfont.c' || echo '/var/tmp/portage/media-libs/libcaca-0.99_beta19/work/libcaca-0.99.beta19/caca/'`figfont.c
  323. /bin/sh ../libtool  --tag=CC   --mode=compile x86_64-pc-linux-gnu-gcc -DHAVE_CONFIG_H -I. -I/var/tmp/portage/media-libs/libcaca-0.99_beta19/work/libcaca-0.99.beta19/caca -I..  -I/var/tmp/portage/media-libs/libcaca-0.99_beta19/work/libcaca-0.99.beta19 -DPLUGINDIR=\"\"    -I/usr/include/FTGL -I/usr/include/freetype2   -D__LIBCACA__   -march=sandybridge -O2 -pipe  -Wall -Wpointer-arith -Wcast-align -Wcast-qual -Wstrict-prototypes -Wshadow -Waggregate-return -Wmissing-prototypes -Wnested-externs -Wsign-compare -c -o libcaca_la-graphics.lo `test -f 'graphics.c' || echo '/var/tmp/portage/media-libs/libcaca-0.99_beta19/work/libcaca-0.99.beta19/caca/'`graphics.c
  324. /bin/sh ../libtool  --tag=CC   --mode=compile x86_64-pc-linux-gnu-gcc -DHAVE_CONFIG_H -I. -I/var/tmp/portage/media-libs/libcaca-0.99_beta19/work/libcaca-0.99.beta19/caca -I..  -I/var/tmp/portage/media-libs/libcaca-0.99_beta19/work/libcaca-0.99.beta19 -DPLUGINDIR=\"\"    -I/usr/include/FTGL -I/usr/include/freetype2   -D__LIBCACA__   -march=sandybridge -O2 -pipe  -Wall -Wpointer-arith -Wcast-align -Wcast-qual -Wstrict-prototypes -Wshadow -Waggregate-return -Wmissing-prototypes -Wnested-externs -Wsign-compare -c -o libcaca_la-event.lo `test -f 'event.c' || echo '/var/tmp/portage/media-libs/libcaca-0.99_beta19/work/libcaca-0.99.beta19/caca/'`event.c
  325. libtool: compile:  x86_64-pc-linux-gnu-gcc -DHAVE_CONFIG_H -I. -I/var/tmp/portage/media-libs/libcaca-0.99_beta19/work/libcaca-0.99.beta19/caca -I.. -I/var/tmp/portage/media-libs/libcaca-0.99_beta19/work/libcaca-0.99.beta19 -DPLUGINDIR=\"\" -I/usr/include/FTGL -I/usr/include/freetype2 -D__LIBCACA__ -march=sandybridge -O2 -pipe -Wall -Wpointer-arith -Wcast-align -Wcast-qual -Wstrict-prototypes -Wshadow -Waggregate-return -Wmissing-prototypes -Wnested-externs -Wsign-compare -c /var/tmp/portage/media-libs/libcaca-0.99_beta19/work/libcaca-0.99.beta19/caca/font.c  -fPIC -DPIC -o .libs/libcaca_la-font.o
  326. /var/tmp/portage/media-libs/libcaca-0.99_beta19/work/libcaca-0.99.beta19/caca/dither.c: In function ‘caca_dither_bitmap’:
  327. /var/tmp/portage/media-libs/libcaca-0.99_beta19/work/libcaca-0.99.beta19/caca/dither.c:946:25: warning: variable ‘pitch’ set but not used [-Wunused-but-set-variable]
  328.      int x1, y1, x2, y2, pitch, deltax, deltay, dchmax;
  329.                          ^
  330. /bin/sh ../libtool  --tag=CC   --mode=compile x86_64-pc-linux-gnu-gcc -DHAVE_CONFIG_H -I. -I/var/tmp/portage/media-libs/libcaca-0.99_beta19/work/libcaca-0.99.beta19/caca -I..  -I/var/tmp/portage/media-libs/libcaca-0.99_beta19/work/libcaca-0.99.beta19 -DPLUGINDIR=\"\"    -I/usr/include/FTGL -I/usr/include/freetype2   -D__LIBCACA__   -march=sandybridge -O2 -pipe  -Wall -Wpointer-arith -Wcast-align -Wcast-qual -Wstrict-prototypes -Wshadow -Waggregate-return -Wmissing-prototypes -Wnested-externs -Wsign-compare -c -o libcaca_la-time.lo `test -f 'time.c' || echo '/var/tmp/portage/media-libs/libcaca-0.99_beta19/work/libcaca-0.99.beta19/caca/'`time.c
  331. /bin/sh ../libtool  --tag=CC   --mode=compile x86_64-pc-linux-gnu-gcc -DHAVE_CONFIG_H -I. -I/var/tmp/portage/media-libs/libcaca-0.99_beta19/work/libcaca-0.99.beta19/caca -I..  -I/var/tmp/portage/media-libs/libcaca-0.99_beta19/work/libcaca-0.99.beta19 -DPLUGINDIR=\"\"    -I/usr/include/FTGL -I/usr/include/freetype2   -D__LIBCACA__   -march=sandybridge -O2 -pipe  -Wall -Wpointer-arith -Wcast-align -Wcast-qual -Wstrict-prototypes -Wshadow -Waggregate-return -Wmissing-prototypes -Wnested-externs -Wsign-compare -c -o libcaca_la-prof.lo `test -f 'prof.c' || echo '/var/tmp/portage/media-libs/libcaca-0.99_beta19/work/libcaca-0.99.beta19/caca/'`prof.c
  332. /bin/sh ../libtool  --tag=CC   --mode=compile x86_64-pc-linux-gnu-gcc -DHAVE_CONFIG_H -I. -I/var/tmp/portage/media-libs/libcaca-0.99_beta19/work/libcaca-0.99.beta19/caca -I..  -I/var/tmp/portage/media-libs/libcaca-0.99_beta19/work/libcaca-0.99.beta19 -DPLUGINDIR=\"\"    -I/usr/include/FTGL -I/usr/include/freetype2   -D__LIBCACA__   -march=sandybridge -O2 -pipe  -Wall -Wpointer-arith -Wcast-align -Wcast-qual -Wstrict-prototypes -Wshadow -Waggregate-return -Wmissing-prototypes -Wnested-externs -Wsign-compare -c -o libcaca_la-getopt.lo `test -f 'getopt.c' || echo '/var/tmp/portage/media-libs/libcaca-0.99_beta19/work/libcaca-0.99.beta19/caca/'`getopt.c
  333. libtool: compile:  x86_64-pc-linux-gnu-gcc -DHAVE_CONFIG_H -I. -I/var/tmp/portage/media-libs/libcaca-0.99_beta19/work/libcaca-0.99.beta19/caca -I.. -I/var/tmp/portage/media-libs/libcaca-0.99_beta19/work/libcaca-0.99.beta19 -DPLUGINDIR=\"\" -I/usr/include/FTGL -I/usr/include/freetype2 -D__LIBCACA__ -march=sandybridge -O2 -pipe -Wall -Wpointer-arith -Wcast-align -Wcast-qual -Wstrict-prototypes -Wshadow -Waggregate-return -Wmissing-prototypes -Wnested-externs -Wsign-compare -c /var/tmp/portage/media-libs/libcaca-0.99_beta19/work/libcaca-0.99.beta19/caca/file.c  -fPIC -DPIC -o .libs/libcaca_la-file.o
  334. libtool: compile:  x86_64-pc-linux-gnu-gcc -DHAVE_CONFIG_H -I. -I/var/tmp/portage/media-libs/libcaca-0.99_beta19/work/libcaca-0.99.beta19/caca -I.. -I/var/tmp/portage/media-libs/libcaca-0.99_beta19/work/libcaca-0.99.beta19 -DPLUGINDIR=\"\" -I/usr/include/FTGL -I/usr/include/freetype2 -D__LIBCACA__ -march=sandybridge -O2 -pipe -Wall -Wpointer-arith -Wcast-align -Wcast-qual -Wstrict-prototypes -Wshadow -Waggregate-return -Wmissing-prototypes -Wnested-externs -Wsign-compare -c /var/tmp/portage/media-libs/libcaca-0.99_beta19/work/libcaca-0.99.beta19/caca/figfont.c  -fPIC -DPIC -o .libs/libcaca_la-figfont.o
  335. libtool: compile:  x86_64-pc-linux-gnu-gcc -DHAVE_CONFIG_H -I. -I/var/tmp/portage/media-libs/libcaca-0.99_beta19/work/libcaca-0.99.beta19/caca -I.. -I/var/tmp/portage/media-libs/libcaca-0.99_beta19/work/libcaca-0.99.beta19 -DPLUGINDIR=\"\" -I/usr/include/FTGL -I/usr/include/freetype2 -D__LIBCACA__ -march=sandybridge -O2 -pipe -Wall -Wpointer-arith -Wcast-align -Wcast-qual -Wstrict-prototypes -Wshadow -Waggregate-return -Wmissing-prototypes -Wnested-externs -Wsign-compare -c /var/tmp/portage/media-libs/libcaca-0.99_beta19/work/libcaca-0.99.beta19/caca/graphics.c  -fPIC -DPIC -o .libs/libcaca_la-graphics.o
  336. /var/tmp/portage/media-libs/libcaca-0.99_beta19/work/libcaca-0.99.beta19/caca/figfont.c: In function ‘caca_put_figchar’:
  337. /var/tmp/portage/media-libs/libcaca-0.99_beta19/work/libcaca-0.99.beta19/caca/figfont.c:146:33: warning: variable ‘extra’ set but not used [-Wunused-but-set-variable]
  338.      int c, w, h, x, y, overlap, extra, xleft, xright;
  339.                                  ^
  340. libtool: compile:  x86_64-pc-linux-gnu-gcc -DHAVE_CONFIG_H -I. -I/var/tmp/portage/media-libs/libcaca-0.99_beta19/work/libcaca-0.99.beta19/caca -I.. -I/var/tmp/portage/media-libs/libcaca-0.99_beta19/work/libcaca-0.99.beta19 -DPLUGINDIR=\"\" -I/usr/include/FTGL -I/usr/include/freetype2 -D__LIBCACA__ -march=sandybridge -O2 -pipe -Wall -Wpointer-arith -Wcast-align -Wcast-qual -Wstrict-prototypes -Wshadow -Waggregate-return -Wmissing-prototypes -Wnested-externs -Wsign-compare -c /var/tmp/portage/media-libs/libcaca-0.99_beta19/work/libcaca-0.99.beta19/caca/event.c  -fPIC -DPIC -o .libs/libcaca_la-event.o
  341. libtool: compile:  x86_64-pc-linux-gnu-gcc -DHAVE_CONFIG_H -I. -I/var/tmp/portage/media-libs/libcaca-0.99_beta19/work/libcaca-0.99.beta19/caca -I.. -I/var/tmp/portage/media-libs/libcaca-0.99_beta19/work/libcaca-0.99.beta19 -DPLUGINDIR=\"\" -I/usr/include/FTGL -I/usr/include/freetype2 -D__LIBCACA__ -march=sandybridge -O2 -pipe -Wall -Wpointer-arith -Wcast-align -Wcast-qual -Wstrict-prototypes -Wshadow -Waggregate-return -Wmissing-prototypes -Wnested-externs -Wsign-compare -c /var/tmp/portage/media-libs/libcaca-0.99_beta19/work/libcaca-0.99.beta19/caca/time.c  -fPIC -DPIC -o .libs/libcaca_la-time.o
  342. libtool: compile:  x86_64-pc-linux-gnu-gcc -DHAVE_CONFIG_H -I. -I/var/tmp/portage/media-libs/libcaca-0.99_beta19/work/libcaca-0.99.beta19/caca -I.. -I/var/tmp/portage/media-libs/libcaca-0.99_beta19/work/libcaca-0.99.beta19 -DPLUGINDIR=\"\" -I/usr/include/FTGL -I/usr/include/freetype2 -D__LIBCACA__ -march=sandybridge -O2 -pipe -Wall -Wpointer-arith -Wcast-align -Wcast-qual -Wstrict-prototypes -Wshadow -Waggregate-return -Wmissing-prototypes -Wnested-externs -Wsign-compare -c /var/tmp/portage/media-libs/libcaca-0.99_beta19/work/libcaca-0.99.beta19/caca/getopt.c  -fPIC -DPIC -o .libs/libcaca_la-getopt.o
  343. /bin/sh ../libtool  --tag=CC   --mode=compile x86_64-pc-linux-gnu-gcc -DHAVE_CONFIG_H -I. -I/var/tmp/portage/media-libs/libcaca-0.99_beta19/work/libcaca-0.99.beta19/caca -I..  -I/var/tmp/portage/media-libs/libcaca-0.99_beta19/work/libcaca-0.99.beta19 -DPLUGINDIR=\"\"    -I/usr/include/FTGL -I/usr/include/freetype2   -D__LIBCACA__   -march=sandybridge -O2 -pipe  -Wall -Wpointer-arith -Wcast-align -Wcast-qual -Wstrict-prototypes -Wshadow -Waggregate-return -Wmissing-prototypes -Wnested-externs -Wsign-compare -c -o codec/libcaca_la-import.lo `test -f 'codec/import.c' || echo '/var/tmp/portage/media-libs/libcaca-0.99_beta19/work/libcaca-0.99.beta19/caca/'`codec/import.c
  344. libtool: compile:  x86_64-pc-linux-gnu-gcc -DHAVE_CONFIG_H -I. -I/var/tmp/portage/media-libs/libcaca-0.99_beta19/work/libcaca-0.99.beta19/caca -I.. -I/var/tmp/portage/media-libs/libcaca-0.99_beta19/work/libcaca-0.99.beta19 -DPLUGINDIR=\"\" -I/usr/include/FTGL -I/usr/include/freetype2 -D__LIBCACA__ -march=sandybridge -O2 -pipe -Wall -Wpointer-arith -Wcast-align -Wcast-qual -Wstrict-prototypes -Wshadow -Waggregate-return -Wmissing-prototypes -Wnested-externs -Wsign-compare -c /var/tmp/portage/media-libs/libcaca-0.99_beta19/work/libcaca-0.99.beta19/caca/prof.c  -fPIC -DPIC -o .libs/libcaca_la-prof.o
  345. /bin/sh ../libtool  --tag=CC   --mode=compile x86_64-pc-linux-gnu-gcc -DHAVE_CONFIG_H -I. -I/var/tmp/portage/media-libs/libcaca-0.99_beta19/work/libcaca-0.99.beta19/caca -I..  -I/var/tmp/portage/media-libs/libcaca-0.99_beta19/work/libcaca-0.99.beta19 -DPLUGINDIR=\"\"    -I/usr/include/FTGL -I/usr/include/freetype2   -D__LIBCACA__   -march=sandybridge -O2 -pipe  -Wall -Wpointer-arith -Wcast-align -Wcast-qual -Wstrict-prototypes -Wshadow -Waggregate-return -Wmissing-prototypes -Wnested-externs -Wsign-compare -c -o codec/libcaca_la-export.lo `test -f 'codec/export.c' || echo '/var/tmp/portage/media-libs/libcaca-0.99_beta19/work/libcaca-0.99.beta19/caca/'`codec/export.c
  346. /bin/sh ../libtool  --tag=CC   --mode=compile x86_64-pc-linux-gnu-gcc -DHAVE_CONFIG_H -I. -I/var/tmp/portage/media-libs/libcaca-0.99_beta19/work/libcaca-0.99.beta19/caca -I..  -I/var/tmp/portage/media-libs/libcaca-0.99_beta19/work/libcaca-0.99.beta19 -DPLUGINDIR=\"\"    -I/usr/include/FTGL -I/usr/include/freetype2   -D__LIBCACA__   -march=sandybridge -O2 -pipe  -Wall -Wpointer-arith -Wcast-align -Wcast-qual -Wstrict-prototypes -Wshadow -Waggregate-return -Wmissing-prototypes -Wnested-externs -Wsign-compare -c -o codec/libcaca_la-text.lo `test -f 'codec/text.c' || echo '/var/tmp/portage/media-libs/libcaca-0.99_beta19/work/libcaca-0.99.beta19/caca/'`codec/text.c
  347. /bin/sh ../libtool  --tag=CC   --mode=compile x86_64-pc-linux-gnu-gcc -DHAVE_CONFIG_H -I. -I/var/tmp/portage/media-libs/libcaca-0.99_beta19/work/libcaca-0.99.beta19/caca -I..  -I/var/tmp/portage/media-libs/libcaca-0.99_beta19/work/libcaca-0.99.beta19 -DPLUGINDIR=\"\"    -I/usr/include/FTGL -I/usr/include/freetype2   -D__LIBCACA__   -march=sandybridge -O2 -pipe  -Wall -Wpointer-arith -Wcast-align -Wcast-qual -Wstrict-prototypes -Wshadow -Waggregate-return -Wmissing-prototypes -Wnested-externs -Wsign-compare -c -o driver/libcaca_la-conio.lo `test -f 'driver/conio.c' || echo '/var/tmp/portage/media-libs/libcaca-0.99_beta19/work/libcaca-0.99.beta19/caca/'`driver/conio.c
  348. /bin/sh ../libtool  --tag=CC   --mode=compile x86_64-pc-linux-gnu-gcc -DHAVE_CONFIG_H -I. -I/var/tmp/portage/media-libs/libcaca-0.99_beta19/work/libcaca-0.99.beta19/caca -I..  -I/var/tmp/portage/media-libs/libcaca-0.99_beta19/work/libcaca-0.99.beta19 -DPLUGINDIR=\"\"    -I/usr/include/FTGL -I/usr/include/freetype2   -D__LIBCACA__   -march=sandybridge -O2 -pipe  -Wall -Wpointer-arith -Wcast-align -Wcast-qual -Wstrict-prototypes -Wshadow -Waggregate-return -Wmissing-prototypes -Wnested-externs -Wsign-compare -c -o driver/libcaca_la-ncurses.lo `test -f 'driver/ncurses.c' || echo '/var/tmp/portage/media-libs/libcaca-0.99_beta19/work/libcaca-0.99.beta19/caca/'`driver/ncurses.c
  349. /bin/sh ../libtool  --tag=CC   --mode=compile x86_64-pc-linux-gnu-gcc -DHAVE_CONFIG_H -I. -I/var/tmp/portage/media-libs/libcaca-0.99_beta19/work/libcaca-0.99.beta19/caca -I..  -I/var/tmp/portage/media-libs/libcaca-0.99_beta19/work/libcaca-0.99.beta19 -DPLUGINDIR=\"\"    -I/usr/include/FTGL -I/usr/include/freetype2   -D__LIBCACA__   -march=sandybridge -O2 -pipe  -Wall -Wpointer-arith -Wcast-align -Wcast-qual -Wstrict-prototypes -Wshadow -Waggregate-return -Wmissing-prototypes -Wnested-externs -Wsign-compare -c -o driver/libcaca_la-null.lo `test -f 'driver/null.c' || echo '/var/tmp/portage/media-libs/libcaca-0.99_beta19/work/libcaca-0.99.beta19/caca/'`driver/null.c
  350. /bin/sh ../libtool  --tag=CC   --mode=compile x86_64-pc-linux-gnu-gcc -DHAVE_CONFIG_H -I. -I/var/tmp/portage/media-libs/libcaca-0.99_beta19/work/libcaca-0.99.beta19/caca -I..  -I/var/tmp/portage/media-libs/libcaca-0.99_beta19/work/libcaca-0.99.beta19 -DPLUGINDIR=\"\"    -I/usr/include/FTGL -I/usr/include/freetype2   -D__LIBCACA__   -march=sandybridge -O2 -pipe  -Wall -Wpointer-arith -Wcast-align -Wcast-qual -Wstrict-prototypes -Wshadow -Waggregate-return -Wmissing-prototypes -Wnested-externs -Wsign-compare -c -o driver/libcaca_la-raw.lo `test -f 'driver/raw.c' || echo '/var/tmp/portage/media-libs/libcaca-0.99_beta19/work/libcaca-0.99.beta19/caca/'`driver/raw.c
  351. /bin/sh ../libtool  --tag=CC   --mode=compile x86_64-pc-linux-gnu-gcc -DHAVE_CONFIG_H -I. -I/var/tmp/portage/media-libs/libcaca-0.99_beta19/work/libcaca-0.99.beta19/caca -I..  -I/var/tmp/portage/media-libs/libcaca-0.99_beta19/work/libcaca-0.99.beta19 -DPLUGINDIR=\"\"    -I/usr/include/FTGL -I/usr/include/freetype2   -D__LIBCACA__   -march=sandybridge -O2 -pipe  -Wall -Wpointer-arith -Wcast-align -Wcast-qual -Wstrict-prototypes -Wshadow -Waggregate-return -Wmissing-prototypes -Wnested-externs -Wsign-compare -c -o driver/libcaca_la-slang.lo `test -f 'driver/slang.c' || echo '/var/tmp/portage/media-libs/libcaca-0.99_beta19/work/libcaca-0.99.beta19/caca/'`driver/slang.c
  352. libtool: compile:  x86_64-pc-linux-gnu-gcc -DHAVE_CONFIG_H -I. -I/var/tmp/portage/media-libs/libcaca-0.99_beta19/work/libcaca-0.99.beta19/caca -I.. -I/var/tmp/portage/media-libs/libcaca-0.99_beta19/work/libcaca-0.99.beta19 -DPLUGINDIR=\"\" -I/usr/include/FTGL -I/usr/include/freetype2 -D__LIBCACA__ -march=sandybridge -O2 -pipe -Wall -Wpointer-arith -Wcast-align -Wcast-qual -Wstrict-prototypes -Wshadow -Waggregate-return -Wmissing-prototypes -Wnested-externs -Wsign-compare -c /var/tmp/portage/media-libs/libcaca-0.99_beta19/work/libcaca-0.99.beta19/caca/codec/import.c  -fPIC -DPIC -o codec/.libs/libcaca_la-import.o
  353. libtool: compile:  x86_64-pc-linux-gnu-gcc -DHAVE_CONFIG_H -I. -I/var/tmp/portage/media-libs/libcaca-0.99_beta19/work/libcaca-0.99.beta19/caca -I.. -I/var/tmp/portage/media-libs/libcaca-0.99_beta19/work/libcaca-0.99.beta19 -DPLUGINDIR=\"\" -I/usr/include/FTGL -I/usr/include/freetype2 -D__LIBCACA__ -march=sandybridge -O2 -pipe -Wall -Wpointer-arith -Wcast-align -Wcast-qual -Wstrict-prototypes -Wshadow -Waggregate-return -Wmissing-prototypes -Wnested-externs -Wsign-compare -c /var/tmp/portage/media-libs/libcaca-0.99_beta19/work/libcaca-0.99.beta19/caca/codec/text.c  -fPIC -DPIC -o codec/.libs/libcaca_la-text.o
  354. libtool: compile:  x86_64-pc-linux-gnu-gcc -DHAVE_CONFIG_H -I. -I/var/tmp/portage/media-libs/libcaca-0.99_beta19/work/libcaca-0.99.beta19/caca -I.. -I/var/tmp/portage/media-libs/libcaca-0.99_beta19/work/libcaca-0.99.beta19 -DPLUGINDIR=\"\" -I/usr/include/FTGL -I/usr/include/freetype2 -D__LIBCACA__ -march=sandybridge -O2 -pipe -Wall -Wpointer-arith -Wcast-align -Wcast-qual -Wstrict-prototypes -Wshadow -Waggregate-return -Wmissing-prototypes -Wnested-externs -Wsign-compare -c /var/tmp/portage/media-libs/libcaca-0.99_beta19/work/libcaca-0.99.beta19/caca/codec/export.c  -fPIC -DPIC -o codec/.libs/libcaca_la-export.o
  355. libtool: compile:  x86_64-pc-linux-gnu-gcc -DHAVE_CONFIG_H -I. -I/var/tmp/portage/media-libs/libcaca-0.99_beta19/work/libcaca-0.99.beta19/caca -I.. -I/var/tmp/portage/media-libs/libcaca-0.99_beta19/work/libcaca-0.99.beta19 -DPLUGINDIR=\"\" -I/usr/include/FTGL -I/usr/include/freetype2 -D__LIBCACA__ -march=sandybridge -O2 -pipe -Wall -Wpointer-arith -Wcast-align -Wcast-qual -Wstrict-prototypes -Wshadow -Waggregate-return -Wmissing-prototypes -Wnested-externs -Wsign-compare -c /var/tmp/portage/media-libs/libcaca-0.99_beta19/work/libcaca-0.99.beta19/caca/driver/conio.c  -fPIC -DPIC -o driver/.libs/libcaca_la-conio.o
  356. /bin/sh ../libtool  --tag=CC   --mode=compile x86_64-pc-linux-gnu-gcc -DHAVE_CONFIG_H -I. -I/var/tmp/portage/media-libs/libcaca-0.99_beta19/work/libcaca-0.99.beta19/caca -I..  -I/var/tmp/portage/media-libs/libcaca-0.99_beta19/work/libcaca-0.99.beta19 -DPLUGINDIR=\"\"    -I/usr/include/FTGL -I/usr/include/freetype2   -D__LIBCACA__   -march=sandybridge -O2 -pipe  -Wall -Wpointer-arith -Wcast-align -Wcast-qual -Wstrict-prototypes -Wshadow -Waggregate-return -Wmissing-prototypes -Wnested-externs -Wsign-compare -c -o driver/libcaca_la-vga.lo `test -f 'driver/vga.c' || echo '/var/tmp/portage/media-libs/libcaca-0.99_beta19/work/libcaca-0.99.beta19/caca/'`driver/vga.c
  357. /var/tmp/portage/media-libs/libcaca-0.99_beta19/work/libcaca-0.99.beta19/caca/codec/import.c: In function ‘import_caca’:
  358. /var/tmp/portage/media-libs/libcaca-0.99_beta19/work/libcaca-0.99.beta19/caca/codec/import.c:333:16: warning: variable ‘y’ set but not used [-Wunused-but-set-variable]
  359.          int x, y, handlex, handley;
  360.                 ^
  361. /var/tmp/portage/media-libs/libcaca-0.99_beta19/work/libcaca-0.99.beta19/caca/codec/import.c:333:13: warning: variable ‘x’ set but not used [-Wunused-but-set-variable]
  362.          int x, y, handlex, handley;
  363.              ^
  364. /var/tmp/portage/media-libs/libcaca-0.99_beta19/work/libcaca-0.99.beta19/caca/codec/import.c:332:18: warning: variable ‘attr’ set but not used [-Wunused-but-set-variable]
  365.          uint32_t attr;
  366.                   ^
  367. /var/tmp/portage/media-libs/libcaca-0.99_beta19/work/libcaca-0.99.beta19/caca/codec/import.c:331:37: warning: variable ‘duration’ set but not used [-Wunused-but-set-variable]
  368.          unsigned int width, height, duration;
  369.                                      ^
  370. libtool: compile:  x86_64-pc-linux-gnu-gcc -DHAVE_CONFIG_H -I. -I/var/tmp/portage/media-libs/libcaca-0.99_beta19/work/libcaca-0.99.beta19/caca -I.. -I/var/tmp/portage/media-libs/libcaca-0.99_beta19/work/libcaca-0.99.beta19 -DPLUGINDIR=\"\" -I/usr/include/FTGL -I/usr/include/freetype2 -D__LIBCACA__ -march=sandybridge -O2 -pipe -Wall -Wpointer-arith -Wcast-align -Wcast-qual -Wstrict-prototypes -Wshadow -Waggregate-return -Wmissing-prototypes -Wnested-externs -Wsign-compare -c /var/tmp/portage/media-libs/libcaca-0.99_beta19/work/libcaca-0.99.beta19/caca/driver/raw.c  -fPIC -DPIC -o driver/.libs/libcaca_la-raw.o
  371. /var/tmp/portage/media-libs/libcaca-0.99_beta19/work/libcaca-0.99.beta19/caca/codec/import.c:301:23: warning: variable ‘flags’ set but not used [-Wunused-but-set-variable]
  372.      uint16_t version, flags;
  373.                        ^
  374. /var/tmp/portage/media-libs/libcaca-0.99_beta19/work/libcaca-0.99.beta19/caca/codec/import.c:301:14: warning: variable ‘version’ set but not used [-Wunused-but-set-variable]
  375.      uint16_t version, flags;
  376.               ^
  377. libtool: compile:  x86_64-pc-linux-gnu-gcc -DHAVE_CONFIG_H -I. -I/var/tmp/portage/media-libs/libcaca-0.99_beta19/work/libcaca-0.99.beta19/caca -I.. -I/var/tmp/portage/media-libs/libcaca-0.99_beta19/work/libcaca-0.99.beta19 -DPLUGINDIR=\"\" -I/usr/include/FTGL -I/usr/include/freetype2 -D__LIBCACA__ -march=sandybridge -O2 -pipe -Wall -Wpointer-arith -Wcast-align -Wcast-qual -Wstrict-prototypes -Wshadow -Waggregate-return -Wmissing-prototypes -Wnested-externs -Wsign-compare -c /var/tmp/portage/media-libs/libcaca-0.99_beta19/work/libcaca-0.99.beta19/caca/driver/ncurses.c  -fPIC -DPIC -o driver/.libs/libcaca_la-ncurses.o
  378. libtool: compile:  x86_64-pc-linux-gnu-gcc -DHAVE_CONFIG_H -I. -I/var/tmp/portage/media-libs/libcaca-0.99_beta19/work/libcaca-0.99.beta19/caca -I.. -I/var/tmp/portage/media-libs/libcaca-0.99_beta19/work/libcaca-0.99.beta19 -DPLUGINDIR=\"\" -I/usr/include/FTGL -I/usr/include/freetype2 -D__LIBCACA__ -march=sandybridge -O2 -pipe -Wall -Wpointer-arith -Wcast-align -Wcast-qual -Wstrict-prototypes -Wshadow -Waggregate-return -Wmissing-prototypes -Wnested-externs -Wsign-compare -c /var/tmp/portage/media-libs/libcaca-0.99_beta19/work/libcaca-0.99.beta19/caca/driver/null.c  -fPIC -DPIC -o driver/.libs/libcaca_la-null.o
  379. libtool: compile:  x86_64-pc-linux-gnu-gcc -DHAVE_CONFIG_H -I. -I/var/tmp/portage/media-libs/libcaca-0.99_beta19/work/libcaca-0.99.beta19/caca -I.. -I/var/tmp/portage/media-libs/libcaca-0.99_beta19/work/libcaca-0.99.beta19 -DPLUGINDIR=\"\" -I/usr/include/FTGL -I/usr/include/freetype2 -D__LIBCACA__ -march=sandybridge -O2 -pipe -Wall -Wpointer-arith -Wcast-align -Wcast-qual -Wstrict-prototypes -Wshadow -Waggregate-return -Wmissing-prototypes -Wnested-externs -Wsign-compare -c /var/tmp/portage/media-libs/libcaca-0.99_beta19/work/libcaca-0.99.beta19/caca/driver/slang.c  -fPIC -DPIC -o driver/.libs/libcaca_la-slang.o
  380. /bin/sh ../libtool  --tag=CC   --mode=compile x86_64-pc-linux-gnu-gcc -DHAVE_CONFIG_H -I. -I/var/tmp/portage/media-libs/libcaca-0.99_beta19/work/libcaca-0.99.beta19/caca -I..  -I/var/tmp/portage/media-libs/libcaca-0.99_beta19/work/libcaca-0.99.beta19 -DPLUGINDIR=\"\"    -I/usr/include/FTGL -I/usr/include/freetype2   -D__LIBCACA__   -march=sandybridge -O2 -pipe  -Wall -Wpointer-arith -Wcast-align -Wcast-qual -Wstrict-prototypes -Wshadow -Waggregate-return -Wmissing-prototypes -Wnested-externs -Wsign-compare -c -o driver/libcaca_la-win32.lo `test -f 'driver/win32.c' || echo '/var/tmp/portage/media-libs/libcaca-0.99_beta19/work/libcaca-0.99.beta19/caca/'`driver/win32.c
  381. /bin/sh ../libtool  --tag=CC   --mode=compile x86_64-pc-linux-gnu-gcc -DHAVE_CONFIG_H -I. -I/var/tmp/portage/media-libs/libcaca-0.99_beta19/work/libcaca-0.99.beta19/caca -I..  -I/var/tmp/portage/media-libs/libcaca-0.99_beta19/work/libcaca-0.99.beta19 -DPLUGINDIR=\"\"    -I/usr/include/FTGL -I/usr/include/freetype2   -D__LIBCACA__   -march=sandybridge -O2 -pipe  -Wall -Wpointer-arith -Wcast-align -Wcast-qual -Wstrict-prototypes -Wshadow -Waggregate-return -Wmissing-prototypes -Wnested-externs -Wsign-compare -c -o driver/libcaca_la-x11.lo `test -f 'driver/x11.c' || echo '/var/tmp/portage/media-libs/libcaca-0.99_beta19/work/libcaca-0.99.beta19/caca/'`driver/x11.c
  382. /bin/sh ../libtool  --tag=CC   --mode=compile x86_64-pc-linux-gnu-gcc -DHAVE_CONFIG_H -I. -I/var/tmp/portage/media-libs/libcaca-0.99_beta19/work/libcaca-0.99.beta19/caca -I..  -I/var/tmp/portage/media-libs/libcaca-0.99_beta19/work/libcaca-0.99.beta19 -DPLUGINDIR=\"\"    -I/usr/include/FTGL -I/usr/include/freetype2   -D__LIBCACA__   -march=sandybridge -O2 -pipe  -Wall -Wpointer-arith -Wcast-align -Wcast-qual -Wstrict-prototypes -Wshadow -Waggregate-return -Wmissing-prototypes -Wnested-externs -Wsign-compare -c -o driver/libcaca_la-gl.lo `test -f 'driver/gl.c' || echo '/var/tmp/portage/media-libs/libcaca-0.99_beta19/work/libcaca-0.99.beta19/caca/'`driver/gl.c
  383. libtool: compile:  x86_64-pc-linux-gnu-gcc -DHAVE_CONFIG_H -I. -I/var/tmp/portage/media-libs/libcaca-0.99_beta19/work/libcaca-0.99.beta19/caca -I.. -I/var/tmp/portage/media-libs/libcaca-0.99_beta19/work/libcaca-0.99.beta19 -DPLUGINDIR=\"\" -I/usr/include/FTGL -I/usr/include/freetype2 -D__LIBCACA__ -march=sandybridge -O2 -pipe -Wall -Wpointer-arith -Wcast-align -Wcast-qual -Wstrict-prototypes -Wshadow -Waggregate-return -Wmissing-prototypes -Wnested-externs -Wsign-compare -c /var/tmp/portage/media-libs/libcaca-0.99_beta19/work/libcaca-0.99.beta19/caca/driver/vga.c  -fPIC -DPIC -o driver/.libs/libcaca_la-vga.o
  384. libtool: compile:  x86_64-pc-linux-gnu-gcc -DHAVE_CONFIG_H -I. -I/var/tmp/portage/media-libs/libcaca-0.99_beta19/work/libcaca-0.99.beta19/caca -I.. -I/var/tmp/portage/media-libs/libcaca-0.99_beta19/work/libcaca-0.99.beta19 -DPLUGINDIR=\"\" -I/usr/include/FTGL -I/usr/include/freetype2 -D__LIBCACA__ -march=sandybridge -O2 -pipe -Wall -Wpointer-arith -Wcast-align -Wcast-qual -Wstrict-prototypes -Wshadow -Waggregate-return -Wmissing-prototypes -Wnested-externs -Wsign-compare -c /var/tmp/portage/media-libs/libcaca-0.99_beta19/work/libcaca-0.99.beta19/caca/driver/x11.c  -fPIC -DPIC -o driver/.libs/libcaca_la-x11.o
  385. libtool: compile:  x86_64-pc-linux-gnu-gcc -DHAVE_CONFIG_H -I. -I/var/tmp/portage/media-libs/libcaca-0.99_beta19/work/libcaca-0.99.beta19/caca -I.. -I/var/tmp/portage/media-libs/libcaca-0.99_beta19/work/libcaca-0.99.beta19 -DPLUGINDIR=\"\" -I/usr/include/FTGL -I/usr/include/freetype2 -D__LIBCACA__ -march=sandybridge -O2 -pipe -Wall -Wpointer-arith -Wcast-align -Wcast-qual -Wstrict-prototypes -Wshadow -Waggregate-return -Wmissing-prototypes -Wnested-externs -Wsign-compare -c /var/tmp/portage/media-libs/libcaca-0.99_beta19/work/libcaca-0.99.beta19/caca/driver/win32.c  -fPIC -DPIC -o driver/.libs/libcaca_la-win32.o
  386. libtool: compile:  x86_64-pc-linux-gnu-gcc -DHAVE_CONFIG_H -I. -I/var/tmp/portage/media-libs/libcaca-0.99_beta19/work/libcaca-0.99.beta19/caca -I.. -I/var/tmp/portage/media-libs/libcaca-0.99_beta19/work/libcaca-0.99.beta19 -DPLUGINDIR=\"\" -I/usr/include/FTGL -I/usr/include/freetype2 -D__LIBCACA__ -march=sandybridge -O2 -pipe -Wall -Wpointer-arith -Wcast-align -Wcast-qual -Wstrict-prototypes -Wshadow -Waggregate-return -Wmissing-prototypes -Wnested-externs -Wsign-compare -c /var/tmp/portage/media-libs/libcaca-0.99_beta19/work/libcaca-0.99.beta19/caca/driver/gl.c  -fPIC -DPIC -o driver/.libs/libcaca_la-gl.o
  387. /var/tmp/portage/media-libs/libcaca-0.99_beta19/work/libcaca-0.99.beta19/caca/driver/x11.c: In function ‘x11_get_event’:
  388. /var/tmp/portage/media-libs/libcaca-0.99_beta19/work/libcaca-0.99.beta19/caca/driver/x11.c:629:9: warning: ‘XKeycodeToKeysym’ is deprecated [-Wdeprecated-declarations]
  389.          keysym = XKeycodeToKeysym(dp->drv.p->dpy, xevent.xkey.keycode, 0);
  390.          ^
  391. In file included from /var/tmp/portage/media-libs/libcaca-0.99_beta19/work/libcaca-0.99.beta19/caca/driver/x11.c:22:0:
  392. /usr/include/X11/Xlib.h:1687:15: note: declared here
  393.  extern KeySym XKeycodeToKeysym(
  394.                ^
  395. /bin/sh ../libtool    --mode=link x86_64-pc-linux-gnu-gcc   -no-undefined -version-number 0:99:19 -Wl,-O1 -Wl,--sort-common -Wl,--as-needed -o libcaca.la -rpath /usr/lib64 libcaca_la-caca.lo libcaca_la-caca_conio.lo libcaca_la-caca0.lo libcaca_la-canvas.lo libcaca_la-dirty.lo libcaca_la-string.lo libcaca_la-legacy.lo libcaca_la-transform.lo libcaca_la-charset.lo libcaca_la-attr.lo libcaca_la-line.lo libcaca_la-box.lo libcaca_la-conic.lo libcaca_la-triangle.lo libcaca_la-frame.lo libcaca_la-dither.lo libcaca_la-font.lo libcaca_la-file.lo libcaca_la-figfont.lo libcaca_la-graphics.lo libcaca_la-event.lo libcaca_la-time.lo libcaca_la-prof.lo libcaca_la-getopt.lo codec/libcaca_la-import.lo codec/libcaca_la-export.lo codec/libcaca_la-text.lo driver/libcaca_la-conio.lo driver/libcaca_la-ncurses.lo driver/libcaca_la-null.lo driver/libcaca_la-raw.lo driver/libcaca_la-slang.lo driver/libcaca_la-vga.lo driver/libcaca_la-win32.lo driver/libcaca_la-x11.lo driver/libcaca_la-gl.lo  -lncursesw  -lX11 -L/usr/lib64  -lGL -lGLU -lglut -lftgl   -lz  
  396. libtool: link: x86_64-pc-linux-gnu-gcc -shared  -fPIC -DPIC  .libs/libcaca_la-caca.o .libs/libcaca_la-caca_conio.o .libs/libcaca_la-caca0.o .libs/libcaca_la-canvas.o .libs/libcaca_la-dirty.o .libs/libcaca_la-string.o .libs/libcaca_la-legacy.o .libs/libcaca_la-transform.o .libs/libcaca_la-charset.o .libs/libcaca_la-attr.o .libs/libcaca_la-line.o .libs/libcaca_la-box.o .libs/libcaca_la-conic.o .libs/libcaca_la-triangle.o .libs/libcaca_la-frame.o .libs/libcaca_la-dither.o .libs/libcaca_la-font.o .libs/libcaca_la-file.o .libs/libcaca_la-figfont.o .libs/libcaca_la-graphics.o .libs/libcaca_la-event.o .libs/libcaca_la-time.o .libs/libcaca_la-prof.o .libs/libcaca_la-getopt.o codec/.libs/libcaca_la-import.o codec/.libs/libcaca_la-export.o codec/.libs/libcaca_la-text.o driver/.libs/libcaca_la-conio.o driver/.libs/libcaca_la-ncurses.o driver/.libs/libcaca_la-null.o driver/.libs/libcaca_la-raw.o driver/.libs/libcaca_la-slang.o driver/.libs/libcaca_la-vga.o driver/.libs/libcaca_la-win32.o driver/.libs/libcaca_la-x11.o driver/.libs/libcaca_la-gl.o   -Wl,--as-needed -lncursesw -lX11 -L/usr/lib64 -lGL -lGLU -lglut -lftgl -lz  -Wl,-O1 -Wl,--sort-common   -Wl,-soname -Wl,libcaca.so.0 -o .libs/libcaca.so.0.99.19
  397. libtool: link: (cd ".libs" && rm -f "libcaca.so.0" && ln -s "libcaca.so.0.99.19" "libcaca.so.0")
  398. libtool: link: (cd ".libs" && rm -f "libcaca.so" && ln -s "libcaca.so.0.99.19" "libcaca.so")
  399. libtool: link: ( cd ".libs" && rm -f "libcaca.la" && ln -s "../libcaca.la" "libcaca.la" )
  400. make[2]: Leaving directory '/var/tmp/portage/media-libs/libcaca-0.99_beta19/work/libcaca-0.99.beta19-abi_x86_64.amd64/caca'
  401. Making all in src
  402. make[2]: Entering directory '/var/tmp/portage/media-libs/libcaca-0.99_beta19/work/libcaca-0.99.beta19-abi_x86_64.amd64/src'
  403. x86_64-pc-linux-gnu-gcc -DHAVE_CONFIG_H -I. -I/var/tmp/portage/media-libs/libcaca-0.99_beta19/work/libcaca-0.99.beta19/src -I..  -I/var/tmp/portage/media-libs/libcaca-0.99_beta19/work/libcaca-0.99.beta19 -I/var/tmp/portage/media-libs/libcaca-0.99_beta19/work/libcaca-0.99.beta19/caca -I../caca -DLIBCACA=1 -DX_DISPLAY_MISSING=1   -march=sandybridge -O2 -pipe  -Wall -Wpointer-arith -Wcast-align -Wcast-qual -Wstrict-prototypes -Wshadow -Waggregate-return -Wmissing-prototypes -Wnested-externs -Wsign-compare -c -o cacademo.o /var/tmp/portage/media-libs/libcaca-0.99_beta19/work/libcaca-0.99.beta19/src/cacademo.c
  404. x86_64-pc-linux-gnu-gcc -DHAVE_CONFIG_H -I. -I/var/tmp/portage/media-libs/libcaca-0.99_beta19/work/libcaca-0.99.beta19/src -I..  -I/var/tmp/portage/media-libs/libcaca-0.99_beta19/work/libcaca-0.99.beta19 -I/var/tmp/portage/media-libs/libcaca-0.99_beta19/work/libcaca-0.99.beta19/caca -I../caca -DLIBCACA=1 -DX_DISPLAY_MISSING=1   -march=sandybridge -O2 -pipe  -Wall -Wpointer-arith -Wcast-align -Wcast-qual -Wstrict-prototypes -Wshadow -Waggregate-return -Wmissing-prototypes -Wnested-externs -Wsign-compare -c -o aafire.o /var/tmp/portage/media-libs/libcaca-0.99_beta19/work/libcaca-0.99.beta19/src/aafire.c
  405. x86_64-pc-linux-gnu-gcc -DHAVE_CONFIG_H -I. -I/var/tmp/portage/media-libs/libcaca-0.99_beta19/work/libcaca-0.99.beta19/src -I..  -I/var/tmp/portage/media-libs/libcaca-0.99_beta19/work/libcaca-0.99.beta19 -I/var/tmp/portage/media-libs/libcaca-0.99_beta19/work/libcaca-0.99.beta19/caca -I../caca -DLIBCACA=1 -DX_DISPLAY_MISSING=1   -march=sandybridge -O2 -pipe  -Wall -Wpointer-arith -Wcast-align -Wcast-qual -Wstrict-prototypes -Wshadow -Waggregate-return -Wmissing-prototypes -Wnested-externs -Wsign-compare -c -o cacaplay.o /var/tmp/portage/media-libs/libcaca-0.99_beta19/work/libcaca-0.99.beta19/src/cacaplay.c
  406. x86_64-pc-linux-gnu-gcc -DHAVE_CONFIG_H -I. -I/var/tmp/portage/media-libs/libcaca-0.99_beta19/work/libcaca-0.99.beta19/src -I..  -I/var/tmp/portage/media-libs/libcaca-0.99_beta19/work/libcaca-0.99.beta19 -I/var/tmp/portage/media-libs/libcaca-0.99_beta19/work/libcaca-0.99.beta19/caca -I../caca -DLIBCACA=1 -DX_DISPLAY_MISSING=1   -march=sandybridge -O2 -pipe  -Wall -Wpointer-arith -Wcast-align -Wcast-qual -Wstrict-prototypes -Wshadow -Waggregate-return -Wmissing-prototypes -Wnested-externs -Wsign-compare -c -o cacaview-cacaview.o `test -f 'cacaview.c' || echo '/var/tmp/portage/media-libs/libcaca-0.99_beta19/work/libcaca-0.99.beta19/src/'`cacaview.c
  407. x86_64-pc-linux-gnu-gcc -DHAVE_CONFIG_H -I. -I/var/tmp/portage/media-libs/libcaca-0.99_beta19/work/libcaca-0.99.beta19/src -I..  -I/var/tmp/portage/media-libs/libcaca-0.99_beta19/work/libcaca-0.99.beta19 -I/var/tmp/portage/media-libs/libcaca-0.99_beta19/work/libcaca-0.99.beta19/caca -I../caca -DLIBCACA=1 -DX_DISPLAY_MISSING=1   -march=sandybridge -O2 -pipe  -Wall -Wpointer-arith -Wcast-align -Wcast-qual -Wstrict-prototypes -Wshadow -Waggregate-return -Wmissing-prototypes -Wnested-externs -Wsign-compare -c -o cacaview-common-image.o `test -f 'common-image.c' || echo '/var/tmp/portage/media-libs/libcaca-0.99_beta19/work/libcaca-0.99.beta19/src/'`common-image.c
  408. x86_64-pc-linux-gnu-gcc -DHAVE_CONFIG_H -I. -I/var/tmp/portage/media-libs/libcaca-0.99_beta19/work/libcaca-0.99.beta19/src -I..  -I/var/tmp/portage/media-libs/libcaca-0.99_beta19/work/libcaca-0.99.beta19 -I/var/tmp/portage/media-libs/libcaca-0.99_beta19/work/libcaca-0.99.beta19/caca -I../caca -DLIBCACA=1 -DX_DISPLAY_MISSING=1   -march=sandybridge -O2 -pipe  -Wall -Wpointer-arith -Wcast-align -Wcast-qual -Wstrict-prototypes -Wshadow -Waggregate-return -Wmissing-prototypes -Wnested-externs -Wsign-compare -c -o img2txt-img2txt.o `test -f 'img2txt.c' || echo '/var/tmp/portage/media-libs/libcaca-0.99_beta19/work/libcaca-0.99.beta19/src/'`img2txt.c
  409. x86_64-pc-linux-gnu-gcc -DHAVE_CONFIG_H -I. -I/var/tmp/portage/media-libs/libcaca-0.99_beta19/work/libcaca-0.99.beta19/src -I..  -I/var/tmp/portage/media-libs/libcaca-0.99_beta19/work/libcaca-0.99.beta19 -I/var/tmp/portage/media-libs/libcaca-0.99_beta19/work/libcaca-0.99.beta19/caca -I../caca -DLIBCACA=1 -DX_DISPLAY_MISSING=1   -march=sandybridge -O2 -pipe  -Wall -Wpointer-arith -Wcast-align -Wcast-qual -Wstrict-prototypes -Wshadow -Waggregate-return -Wmissing-prototypes -Wnested-externs -Wsign-compare -c -o img2txt-common-image.o `test -f 'common-image.c' || echo '/var/tmp/portage/media-libs/libcaca-0.99_beta19/work/libcaca-0.99.beta19/src/'`common-image.c
  410. x86_64-pc-linux-gnu-gcc -DHAVE_CONFIG_H -I. -I/var/tmp/portage/media-libs/libcaca-0.99_beta19/work/libcaca-0.99.beta19/src -I..  -I/var/tmp/portage/media-libs/libcaca-0.99_beta19/work/libcaca-0.99.beta19 -I/var/tmp/portage/media-libs/libcaca-0.99_beta19/work/libcaca-0.99.beta19/caca -I../caca -DLIBCACA=1 -DX_DISPLAY_MISSING=1   -march=sandybridge -O2 -pipe  -Wall -Wpointer-arith -Wcast-align -Wcast-qual -Wstrict-prototypes -Wshadow -Waggregate-return -Wmissing-prototypes -Wnested-externs -Wsign-compare -c -o cacaclock.o /var/tmp/portage/media-libs/libcaca-0.99_beta19/work/libcaca-0.99.beta19/src/cacaclock.c
  411. x86_64-pc-linux-gnu-gcc -DHAVE_CONFIG_H -I. -I/var/tmp/portage/media-libs/libcaca-0.99_beta19/work/libcaca-0.99.beta19/src -I..  -I/var/tmp/portage/media-libs/libcaca-0.99_beta19/work/libcaca-0.99.beta19 -I/var/tmp/portage/media-libs/libcaca-0.99_beta19/work/libcaca-0.99.beta19/caca -I../caca -DLIBCACA=1 -DX_DISPLAY_MISSING=1   -march=sandybridge -O2 -pipe  -Wall -Wpointer-arith -Wcast-align -Wcast-qual -Wstrict-prototypes -Wshadow -Waggregate-return -Wmissing-prototypes -Wnested-externs -Wsign-compare -c -o cacaserver.o /var/tmp/portage/media-libs/libcaca-0.99_beta19/work/libcaca-0.99.beta19/src/cacaserver.c
  412. /var/tmp/portage/media-libs/libcaca-0.99_beta19/work/libcaca-0.99.beta19/src/aafire.c: In function ‘firemain’:
  413. /var/tmp/portage/media-libs/libcaca-0.99_beta19/work/libcaca-0.99.beta19/src/aafire.c:185:25: warning: variable ‘i’ set but not used [-Wunused-but-set-variable]
  414.    register unsigned int i;
  415.                          ^
  416. /var/tmp/portage/media-libs/libcaca-0.99_beta19/work/libcaca-0.99.beta19/src/cacademo.c: In function ‘do_plasma’:
  417. /var/tmp/portage/media-libs/libcaca-0.99_beta19/work/libcaca-0.99.beta19/src/cacademo.c:408:22: warning: variable ‘x’ set but not used [-Wunused-but-set-variable]
  418.          unsigned int x;
  419.                       ^
  420. /var/tmp/portage/media-libs/libcaca-0.99_beta19/work/libcaca-0.99.beta19/src/cacaserver.c: In function ‘main’:
  421. /var/tmp/portage/media-libs/libcaca-0.99_beta19/work/libcaca-0.99.beta19/src/cacaserver.c:210:13: warning: ignoring return value of ‘read’, declared with attribute warn_unused_result [-Wunused-result]
  422.              read(0, server->input + server->read, 12 - server->read);
  423.              ^
  424. /var/tmp/portage/media-libs/libcaca-0.99_beta19/work/libcaca-0.99.beta19/src/cacaserver.c:218:13: warning: ignoring return value of ‘read’, declared with attribute warn_unused_result [-Wunused-result]
  425.              read(0, server->input + server->read - 1, 1);
  426.              ^
  427. x86_64-pc-linux-gnu-gcc -DHAVE_CONFIG_H -I. -I/var/tmp/portage/media-libs/libcaca-0.99_beta19/work/libcaca-0.99.beta19/src -I..  -I/var/tmp/portage/media-libs/libcaca-0.99_beta19/work/libcaca-0.99.beta19 -I/var/tmp/portage/media-libs/libcaca-0.99_beta19/work/libcaca-0.99.beta19/caca -I../caca -DLIBCACA=1 -DX_DISPLAY_MISSING=1   -march=sandybridge -O2 -pipe  -Wall -Wpointer-arith -Wcast-align -Wcast-qual -Wstrict-prototypes -Wshadow -Waggregate-return -Wmissing-prototypes -Wnested-externs -Wsign-compare -c -o cacadraw.o /var/tmp/portage/media-libs/libcaca-0.99_beta19/work/libcaca-0.99.beta19/src/cacadraw.c
  428. /bin/sh ../libtool  --tag=CC   --mode=link x86_64-pc-linux-gnu-gcc  -march=sandybridge -O2 -pipe  -Wall -Wpointer-arith -Wcast-align -Wcast-qual -Wstrict-prototypes -Wshadow -Waggregate-return -Wmissing-prototypes -Wnested-externs -Wsign-compare  -Wl,-O1 -Wl,--sort-common -Wl,--as-needed -o cacafire aafire.o ../caca/libcaca.la ../caca/libcaca.la
  429. /bin/sh ../libtool  --tag=CC   --mode=link x86_64-pc-linux-gnu-gcc  -march=sandybridge -O2 -pipe  -Wall -Wpointer-arith -Wcast-align -Wcast-qual -Wstrict-prototypes -Wshadow -Waggregate-return -Wmissing-prototypes -Wnested-externs -Wsign-compare  -Wl,-O1 -Wl,--sort-common -Wl,--as-needed -o cacaclock cacaclock.o ../caca/libcaca.la
  430. /bin/sh ../libtool  --tag=CC   --mode=link x86_64-pc-linux-gnu-gcc  -march=sandybridge -O2 -pipe  -Wall -Wpointer-arith -Wcast-align -Wcast-qual -Wstrict-prototypes -Wshadow -Waggregate-return -Wmissing-prototypes -Wnested-externs -Wsign-compare  -Wl,-O1 -Wl,--sort-common -Wl,--as-needed -o cacaplay cacaplay.o ../caca/libcaca.la ../caca/libcaca.la
  431. /bin/sh ../libtool  --tag=CC   --mode=link x86_64-pc-linux-gnu-gcc  -march=sandybridge -O2 -pipe  -Wall -Wpointer-arith -Wcast-align -Wcast-qual -Wstrict-prototypes -Wshadow -Waggregate-return -Wmissing-prototypes -Wnested-externs -Wsign-compare  -Wl,-O1 -Wl,--sort-common -Wl,--as-needed -o img2txt img2txt-img2txt.o img2txt-common-image.o ../caca/libcaca.la
  432. /bin/sh ../libtool  --tag=CC   --mode=link x86_64-pc-linux-gnu-gcc  -march=sandybridge -O2 -pipe  -Wall -Wpointer-arith -Wcast-align -Wcast-qual -Wstrict-prototypes -Wshadow -Waggregate-return -Wmissing-prototypes -Wnested-externs -Wsign-compare  -Wl,-O1 -Wl,--sort-common -Wl,--as-needed -o cacadraw cacadraw.o ../caca/libcaca.la ../caca/libcaca.la
  433. /bin/sh ../libtool  --tag=CC   --mode=link x86_64-pc-linux-gnu-gcc  -march=sandybridge -O2 -pipe  -Wall -Wpointer-arith -Wcast-align -Wcast-qual -Wstrict-prototypes -Wshadow -Waggregate-return -Wmissing-prototypes -Wnested-externs -Wsign-compare  -Wl,-O1 -Wl,--sort-common -Wl,--as-needed -o cacaserver cacaserver.o ../caca/libcaca.la
  434. /bin/sh ../libtool  --tag=CC   --mode=link x86_64-pc-linux-gnu-gcc  -march=sandybridge -O2 -pipe  -Wall -Wpointer-arith -Wcast-align -Wcast-qual -Wstrict-prototypes -Wshadow -Waggregate-return -Wmissing-prototypes -Wnested-externs -Wsign-compare  -Wl,-O1 -Wl,--sort-common -Wl,--as-needed -o cacaview cacaview-cacaview.o cacaview-common-image.o ../caca/libcaca.la ../caca/libcaca.la
  435. libtool: link: x86_64-pc-linux-gnu-gcc -march=sandybridge -O2 -pipe -Wall -Wpointer-arith -Wcast-align -Wcast-qual -Wstrict-prototypes -Wshadow -Waggregate-return -Wmissing-prototypes -Wnested-externs -Wsign-compare -Wl,-O1 -Wl,--sort-common -o .libs/cacafire aafire.o  -Wl,--as-needed -L/usr/lib64 ../caca/.libs/libcaca.so -lncursesw -lX11 -lGL -lGLU -lglut -lftgl -lz
  436. libtool: link: x86_64-pc-linux-gnu-gcc -march=sandybridge -O2 -pipe -Wall -Wpointer-arith -Wcast-align -Wcast-qual -Wstrict-prototypes -Wshadow -Waggregate-return -Wmissing-prototypes -Wnested-externs -Wsign-compare -Wl,-O1 -Wl,--sort-common -o .libs/cacaclock cacaclock.o  -Wl,--as-needed ../caca/.libs/libcaca.so -L/usr/lib64 -lncursesw -lX11 -lGL -lGLU -lglut -lftgl -lz
  437. libtool: link: x86_64-pc-linux-gnu-gcc -march=sandybridge -O2 -pipe -Wall -Wpointer-arith -Wcast-align -Wcast-qual -Wstrict-prototypes -Wshadow -Waggregate-return -Wmissing-prototypes -Wnested-externs -Wsign-compare -Wl,-O1 -Wl,--sort-common -o .libs/cacaplay cacaplay.o  -Wl,--as-needed -L/usr/lib64 ../caca/.libs/libcaca.so -lncursesw -lX11 -lGL -lGLU -lglut -lftgl -lz
  438. libtool: link: x86_64-pc-linux-gnu-gcc -march=sandybridge -O2 -pipe -Wall -Wpointer-arith -Wcast-align -Wcast-qual -Wstrict-prototypes -Wshadow -Waggregate-return -Wmissing-prototypes -Wnested-externs -Wsign-compare -Wl,-O1 -Wl,--sort-common -o .libs/cacadraw cacadraw.o  -Wl,--as-needed -L/usr/lib64 ../caca/.libs/libcaca.so -lncursesw -lX11 -lGL -lGLU -lglut -lftgl -lz
  439. libtool: link: x86_64-pc-linux-gnu-gcc -march=sandybridge -O2 -pipe -Wall -Wpointer-arith -Wcast-align -Wcast-qual -Wstrict-prototypes -Wshadow -Waggregate-return -Wmissing-prototypes -Wnested-externs -Wsign-compare -Wl,-O1 -Wl,--sort-common -o .libs/img2txt img2txt-img2txt.o img2txt-common-image.o  -Wl,--as-needed ../caca/.libs/libcaca.so -L/usr/lib64 -lncursesw -lX11 -lGL -lGLU -lglut -lftgl -lz
  440. libtool: link: x86_64-pc-linux-gnu-gcc -march=sandybridge -O2 -pipe -Wall -Wpointer-arith -Wcast-align -Wcast-qual -Wstrict-prototypes -Wshadow -Waggregate-return -Wmissing-prototypes -Wnested-externs -Wsign-compare -Wl,-O1 -Wl,--sort-common -o .libs/cacaserver cacaserver.o  -Wl,--as-needed ../caca/.libs/libcaca.so -L/usr/lib64 -lncursesw -lX11 -lGL -lGLU -lglut -lftgl -lz
  441. libtool: link: x86_64-pc-linux-gnu-gcc -march=sandybridge -O2 -pipe -Wall -Wpointer-arith -Wcast-align -Wcast-qual -Wstrict-prototypes -Wshadow -Waggregate-return -Wmissing-prototypes -Wnested-externs -Wsign-compare -Wl,-O1 -Wl,--sort-common -o .libs/cacaview cacaview-cacaview.o cacaview-common-image.o  -Wl,--as-needed -L/usr/lib64 ../caca/.libs/libcaca.so -lncursesw -lX11 -lGL -lGLU -lglut -lftgl -lz
  442. /bin/sh ../libtool  --tag=CC   --mode=link x86_64-pc-linux-gnu-gcc  -march=sandybridge -O2 -pipe  -Wall -Wpointer-arith -Wcast-align -Wcast-qual -Wstrict-prototypes -Wshadow -Waggregate-return -Wmissing-prototypes -Wnested-externs -Wsign-compare -lm -Wl,-O1 -Wl,--sort-common -Wl,--as-needed -o cacademo cacademo.o ../caca/libcaca.la ../caca/libcaca.la
  443. libtool: link: x86_64-pc-linux-gnu-gcc -march=sandybridge -O2 -pipe -Wall -Wpointer-arith -Wcast-align -Wcast-qual -Wstrict-prototypes -Wshadow -Waggregate-return -Wmissing-prototypes -Wnested-externs -Wsign-compare -Wl,-O1 -Wl,--sort-common -o .libs/cacademo cacademo.o  -lm -Wl,--as-needed -L/usr/lib64 ../caca/.libs/libcaca.so -lncursesw -lX11 -lGL -lGLU -lglut -lftgl -lz
  444. make[2]: Leaving directory '/var/tmp/portage/media-libs/libcaca-0.99_beta19/work/libcaca-0.99.beta19-abi_x86_64.amd64/src'
  445. Making all in examples
  446. make[2]: Entering directory '/var/tmp/portage/media-libs/libcaca-0.99_beta19/work/libcaca-0.99.beta19-abi_x86_64.amd64/examples'
  447. x86_64-pc-linux-gnu-gcc -DHAVE_CONFIG_H -I. -I/var/tmp/portage/media-libs/libcaca-0.99_beta19/work/libcaca-0.99.beta19/examples -I..  -I/var/tmp/portage/media-libs/libcaca-0.99_beta19/work/libcaca-0.99.beta19 -I/var/tmp/portage/media-libs/libcaca-0.99_beta19/work/libcaca-0.99.beta19/caca -I../caca   -march=sandybridge -O2 -pipe  -Wall -Wpointer-arith -Wcast-align -Wcast-qual -Wstrict-prototypes -Wshadow -Waggregate-return -Wmissing-prototypes -Wnested-externs -Wsign-compare -c -o trifiller-trifiller.o `test -f 'trifiller.c' || echo '/var/tmp/portage/media-libs/libcaca-0.99_beta19/work/libcaca-0.99.beta19/examples/'`trifiller.c
  448. x86_64-pc-linux-gnu-gcc -DHAVE_CONFIG_H -I. -I/var/tmp/portage/media-libs/libcaca-0.99_beta19/work/libcaca-0.99.beta19/examples -I..  -I/var/tmp/portage/media-libs/libcaca-0.99_beta19/work/libcaca-0.99.beta19 -I/var/tmp/portage/media-libs/libcaca-0.99_beta19/work/libcaca-0.99.beta19/caca -I../caca   -march=sandybridge -O2 -pipe  -Wall -Wpointer-arith -Wcast-align -Wcast-qual -Wstrict-prototypes -Wshadow -Waggregate-return -Wmissing-prototypes -Wnested-externs -Wsign-compare -c -o blit.o /var/tmp/portage/media-libs/libcaca-0.99_beta19/work/libcaca-0.99.beta19/examples/blit.c
  449. x86_64-pc-linux-gnu-gcc -DHAVE_CONFIG_H -I. -I/var/tmp/portage/media-libs/libcaca-0.99_beta19/work/libcaca-0.99.beta19/examples -I..  -I/var/tmp/portage/media-libs/libcaca-0.99_beta19/work/libcaca-0.99.beta19 -I/var/tmp/portage/media-libs/libcaca-0.99_beta19/work/libcaca-0.99.beta19/caca -I../caca   -march=sandybridge -O2 -pipe  -Wall -Wpointer-arith -Wcast-align -Wcast-qual -Wstrict-prototypes -Wshadow -Waggregate-return -Wmissing-prototypes -Wnested-externs -Wsign-compare -c -o canvas.o /var/tmp/portage/media-libs/libcaca-0.99_beta19/work/libcaca-0.99.beta19/examples/canvas.c
  450. x86_64-pc-linux-gnu-gcc -DHAVE_CONFIG_H -I. -I/var/tmp/portage/media-libs/libcaca-0.99_beta19/work/libcaca-0.99.beta19/examples -I..  -I/var/tmp/portage/media-libs/libcaca-0.99_beta19/work/libcaca-0.99.beta19 -I/var/tmp/portage/media-libs/libcaca-0.99_beta19/work/libcaca-0.99.beta19/caca -I../caca   -march=sandybridge -O2 -pipe  -Wall -Wpointer-arith -Wcast-align -Wcast-qual -Wstrict-prototypes -Wshadow -Waggregate-return -Wmissing-prototypes -Wnested-externs -Wsign-compare -c -o colors.o /var/tmp/portage/media-libs/libcaca-0.99_beta19/work/libcaca-0.99.beta19/examples/colors.c
  451. x86_64-pc-linux-gnu-gcc -DHAVE_CONFIG_H -I. -I/var/tmp/portage/media-libs/libcaca-0.99_beta19/work/libcaca-0.99.beta19/examples -I..  -I/var/tmp/portage/media-libs/libcaca-0.99_beta19/work/libcaca-0.99.beta19 -I/var/tmp/portage/media-libs/libcaca-0.99_beta19/work/libcaca-0.99.beta19/caca -I../caca   -march=sandybridge -O2 -pipe  -Wall -Wpointer-arith -Wcast-align -Wcast-qual -Wstrict-prototypes -Wshadow -Waggregate-return -Wmissing-prototypes -Wnested-externs -Wsign-compare -c -o conio.o /var/tmp/portage/media-libs/libcaca-0.99_beta19/work/libcaca-0.99.beta19/examples/conio.c
  452. x86_64-pc-linux-gnu-g++ -DHAVE_CONFIG_H -I. -I/var/tmp/portage/media-libs/libcaca-0.99_beta19/work/libcaca-0.99.beta19/examples -I..  -I/var/tmp/portage/media-libs/libcaca-0.99_beta19/work/libcaca-0.99.beta19 -I/var/tmp/portage/media-libs/libcaca-0.99_beta19/work/libcaca-0.99.beta19/caca -I../caca   -march=sandybridge -O2 -pipe -Wall -Wpointer-arith -Wcast-align -Wcast-qual -Wshadow -Wsign-compare -c -o conio-snake.o /var/tmp/portage/media-libs/libcaca-0.99_beta19/work/libcaca-0.99.beta19/examples/conio-snake.cpp
  453. x86_64-pc-linux-gnu-gcc -DHAVE_CONFIG_H -I. -I/var/tmp/portage/media-libs/libcaca-0.99_beta19/work/libcaca-0.99.beta19/examples -I..  -I/var/tmp/portage/media-libs/libcaca-0.99_beta19/work/libcaca-0.99.beta19 -I/var/tmp/portage/media-libs/libcaca-0.99_beta19/work/libcaca-0.99.beta19/caca -I../caca   -march=sandybridge -O2 -pipe  -Wall -Wpointer-arith -Wcast-align -Wcast-qual -Wstrict-prototypes -Wshadow -Waggregate-return -Wmissing-prototypes -Wnested-externs -Wsign-compare -c -o demo.o /var/tmp/portage/media-libs/libcaca-0.99_beta19/work/libcaca-0.99.beta19/examples/demo.c
  454. x86_64-pc-linux-gnu-gcc -DHAVE_CONFIG_H -I. -I/var/tmp/portage/media-libs/libcaca-0.99_beta19/work/libcaca-0.99.beta19/examples -I..  -I/var/tmp/portage/media-libs/libcaca-0.99_beta19/work/libcaca-0.99.beta19 -I/var/tmp/portage/media-libs/libcaca-0.99_beta19/work/libcaca-0.99.beta19/caca -I../caca   -march=sandybridge -O2 -pipe  -Wall -Wpointer-arith -Wcast-align -Wcast-qual -Wstrict-prototypes -Wshadow -Waggregate-return -Wmissing-prototypes -Wnested-externs -Wsign-compare -c -o demo0.o /var/tmp/portage/media-libs/libcaca-0.99_beta19/work/libcaca-0.99.beta19/examples/demo0.c
  455. x86_64-pc-linux-gnu-gcc -DHAVE_CONFIG_H -I. -I/var/tmp/portage/media-libs/libcaca-0.99_beta19/work/libcaca-0.99.beta19/examples -I..  -I/var/tmp/portage/media-libs/libcaca-0.99_beta19/work/libcaca-0.99.beta19 -I/var/tmp/portage/media-libs/libcaca-0.99_beta19/work/libcaca-0.99.beta19/caca -I../caca   -march=sandybridge -O2 -pipe  -Wall -Wpointer-arith -Wcast-align -Wcast-qual -Wstrict-prototypes -Wshadow -Waggregate-return -Wmissing-prototypes -Wnested-externs -Wsign-compare -c -o dithering.o /var/tmp/portage/media-libs/libcaca-0.99_beta19/work/libcaca-0.99.beta19/examples/dithering.c
  456. x86_64-pc-linux-gnu-gcc -DHAVE_CONFIG_H -I. -I/var/tmp/portage/media-libs/libcaca-0.99_beta19/work/libcaca-0.99.beta19/examples -I..  -I/var/tmp/portage/media-libs/libcaca-0.99_beta19/work/libcaca-0.99.beta19 -I/var/tmp/portage/media-libs/libcaca-0.99_beta19/work/libcaca-0.99.beta19/caca -I../caca   -march=sandybridge -O2 -pipe  -Wall -Wpointer-arith -Wcast-align -Wcast-qual -Wstrict-prototypes -Wshadow -Waggregate-return -Wmissing-prototypes -Wnested-externs -Wsign-compare -c -o driver.o /var/tmp/portage/media-libs/libcaca-0.99_beta19/work/libcaca-0.99.beta19/examples/driver.c
  457. x86_64-pc-linux-gnu-gcc -DHAVE_CONFIG_H -I. -I/var/tmp/portage/media-libs/libcaca-0.99_beta19/work/libcaca-0.99.beta19/examples -I..  -I/var/tmp/portage/media-libs/libcaca-0.99_beta19/work/libcaca-0.99.beta19 -I/var/tmp/portage/media-libs/libcaca-0.99_beta19/work/libcaca-0.99.beta19/caca -I../caca   -march=sandybridge -O2 -pipe  -Wall -Wpointer-arith -Wcast-align -Wcast-qual -Wstrict-prototypes -Wshadow -Waggregate-return -Wmissing-prototypes -Wnested-externs -Wsign-compare -c -o event.o /var/tmp/portage/media-libs/libcaca-0.99_beta19/work/libcaca-0.99.beta19/examples/event.c
  458. x86_64-pc-linux-gnu-gcc -DHAVE_CONFIG_H -I. -I/var/tmp/portage/media-libs/libcaca-0.99_beta19/work/libcaca-0.99.beta19/examples -I..  -I/var/tmp/portage/media-libs/libcaca-0.99_beta19/work/libcaca-0.99.beta19 -I/var/tmp/portage/media-libs/libcaca-0.99_beta19/work/libcaca-0.99.beta19/caca -I../caca   -march=sandybridge -O2 -pipe  -Wall -Wpointer-arith -Wcast-align -Wcast-qual -Wstrict-prototypes -Wshadow -Waggregate-return -Wmissing-prototypes -Wnested-externs -Wsign-compare -c -o export.o /var/tmp/portage/media-libs/libcaca-0.99_beta19/work/libcaca-0.99.beta19/examples/export.c
  459. x86_64-pc-linux-gnu-gcc -DHAVE_CONFIG_H -I. -I/var/tmp/portage/media-libs/libcaca-0.99_beta19/work/libcaca-0.99.beta19/examples -I..  -I/var/tmp/portage/media-libs/libcaca-0.99_beta19/work/libcaca-0.99.beta19 -I/var/tmp/portage/media-libs/libcaca-0.99_beta19/work/libcaca-0.99.beta19/caca -I../caca   -march=sandybridge -O2 -pipe  -Wall -Wpointer-arith -Wcast-align -Wcast-qual -Wstrict-prototypes -Wshadow -Waggregate-return -Wmissing-prototypes -Wnested-externs -Wsign-compare -c -o figfont.o /var/tmp/portage/media-libs/libcaca-0.99_beta19/work/libcaca-0.99.beta19/examples/figfont.c
  460. x86_64-pc-linux-gnu-gcc -DHAVE_CONFIG_H -I. -I/var/tmp/portage/media-libs/libcaca-0.99_beta19/work/libcaca-0.99.beta19/examples -I..  -I/var/tmp/portage/media-libs/libcaca-0.99_beta19/work/libcaca-0.99.beta19 -I/var/tmp/portage/media-libs/libcaca-0.99_beta19/work/libcaca-0.99.beta19/caca -I../caca   -march=sandybridge -O2 -pipe  -Wall -Wpointer-arith -Wcast-align -Wcast-qual -Wstrict-prototypes -Wshadow -Waggregate-return -Wmissing-prototypes -Wnested-externs -Wsign-compare -c -o font.o /var/tmp/portage/media-libs/libcaca-0.99_beta19/work/libcaca-0.99.beta19/examples/font.c
  461. x86_64-pc-linux-gnu-gcc -DHAVE_CONFIG_H -I. -I/var/tmp/portage/media-libs/libcaca-0.99_beta19/work/libcaca-0.99.beta19/examples -I..  -I/var/tmp/portage/media-libs/libcaca-0.99_beta19/work/libcaca-0.99.beta19 -I/var/tmp/portage/media-libs/libcaca-0.99_beta19/work/libcaca-0.99.beta19/caca -I../caca   -march=sandybridge -O2 -pipe  -Wall -Wpointer-arith -Wcast-align -Wcast-qual -Wstrict-prototypes -Wshadow -Waggregate-return -Wmissing-prototypes -Wnested-externs -Wsign-compare -c -o font2tga.o /var/tmp/portage/media-libs/libcaca-0.99_beta19/work/libcaca-0.99.beta19/examples/font2tga.c
  462. x86_64-pc-linux-gnu-gcc -DHAVE_CONFIG_H -I. -I/var/tmp/portage/media-libs/libcaca-0.99_beta19/work/libcaca-0.99.beta19/examples -I..  -I/var/tmp/portage/media-libs/libcaca-0.99_beta19/work/libcaca-0.99.beta19 -I/var/tmp/portage/media-libs/libcaca-0.99_beta19/work/libcaca-0.99.beta19/caca -I../caca   -march=sandybridge -O2 -pipe  -Wall -Wpointer-arith -Wcast-align -Wcast-qual -Wstrict-prototypes -Wshadow -Waggregate-return -Wmissing-prototypes -Wnested-externs -Wsign-compare -c -o frames.o /var/tmp/portage/media-libs/libcaca-0.99_beta19/work/libcaca-0.99.beta19/examples/frames.c
  463. x86_64-pc-linux-gnu-gcc -DHAVE_CONFIG_H -I. -I/var/tmp/portage/media-libs/libcaca-0.99_beta19/work/libcaca-0.99.beta19/examples -I..  -I/var/tmp/portage/media-libs/libcaca-0.99_beta19/work/libcaca-0.99.beta19 -I/var/tmp/portage/media-libs/libcaca-0.99_beta19/work/libcaca-0.99.beta19/caca -I../caca   -march=sandybridge -O2 -pipe  -Wall -Wpointer-arith -Wcast-align -Wcast-qual -Wstrict-prototypes -Wshadow -Waggregate-return -Wmissing-prototypes -Wnested-externs -Wsign-compare -c -o fullwidth.o /var/tmp/portage/media-libs/libcaca-0.99_beta19/work/libcaca-0.99.beta19/examples/fullwidth.c
  464. x86_64-pc-linux-gnu-gcc -DHAVE_CONFIG_H -I. -I/var/tmp/portage/media-libs/libcaca-0.99_beta19/work/libcaca-0.99.beta19/examples -I..  -I/var/tmp/portage/media-libs/libcaca-0.99_beta19/work/libcaca-0.99.beta19 -I/var/tmp/portage/media-libs/libcaca-0.99_beta19/work/libcaca-0.99.beta19/caca -I../caca   -march=sandybridge -O2 -pipe  -Wall -Wpointer-arith -Wcast-align -Wcast-qual -Wstrict-prototypes -Wshadow -Waggregate-return -Wmissing-prototypes -Wnested-externs -Wsign-compare -c -o gamma.o /var/tmp/portage/media-libs/libcaca-0.99_beta19/work/libcaca-0.99.beta19/examples/gamma.c
  465. x86_64-pc-linux-gnu-gcc -DHAVE_CONFIG_H -I. -I/var/tmp/portage/media-libs/libcaca-0.99_beta19/work/libcaca-0.99.beta19/examples -I..  -I/var/tmp/portage/media-libs/libcaca-0.99_beta19/work/libcaca-0.99.beta19 -I/var/tmp/portage/media-libs/libcaca-0.99_beta19/work/libcaca-0.99.beta19/caca -I../caca   -march=sandybridge -O2 -pipe  -Wall -Wpointer-arith -Wcast-align -Wcast-qual -Wstrict-prototypes -Wshadow -Waggregate-return -Wmissing-prototypes -Wnested-externs -Wsign-compare -c -o hsv.o /var/tmp/portage/media-libs/libcaca-0.99_beta19/work/libcaca-0.99.beta19/examples/hsv.c
  466. x86_64-pc-linux-gnu-gcc -DHAVE_CONFIG_H -I. -I/var/tmp/portage/media-libs/libcaca-0.99_beta19/work/libcaca-0.99.beta19/examples -I..  -I/var/tmp/portage/media-libs/libcaca-0.99_beta19/work/libcaca-0.99.beta19 -I/var/tmp/portage/media-libs/libcaca-0.99_beta19/work/libcaca-0.99.beta19/caca -I../caca   -march=sandybridge -O2 -pipe  -Wall -Wpointer-arith -Wcast-align -Wcast-qual -Wstrict-prototypes -Wshadow -Waggregate-return -Wmissing-prototypes -Wnested-externs -Wsign-compare -c -o input.o /var/tmp/portage/media-libs/libcaca-0.99_beta19/work/libcaca-0.99.beta19/examples/input.c
  467. x86_64-pc-linux-gnu-gcc -DHAVE_CONFIG_H -I. -I/var/tmp/portage/media-libs/libcaca-0.99_beta19/work/libcaca-0.99.beta19/examples -I..  -I/var/tmp/portage/media-libs/libcaca-0.99_beta19/work/libcaca-0.99.beta19 -I/var/tmp/portage/media-libs/libcaca-0.99_beta19/work/libcaca-0.99.beta19/caca -I../caca   -march=sandybridge -O2 -pipe  -Wall -Wpointer-arith -Wcast-align -Wcast-qual -Wstrict-prototypes -Wshadow -Waggregate-return -Wmissing-prototypes -Wnested-externs -Wsign-compare -c -o spritedit.o /var/tmp/portage/media-libs/libcaca-0.99_beta19/work/libcaca-0.99.beta19/examples/spritedit.c
  468. x86_64-pc-linux-gnu-gcc -DHAVE_CONFIG_H -I. -I/var/tmp/portage/media-libs/libcaca-0.99_beta19/work/libcaca-0.99.beta19/examples -I..  -I/var/tmp/portage/media-libs/libcaca-0.99_beta19/work/libcaca-0.99.beta19 -I/var/tmp/portage/media-libs/libcaca-0.99_beta19/work/libcaca-0.99.beta19/caca -I../caca   -march=sandybridge -O2 -pipe  -Wall -Wpointer-arith -Wcast-align -Wcast-qual -Wstrict-prototypes -Wshadow -Waggregate-return -Wmissing-prototypes -Wnested-externs -Wsign-compare -c -o swallow.o /var/tmp/portage/media-libs/libcaca-0.99_beta19/work/libcaca-0.99.beta19/examples/swallow.c
  469. x86_64-pc-linux-gnu-gcc -DHAVE_CONFIG_H -I. -I/var/tmp/portage/media-libs/libcaca-0.99_beta19/work/libcaca-0.99.beta19/examples -I..  -I/var/tmp/portage/media-libs/libcaca-0.99_beta19/work/libcaca-0.99.beta19 -I/var/tmp/portage/media-libs/libcaca-0.99_beta19/work/libcaca-0.99.beta19/caca -I../caca   -march=sandybridge -O2 -pipe  -Wall -Wpointer-arith -Wcast-align -Wcast-qual -Wstrict-prototypes -Wshadow -Waggregate-return -Wmissing-prototypes -Wnested-externs -Wsign-compare -c -o text.o /var/tmp/portage/media-libs/libcaca-0.99_beta19/work/libcaca-0.99.beta19/examples/text.c
  470. x86_64-pc-linux-gnu-gcc -DHAVE_CONFIG_H -I. -I/var/tmp/portage/media-libs/libcaca-0.99_beta19/work/libcaca-0.99.beta19/examples -I..  -I/var/tmp/portage/media-libs/libcaca-0.99_beta19/work/libcaca-0.99.beta19 -I/var/tmp/portage/media-libs/libcaca-0.99_beta19/work/libcaca-0.99.beta19/caca -I../caca   -march=sandybridge -O2 -pipe  -Wall -Wpointer-arith -Wcast-align -Wcast-qual -Wstrict-prototypes -Wshadow -Waggregate-return -Wmissing-prototypes -Wnested-externs -Wsign-compare -c -o transform.o /var/tmp/portage/media-libs/libcaca-0.99_beta19/work/libcaca-0.99.beta19/examples/transform.c
  471. x86_64-pc-linux-gnu-gcc -DHAVE_CONFIG_H -I. -I/var/tmp/portage/media-libs/libcaca-0.99_beta19/work/libcaca-0.99.beta19/examples -I..  -I/var/tmp/portage/media-libs/libcaca-0.99_beta19/work/libcaca-0.99.beta19 -I/var/tmp/portage/media-libs/libcaca-0.99_beta19/work/libcaca-0.99.beta19/caca -I../caca   -march=sandybridge -O2 -pipe  -Wall -Wpointer-arith -Wcast-align -Wcast-qual -Wstrict-prototypes -Wshadow -Waggregate-return -Wmissing-prototypes -Wnested-externs -Wsign-compare -c -o truecolor.o /var/tmp/portage/media-libs/libcaca-0.99_beta19/work/libcaca-0.99.beta19/examples/truecolor.c
  472. x86_64-pc-linux-gnu-gcc -DHAVE_CONFIG_H -I. -I/var/tmp/portage/media-libs/libcaca-0.99_beta19/work/libcaca-0.99.beta19/examples -I..  -I/var/tmp/portage/media-libs/libcaca-0.99_beta19/work/libcaca-0.99.beta19 -I/var/tmp/portage/media-libs/libcaca-0.99_beta19/work/libcaca-0.99.beta19/caca -I../caca   -march=sandybridge -O2 -pipe  -Wall -Wpointer-arith -Wcast-align -Wcast-qual -Wstrict-prototypes -Wshadow -Waggregate-return -Wmissing-prototypes -Wnested-externs -Wsign-compare -c -o unicode.o /var/tmp/portage/media-libs/libcaca-0.99_beta19/work/libcaca-0.99.beta19/examples/unicode.c
  473. x86_64-pc-linux-gnu-gcc -DHAVE_CONFIG_H -I. -I/var/tmp/portage/media-libs/libcaca-0.99_beta19/work/libcaca-0.99.beta19/examples -I..  -I/var/tmp/portage/media-libs/libcaca-0.99_beta19/work/libcaca-0.99.beta19 -I/var/tmp/portage/media-libs/libcaca-0.99_beta19/work/libcaca-0.99.beta19/caca -I../caca   -march=sandybridge -O2 -pipe  -Wall -Wpointer-arith -Wcast-align -Wcast-qual -Wstrict-prototypes -Wshadow -Waggregate-return -Wmissing-prototypes -Wnested-externs -Wsign-compare -c -o import.o /var/tmp/portage/media-libs/libcaca-0.99_beta19/work/libcaca-0.99.beta19/examples/import.c
  474. x86_64-pc-linux-gnu-gcc -DHAVE_CONFIG_H -I. -I/var/tmp/portage/media-libs/libcaca-0.99_beta19/work/libcaca-0.99.beta19/examples -I..  -I/var/tmp/portage/media-libs/libcaca-0.99_beta19/work/libcaca-0.99.beta19 -I/var/tmp/portage/media-libs/libcaca-0.99_beta19/work/libcaca-0.99.beta19/caca -I../caca   -march=sandybridge -O2 -pipe  -Wall -Wpointer-arith -Wcast-align -Wcast-qual -Wstrict-prototypes -Wshadow -Waggregate-return -Wmissing-prototypes -Wnested-externs -Wsign-compare -c -o mouse.o /var/tmp/portage/media-libs/libcaca-0.99_beta19/work/libcaca-0.99.beta19/examples/mouse.c
  475. /var/tmp/portage/media-libs/libcaca-0.99_beta19/work/libcaca-0.99.beta19/examples/swallow.c: In function ‘main’:
  476. /var/tmp/portage/media-libs/libcaca-0.99_beta19/work/libcaca-0.99.beta19/examples/swallow.c:103:17: warning: ignoring return value of ‘fread’, declared with attribute warn_unused_result [-Wunused-result]
  477.                  fread(buf[i] + total[i], 128, 1, f[i]);
  478.                  ^
  479. x86_64-pc-linux-gnu-gcc -DHAVE_CONFIG_H -I. -I/var/tmp/portage/media-libs/libcaca-0.99_beta19/work/libcaca-0.99.beta19/examples -I..  -I/var/tmp/portage/media-libs/libcaca-0.99_beta19/work/libcaca-0.99.beta19 -I/var/tmp/portage/media-libs/libcaca-0.99_beta19/work/libcaca-0.99.beta19/caca -I../caca   -march=sandybridge -O2 -pipe  -Wall -Wpointer-arith -Wcast-align -Wcast-qual -Wstrict-prototypes -Wshadow -Waggregate-return -Wmissing-prototypes -Wnested-externs -Wsign-compare -c -o ../src/trifiller-common-image.o `test -f '../src/common-image.c' || echo '/var/tmp/portage/media-libs/libcaca-0.99_beta19/work/libcaca-0.99.beta19/examples/'`../src/common-image.c
  480. /bin/sh ../libtool  --tag=CC   --mode=link x86_64-pc-linux-gnu-gcc  -march=sandybridge -O2 -pipe  -Wall -Wpointer-arith -Wcast-align -Wcast-qual -Wstrict-prototypes -Wshadow -Waggregate-return -Wmissing-prototypes -Wnested-externs -Wsign-compare  -Wl,-O1 -Wl,--sort-common -Wl,--as-needed -o blit blit.o ../caca/libcaca.la
  481. /bin/sh ../libtool  --tag=CC   --mode=link x86_64-pc-linux-gnu-gcc  -march=sandybridge -O2 -pipe  -Wall -Wpointer-arith -Wcast-align -Wcast-qual -Wstrict-prototypes -Wshadow -Waggregate-return -Wmissing-prototypes -Wnested-externs -Wsign-compare  -Wl,-O1 -Wl,--sort-common -Wl,--as-needed -o canvas canvas.o ../caca/libcaca.la
  482. /bin/sh ../libtool  --tag=CC   --mode=link x86_64-pc-linux-gnu-gcc  -march=sandybridge -O2 -pipe  -Wall -Wpointer-arith -Wcast-align -Wcast-qual -Wstrict-prototypes -Wshadow -Waggregate-return -Wmissing-prototypes -Wnested-externs -Wsign-compare  -Wl,-O1 -Wl,--sort-common -Wl,--as-needed -o colors colors.o ../caca/libcaca.la
  483. /bin/sh ../libtool  --tag=CC   --mode=link x86_64-pc-linux-gnu-gcc  -march=sandybridge -O2 -pipe  -Wall -Wpointer-arith -Wcast-align -Wcast-qual -Wstrict-prototypes -Wshadow -Waggregate-return -Wmissing-prototypes -Wnested-externs -Wsign-compare -lm -Wl,-O1 -Wl,--sort-common -Wl,--as-needed -o demo demo.o ../caca/libcaca.la
  484. /bin/sh ../libtool  --tag=CXX   --mode=link x86_64-pc-linux-gnu-g++  -march=sandybridge -O2 -pipe -Wall -Wpointer-arith -Wcast-align -Wcast-qual -Wshadow -Wsign-compare  -Wl,-O1 -Wl,--sort-common -Wl,--as-needed -o conio-snake conio-snake.o ../caca/libcaca.la
  485. /bin/sh ../libtool  --tag=CC   --mode=link x86_64-pc-linux-gnu-gcc  -march=sandybridge -O2 -pipe  -Wall -Wpointer-arith -Wcast-align -Wcast-qual -Wstrict-prototypes -Wshadow -Waggregate-return -Wmissing-prototypes -Wnested-externs -Wsign-compare -lm -Wl,-O1 -Wl,--sort-common -Wl,--as-needed -o demo0 demo0.o ../caca/libcaca.la
  486. /bin/sh ../libtool  --tag=CC   --mode=link x86_64-pc-linux-gnu-gcc  -march=sandybridge -O2 -pipe  -Wall -Wpointer-arith -Wcast-align -Wcast-qual -Wstrict-prototypes -Wshadow -Waggregate-return -Wmissing-prototypes -Wnested-externs -Wsign-compare  -Wl,-O1 -Wl,--sort-common -Wl,--as-needed -o dithering dithering.o ../caca/libcaca.la
  487. /bin/sh ../libtool  --tag=CC   --mode=link x86_64-pc-linux-gnu-gcc  -march=sandybridge -O2 -pipe  -Wall -Wpointer-arith -Wcast-align -Wcast-qual -Wstrict-prototypes -Wshadow -Waggregate-return -Wmissing-prototypes -Wnested-externs -Wsign-compare  -Wl,-O1 -Wl,--sort-common -Wl,--as-needed -o driver driver.o ../caca/libcaca.la
  488. /bin/sh ../libtool  --tag=CC   --mode=link x86_64-pc-linux-gnu-gcc  -march=sandybridge -O2 -pipe  -Wall -Wpointer-arith -Wcast-align -Wcast-qual -Wstrict-prototypes -Wshadow -Waggregate-return -Wmissing-prototypes -Wnested-externs -Wsign-compare  -Wl,-O1 -Wl,--sort-common -Wl,--as-needed -o event event.o ../caca/libcaca.la
  489. libtool: link: x86_64-pc-linux-gnu-gcc -march=sandybridge -O2 -pipe -Wall -Wpointer-arith -Wcast-align -Wcast-qual -Wstrict-prototypes -Wshadow -Waggregate-return -Wmissing-prototypes -Wnested-externs -Wsign-compare -Wl,-O1 -Wl,--sort-common -o .libs/canvas canvas.o  -Wl,--as-needed ../caca/.libs/libcaca.so -L/usr/lib64 -lncursesw -lX11 -lGL -lGLU -lglut -lftgl -lz
  490. libtool: link: x86_64-pc-linux-gnu-gcc -march=sandybridge -O2 -pipe -Wall -Wpointer-arith -Wcast-align -Wcast-qual -Wstrict-prototypes -Wshadow -Waggregate-return -Wmissing-prototypes -Wnested-externs -Wsign-compare -Wl,-O1 -Wl,--sort-common -o .libs/blit blit.o  -Wl,--as-needed ../caca/.libs/libcaca.so -L/usr/lib64 -lncursesw -lX11 -lGL -lGLU -lglut -lftgl -lz
  491. libtool: link: x86_64-pc-linux-gnu-gcc -march=sandybridge -O2 -pipe -Wall -Wpointer-arith -Wcast-align -Wcast-qual -Wstrict-prototypes -Wshadow -Waggregate-return -Wmissing-prototypes -Wnested-externs -Wsign-compare -Wl,-O1 -Wl,--sort-common -o .libs/colors colors.o  -Wl,--as-needed ../caca/.libs/libcaca.so -L/usr/lib64 -lncursesw -lX11 -lGL -lGLU -lglut -lftgl -lz
  492. libtool: link: x86_64-pc-linux-gnu-gcc -march=sandybridge -O2 -pipe -Wall -Wpointer-arith -Wcast-align -Wcast-qual -Wstrict-prototypes -Wshadow -Waggregate-return -Wmissing-prototypes -Wnested-externs -Wsign-compare -Wl,-O1 -Wl,--sort-common -o .libs/demo demo.o  -lm -Wl,--as-needed ../caca/.libs/libcaca.so -L/usr/lib64 -lncursesw -lX11 -lGL -lGLU -lglut -lftgl -lz
  493. libtool: link: x86_64-pc-linux-gnu-gcc -march=sandybridge -O2 -pipe -Wall -Wpointer-arith -Wcast-align -Wcast-qual -Wstrict-prototypes -Wshadow -Waggregate-return -Wmissing-prototypes -Wnested-externs -Wsign-compare -Wl,-O1 -Wl,--sort-common -o .libs/demo0 demo0.o  -lm -Wl,--as-needed ../caca/.libs/libcaca.so -L/usr/lib64 -lncursesw -lX11 -lGL -lGLU -lglut -lftgl -lz
  494. libtool: link: x86_64-pc-linux-gnu-gcc -march=sandybridge -O2 -pipe -Wall -Wpointer-arith -Wcast-align -Wcast-qual -Wstrict-prototypes -Wshadow -Waggregate-return -Wmissing-prototypes -Wnested-externs -Wsign-compare -Wl,-O1 -Wl,--sort-common -o .libs/dithering dithering.o  -Wl,--as-needed ../caca/.libs/libcaca.so -L/usr/lib64 -lncursesw -lX11 -lGL -lGLU -lglut -lftgl -lz
  495. libtool: link: x86_64-pc-linux-gnu-g++ -march=sandybridge -O2 -pipe -Wall -Wpointer-arith -Wcast-align -Wcast-qual -Wshadow -Wsign-compare -Wl,-O1 -Wl,--sort-common -o .libs/conio-snake conio-snake.o  -Wl,--as-needed ../caca/.libs/libcaca.so -L/usr/lib64 -lncursesw -lX11 -lGL -lGLU -lglut -lftgl -lz
  496. libtool: link: x86_64-pc-linux-gnu-gcc -march=sandybridge -O2 -pipe -Wall -Wpointer-arith -Wcast-align -Wcast-qual -Wstrict-prototypes -Wshadow -Waggregate-return -Wmissing-prototypes -Wnested-externs -Wsign-compare -Wl,-O1 -Wl,--sort-common -o .libs/driver driver.o  -Wl,--as-needed ../caca/.libs/libcaca.so -L/usr/lib64 -lncursesw -lX11 -lGL -lGLU -lglut -lftgl -lz
  497. /bin/sh ../libtool  --tag=CC   --mode=link x86_64-pc-linux-gnu-gcc  -march=sandybridge -O2 -pipe  -Wall -Wpointer-arith -Wcast-align -Wcast-qual -Wstrict-prototypes -Wshadow -Waggregate-return -Wmissing-prototypes -Wnested-externs -Wsign-compare  -Wl,-O1 -Wl,--sort-common -Wl,--as-needed -o export export.o ../caca/libcaca.la
  498. libtool: link: x86_64-pc-linux-gnu-gcc -march=sandybridge -O2 -pipe -Wall -Wpointer-arith -Wcast-align -Wcast-qual -Wstrict-prototypes -Wshadow -Waggregate-return -Wmissing-prototypes -Wnested-externs -Wsign-compare -Wl,-O1 -Wl,--sort-common -o .libs/event event.o  -Wl,--as-needed ../caca/.libs/libcaca.so -L/usr/lib64 -lncursesw -lX11 -lGL -lGLU -lglut -lftgl -lz
  499. /bin/sh ../libtool  --tag=CC   --mode=link x86_64-pc-linux-gnu-gcc  -march=sandybridge -O2 -pipe  -Wall -Wpointer-arith -Wcast-align -Wcast-qual -Wstrict-prototypes -Wshadow -Waggregate-return -Wmissing-prototypes -Wnested-externs -Wsign-compare  -Wl,-O1 -Wl,--sort-common -Wl,--as-needed -o figfont figfont.o ../caca/libcaca.la
  500. /bin/sh ../libtool  --tag=CC   --mode=link x86_64-pc-linux-gnu-gcc  -march=sandybridge -O2 -pipe  -Wall -Wpointer-arith -Wcast-align -Wcast-qual -Wstrict-prototypes -Wshadow -Waggregate-return -Wmissing-prototypes -Wnested-externs -Wsign-compare  -Wl,-O1 -Wl,--sort-common -Wl,--as-needed -o font font.o ../caca/libcaca.la
  501. /bin/sh ../libtool  --tag=CC   --mode=link x86_64-pc-linux-gnu-gcc  -march=sandybridge -O2 -pipe  -Wall -Wpointer-arith -Wcast-align -Wcast-qual -Wstrict-prototypes -Wshadow -Waggregate-return -Wmissing-prototypes -Wnested-externs -Wsign-compare  -Wl,-O1 -Wl,--sort-common -Wl,--as-needed -o font2tga font2tga.o ../caca/libcaca.la
  502. /bin/sh ../libtool  --tag=CC   --mode=link x86_64-pc-linux-gnu-gcc  -march=sandybridge -O2 -pipe  -Wall -Wpointer-arith -Wcast-align -Wcast-qual -Wstrict-prototypes -Wshadow -Waggregate-return -Wmissing-prototypes -Wnested-externs -Wsign-compare  -Wl,-O1 -Wl,--sort-common -Wl,--as-needed -o frames frames.o ../caca/libcaca.la
  503. /bin/sh ../libtool  --tag=CC   --mode=link x86_64-pc-linux-gnu-gcc  -march=sandybridge -O2 -pipe  -Wall -Wpointer-arith -Wcast-align -Wcast-qual -Wstrict-prototypes -Wshadow -Waggregate-return -Wmissing-prototypes -Wnested-externs -Wsign-compare  -Wl,-O1 -Wl,--sort-common -Wl,--as-needed -o fullwidth fullwidth.o ../caca/libcaca.la
  504. /bin/sh ../libtool  --tag=CC   --mode=link x86_64-pc-linux-gnu-gcc  -march=sandybridge -O2 -pipe  -Wall -Wpointer-arith -Wcast-align -Wcast-qual -Wstrict-prototypes -Wshadow -Waggregate-return -Wmissing-prototypes -Wnested-externs -Wsign-compare -lm -Wl,-O1 -Wl,--sort-common -Wl,--as-needed -o gamma gamma.o ../caca/libcaca.la
  505. /bin/sh ../libtool  --tag=CC   --mode=link x86_64-pc-linux-gnu-gcc  -march=sandybridge -O2 -pipe  -Wall -Wpointer-arith -Wcast-align -Wcast-qual -Wstrict-prototypes -Wshadow -Waggregate-return -Wmissing-prototypes -Wnested-externs -Wsign-compare  -Wl,-O1 -Wl,--sort-common -Wl,--as-needed -o hsv hsv.o ../caca/libcaca.la
  506. /bin/sh ../libtool  --tag=CC   --mode=link x86_64-pc-linux-gnu-gcc  -march=sandybridge -O2 -pipe  -Wall -Wpointer-arith -Wcast-align -Wcast-qual -Wstrict-prototypes -Wshadow -Waggregate-return -Wmissing-prototypes -Wnested-externs -Wsign-compare  -Wl,-O1 -Wl,--sort-common -Wl,--as-needed -o input input.o ../caca/libcaca.la
  507. libtool: link: x86_64-pc-linux-gnu-gcc -march=sandybridge -O2 -pipe -Wall -Wpointer-arith -Wcast-align -Wcast-qual -Wstrict-prototypes -Wshadow -Waggregate-return -Wmissing-prototypes -Wnested-externs -Wsign-compare -Wl,-O1 -Wl,--sort-common -o .libs/figfont figfont.o  -Wl,--as-needed ../caca/.libs/libcaca.so -L/usr/lib64 -lncursesw -lX11 -lGL -lGLU -lglut -lftgl -lz
  508. libtool: link: x86_64-pc-linux-gnu-gcc -march=sandybridge -O2 -pipe -Wall -Wpointer-arith -Wcast-align -Wcast-qual -Wstrict-prototypes -Wshadow -Waggregate-return -Wmissing-prototypes -Wnested-externs -Wsign-compare -Wl,-O1 -Wl,--sort-common -o .libs/export export.o  -Wl,--as-needed ../caca/.libs/libcaca.so -L/usr/lib64 -lncursesw -lX11 -lGL -lGLU -lglut -lftgl -lz
  509. libtool: link: x86_64-pc-linux-gnu-gcc -march=sandybridge -O2 -pipe -Wall -Wpointer-arith -Wcast-align -Wcast-qual -Wstrict-prototypes -Wshadow -Waggregate-return -Wmissing-prototypes -Wnested-externs -Wsign-compare -Wl,-O1 -Wl,--sort-common -o .libs/font font.o  -Wl,--as-needed ../caca/.libs/libcaca.so -L/usr/lib64 -lncursesw -lX11 -lGL -lGLU -lglut -lftgl -lz
  510. libtool: link: x86_64-pc-linux-gnu-gcc -march=sandybridge -O2 -pipe -Wall -Wpointer-arith -Wcast-align -Wcast-qual -Wstrict-prototypes -Wshadow -Waggregate-return -Wmissing-prototypes -Wnested-externs -Wsign-compare -Wl,-O1 -Wl,--sort-common -o .libs/font2tga font2tga.o  -Wl,--as-needed ../caca/.libs/libcaca.so -L/usr/lib64 -lncursesw -lX11 -lGL -lGLU -lglut -lftgl -lz
  511. libtool: link: x86_64-pc-linux-gnu-gcc -march=sandybridge -O2 -pipe -Wall -Wpointer-arith -Wcast-align -Wcast-qual -Wstrict-prototypes -Wshadow -Waggregate-return -Wmissing-prototypes -Wnested-externs -Wsign-compare -Wl,-O1 -Wl,--sort-common -o .libs/fullwidth fullwidth.o  -Wl,--as-needed ../caca/.libs/libcaca.so -L/usr/lib64 -lncursesw -lX11 -lGL -lGLU -lglut -lftgl -lz
  512. libtool: link: x86_64-pc-linux-gnu-gcc -march=sandybridge -O2 -pipe -Wall -Wpointer-arith -Wcast-align -Wcast-qual -Wstrict-prototypes -Wshadow -Waggregate-return -Wmissing-prototypes -Wnested-externs -Wsign-compare -Wl,-O1 -Wl,--sort-common -o .libs/frames frames.o  -Wl,--as-needed ../caca/.libs/libcaca.so -L/usr/lib64 -lncursesw -lX11 -lGL -lGLU -lglut -lftgl -lz
  513. libtool: link: x86_64-pc-linux-gnu-gcc -march=sandybridge -O2 -pipe -Wall -Wpointer-arith -Wcast-align -Wcast-qual -Wstrict-prototypes -Wshadow -Waggregate-return -Wmissing-prototypes -Wnested-externs -Wsign-compare -Wl,-O1 -Wl,--sort-common -o .libs/gamma gamma.o  -lm -Wl,--as-needed ../caca/.libs/libcaca.so -L/usr/lib64 -lncursesw -lX11 -lGL -lGLU -lglut -lftgl -lz
  514. libtool: link: x86_64-pc-linux-gnu-gcc -march=sandybridge -O2 -pipe -Wall -Wpointer-arith -Wcast-align -Wcast-qual -Wstrict-prototypes -Wshadow -Waggregate-return -Wmissing-prototypes -Wnested-externs -Wsign-compare -Wl,-O1 -Wl,--sort-common -o .libs/hsv hsv.o  -Wl,--as-needed ../caca/.libs/libcaca.so -L/usr/lib64 -lncursesw -lX11 -lGL -lGLU -lglut -lftgl -lz
  515. /bin/sh ../libtool  --tag=CC   --mode=link x86_64-pc-linux-gnu-gcc  -march=sandybridge -O2 -pipe  -Wall -Wpointer-arith -Wcast-align -Wcast-qual -Wstrict-prototypes -Wshadow -Waggregate-return -Wmissing-prototypes -Wnested-externs -Wsign-compare  -Wl,-O1 -Wl,--sort-common -Wl,--as-needed -o spritedit spritedit.o ../caca/libcaca.la
  516. libtool: link: x86_64-pc-linux-gnu-gcc -march=sandybridge -O2 -pipe -Wall -Wpointer-arith -Wcast-align -Wcast-qual -Wstrict-prototypes -Wshadow -Waggregate-return -Wmissing-prototypes -Wnested-externs -Wsign-compare -Wl,-O1 -Wl,--sort-common -o .libs/input input.o  -Wl,--as-needed ../caca/.libs/libcaca.so -L/usr/lib64 -lncursesw -lX11 -lGL -lGLU -lglut -lftgl -lz
  517. /bin/sh ../libtool  --tag=CC   --mode=link x86_64-pc-linux-gnu-gcc  -march=sandybridge -O2 -pipe  -Wall -Wpointer-arith -Wcast-align -Wcast-qual -Wstrict-prototypes -Wshadow -Waggregate-return -Wmissing-prototypes -Wnested-externs -Wsign-compare  -Wl,-O1 -Wl,--sort-common -Wl,--as-needed -o swallow swallow.o ../caca/libcaca.la
  518. /bin/sh ../libtool  --tag=CC   --mode=link x86_64-pc-linux-gnu-gcc  -march=sandybridge -O2 -pipe  -Wall -Wpointer-arith -Wcast-align -Wcast-qual -Wstrict-prototypes -Wshadow -Waggregate-return -Wmissing-prototypes -Wnested-externs -Wsign-compare  -Wl,-O1 -Wl,--sort-common -Wl,--as-needed -o text text.o ../caca/libcaca.la
  519. /bin/sh ../libtool  --tag=CC   --mode=link x86_64-pc-linux-gnu-gcc  -march=sandybridge -O2 -pipe  -Wall -Wpointer-arith -Wcast-align -Wcast-qual -Wstrict-prototypes -Wshadow -Waggregate-return -Wmissing-prototypes -Wnested-externs -Wsign-compare  -Wl,-O1 -Wl,--sort-common -Wl,--as-needed -o transform transform.o ../caca/libcaca.la
  520. /bin/sh ../libtool  --tag=CC   --mode=link x86_64-pc-linux-gnu-gcc  -march=sandybridge -O2 -pipe  -Wall -Wpointer-arith -Wcast-align -Wcast-qual -Wstrict-prototypes -Wshadow -Waggregate-return -Wmissing-prototypes -Wnested-externs -Wsign-compare  -Wl,-O1 -Wl,--sort-common -Wl,--as-needed -o truecolor truecolor.o ../caca/libcaca.la
  521. /bin/sh ../libtool  --tag=CC   --mode=link x86_64-pc-linux-gnu-gcc  -march=sandybridge -O2 -pipe  -Wall -Wpointer-arith -Wcast-align -Wcast-qual -Wstrict-prototypes -Wshadow -Waggregate-return -Wmissing-prototypes -Wnested-externs -Wsign-compare  -Wl,-O1 -Wl,--sort-common -Wl,--as-needed -o unicode unicode.o ../caca/libcaca.la
  522. /bin/sh ../libtool  --tag=CC   --mode=link x86_64-pc-linux-gnu-gcc  -march=sandybridge -O2 -pipe  -Wall -Wpointer-arith -Wcast-align -Wcast-qual -Wstrict-prototypes -Wshadow -Waggregate-return -Wmissing-prototypes -Wnested-externs -Wsign-compare  -Wl,-O1 -Wl,--sort-common -Wl,--as-needed -o import import.o ../caca/libcaca.la
  523. /bin/sh ../libtool  --tag=CC   --mode=link x86_64-pc-linux-gnu-gcc  -march=sandybridge -O2 -pipe  -Wall -Wpointer-arith -Wcast-align -Wcast-qual -Wstrict-prototypes -Wshadow -Waggregate-return -Wmissing-prototypes -Wnested-externs -Wsign-compare  -Wl,-O1 -Wl,--sort-common -Wl,--as-needed -o mouse mouse.o ../caca/libcaca.la
  524. /bin/sh ../libtool  --tag=CC   --mode=link x86_64-pc-linux-gnu-gcc  -march=sandybridge -O2 -pipe  -Wall -Wpointer-arith -Wcast-align -Wcast-qual -Wstrict-prototypes -Wshadow -Waggregate-return -Wmissing-prototypes -Wnested-externs -Wsign-compare  -Wl,-O1 -Wl,--sort-common -Wl,--as-needed -o trifiller trifiller-trifiller.o ../src/trifiller-common-image.o ../caca/libcaca.la -lm
  525. libtool: link: x86_64-pc-linux-gnu-gcc -march=sandybridge -O2 -pipe -Wall -Wpointer-arith -Wcast-align -Wcast-qual -Wstrict-prototypes -Wshadow -Waggregate-return -Wmissing-prototypes -Wnested-externs -Wsign-compare -Wl,-O1 -Wl,--sort-common -o .libs/spritedit spritedit.o  -Wl,--as-needed ../caca/.libs/libcaca.so -L/usr/lib64 -lncursesw -lX11 -lGL -lGLU -lglut -lftgl -lz
  526. libtool: link: x86_64-pc-linux-gnu-gcc -march=sandybridge -O2 -pipe -Wall -Wpointer-arith -Wcast-align -Wcast-qual -Wstrict-prototypes -Wshadow -Waggregate-return -Wmissing-prototypes -Wnested-externs -Wsign-compare -Wl,-O1 -Wl,--sort-common -o .libs/truecolor truecolor.o  -Wl,--as-needed ../caca/.libs/libcaca.so -L/usr/lib64 -lncursesw -lX11 -lGL -lGLU -lglut -lftgl -lz
  527. libtool: link: x86_64-pc-linux-gnu-gcc -march=sandybridge -O2 -pipe -Wall -Wpointer-arith -Wcast-align -Wcast-qual -Wstrict-prototypes -Wshadow -Waggregate-return -Wmissing-prototypes -Wnested-externs -Wsign-compare -Wl,-O1 -Wl,--sort-common -o .libs/transform transform.o  -Wl,--as-needed ../caca/.libs/libcaca.so -L/usr/lib64 -lncursesw -lX11 -lGL -lGLU -lglut -lftgl -lz
  528. libtool: link: x86_64-pc-linux-gnu-gcc -march=sandybridge -O2 -pipe -Wall -Wpointer-arith -Wcast-align -Wcast-qual -Wstrict-prototypes -Wshadow -Waggregate-return -Wmissing-prototypes -Wnested-externs -Wsign-compare -Wl,-O1 -Wl,--sort-common -o .libs/text text.o  -Wl,--as-needed ../caca/.libs/libcaca.so -L/usr/lib64 -lncursesw -lX11 -lGL -lGLU -lglut -lftgl -lz
  529. libtool: link: x86_64-pc-linux-gnu-gcc -march=sandybridge -O2 -pipe -Wall -Wpointer-arith -Wcast-align -Wcast-qual -Wstrict-prototypes -Wshadow -Waggregate-return -Wmissing-prototypes -Wnested-externs -Wsign-compare -Wl,-O1 -Wl,--sort-common -o .libs/swallow swallow.o  -Wl,--as-needed ../caca/.libs/libcaca.so -L/usr/lib64 -lncursesw -lX11 -lGL -lGLU -lglut -lftgl -lz
  530. libtool: link: x86_64-pc-linux-gnu-gcc -march=sandybridge -O2 -pipe -Wall -Wpointer-arith -Wcast-align -Wcast-qual -Wstrict-prototypes -Wshadow -Waggregate-return -Wmissing-prototypes -Wnested-externs -Wsign-compare -Wl,-O1 -Wl,--sort-common -o .libs/import import.o  -Wl,--as-needed ../caca/.libs/libcaca.so -L/usr/lib64 -lncursesw -lX11 -lGL -lGLU -lglut -lftgl -lz
  531. libtool: link: x86_64-pc-linux-gnu-gcc -march=sandybridge -O2 -pipe -Wall -Wpointer-arith -Wcast-align -Wcast-qual -Wstrict-prototypes -Wshadow -Waggregate-return -Wmissing-prototypes -Wnested-externs -Wsign-compare -Wl,-O1 -Wl,--sort-common -o .libs/unicode unicode.o  -Wl,--as-needed ../caca/.libs/libcaca.so -L/usr/lib64 -lncursesw -lX11 -lGL -lGLU -lglut -lftgl -lz
  532. libtool: link: x86_64-pc-linux-gnu-gcc -march=sandybridge -O2 -pipe -Wall -Wpointer-arith -Wcast-align -Wcast-qual -Wstrict-prototypes -Wshadow -Waggregate-return -Wmissing-prototypes -Wnested-externs -Wsign-compare -Wl,-O1 -Wl,--sort-common -o .libs/mouse mouse.o  -Wl,--as-needed ../caca/.libs/libcaca.so -L/usr/lib64 -lncursesw -lX11 -lGL -lGLU -lglut -lftgl -lz
  533. /bin/sh ../libtool  --tag=CC   --mode=link x86_64-pc-linux-gnu-gcc  -march=sandybridge -O2 -pipe  -Wall -Wpointer-arith -Wcast-align -Wcast-qual -Wstrict-prototypes -Wshadow -Waggregate-return -Wmissing-prototypes -Wnested-externs -Wsign-compare  -Wl,-O1 -Wl,--sort-common -Wl,--as-needed -o conio conio.o ../caca/libcaca.la
  534. libtool: link: x86_64-pc-linux-gnu-gcc -march=sandybridge -O2 -pipe -Wall -Wpointer-arith -Wcast-align -Wcast-qual -Wstrict-prototypes -Wshadow -Waggregate-return -Wmissing-prototypes -Wnested-externs -Wsign-compare -Wl,-O1 -Wl,--sort-common -o .libs/trifiller trifiller-trifiller.o ../src/trifiller-common-image.o  -Wl,--as-needed ../caca/.libs/libcaca.so -L/usr/lib64 -lncursesw -lX11 -lGL -lGLU -lglut -lftgl -lz -lm
  535. libtool: link: x86_64-pc-linux-gnu-gcc -march=sandybridge -O2 -pipe -Wall -Wpointer-arith -Wcast-align -Wcast-qual -Wstrict-prototypes -Wshadow -Waggregate-return -Wmissing-prototypes -Wnested-externs -Wsign-compare -Wl,-O1 -Wl,--sort-common -o .libs/conio conio.o  -Wl,--as-needed ../caca/.libs/libcaca.so -L/usr/lib64 -lncursesw -lX11 -lGL -lGLU -lglut -lftgl -lz
  536. make[2]: Leaving directory '/var/tmp/portage/media-libs/libcaca-0.99_beta19/work/libcaca-0.99.beta19-abi_x86_64.amd64/examples'
  537. Making all in tools
  538. make[2]: Entering directory '/var/tmp/portage/media-libs/libcaca-0.99_beta19/work/libcaca-0.99.beta19-abi_x86_64.amd64/tools'
  539. x86_64-pc-linux-gnu-gcc -DHAVE_CONFIG_H -I. -I/var/tmp/portage/media-libs/libcaca-0.99_beta19/work/libcaca-0.99.beta19/tools -I..  -I/var/tmp/portage/media-libs/libcaca-0.99_beta19/work/libcaca-0.99.beta19 -I/var/tmp/portage/media-libs/libcaca-0.99_beta19/work/libcaca-0.99.beta19/caca -I../caca -I/var/tmp/portage/media-libs/libcaca-0.99_beta19/work/libcaca-0.99.beta19/caca   -march=sandybridge -O2 -pipe  -Wall -Wpointer-arith -Wcast-align -Wcast-qual -Wstrict-prototypes -Wshadow -Waggregate-return -Wmissing-prototypes -Wnested-externs -Wsign-compare -c -o optipal.o /var/tmp/portage/media-libs/libcaca-0.99_beta19/work/libcaca-0.99.beta19/tools/optipal.c
  540. x86_64-pc-linux-gnu-gcc -DHAVE_CONFIG_H -I. -I/var/tmp/portage/media-libs/libcaca-0.99_beta19/work/libcaca-0.99.beta19/tools -I..  -I/var/tmp/portage/media-libs/libcaca-0.99_beta19/work/libcaca-0.99.beta19 -I/var/tmp/portage/media-libs/libcaca-0.99_beta19/work/libcaca-0.99.beta19/caca -I../caca -I/var/tmp/portage/media-libs/libcaca-0.99_beta19/work/libcaca-0.99.beta19/caca   -march=sandybridge -O2 -pipe  -Wall -Wpointer-arith -Wcast-align -Wcast-qual -Wstrict-prototypes -Wshadow -Waggregate-return -Wmissing-prototypes -Wnested-externs -Wsign-compare -c -o sortchars.o /var/tmp/portage/media-libs/libcaca-0.99_beta19/work/libcaca-0.99.beta19/tools/sortchars.c
  541. x86_64-pc-linux-gnu-gcc -DHAVE_CONFIG_H -I. -I/var/tmp/portage/media-libs/libcaca-0.99_beta19/work/libcaca-0.99.beta19/tools -I..  -I/var/tmp/portage/media-libs/libcaca-0.99_beta19/work/libcaca-0.99.beta19 -I/var/tmp/portage/media-libs/libcaca-0.99_beta19/work/libcaca-0.99.beta19/caca -I../caca -I/var/tmp/portage/media-libs/libcaca-0.99_beta19/work/libcaca-0.99.beta19/caca  -I/usr/include/pango-1.0  -I/usr/include/freetype2 -I/usr/include/harfbuzz -I/usr/include/glib-2.0 -I/usr/lib64/glib-2.0/include   -march=sandybridge -O2 -pipe  -Wall -Wpointer-arith -Wcast-align -Wcast-qual -Wstrict-prototypes -Wshadow -Waggregate-return -Wmissing-prototypes -Wnested-externs -Wsign-compare -c -o makefont-makefont.o `test -f 'makefont.c' || echo '/var/tmp/portage/media-libs/libcaca-0.99_beta19/work/libcaca-0.99.beta19/tools/'`makefont.c
  542. /var/tmp/portage/media-libs/libcaca-0.99_beta19/work/libcaca-0.99.beta19/tools/makefont.c: In function ‘main’:
  543. /var/tmp/portage/media-libs/libcaca-0.99_beta19/work/libcaca-0.99.beta19/tools/makefont.c:130:5: warning: ‘pango_ft2_font_map_create_context’ is deprecated: Use 'pango_font_map_create_context' instead [-Wdeprecated-declarations]
  544.      cx = pango_ft2_font_map_create_context(PANGO_FT2_FONT_MAP(fm));
  545.      ^
  546. In file included from /var/tmp/portage/media-libs/libcaca-0.99_beta19/work/libcaca-0.99.beta19/tools/makefont.c:29:0:
  547. /usr/include/pango-1.0/pango/pangoft2.h:114:15: note: declared here
  548.  PangoContext *pango_ft2_font_map_create_context         (PangoFT2FontMap         *fontmap);
  549.                ^
  550. /bin/sh ../libtool  --tag=CC   --mode=link x86_64-pc-linux-gnu-gcc  -march=sandybridge -O2 -pipe  -Wall -Wpointer-arith -Wcast-align -Wcast-qual -Wstrict-prototypes -Wshadow -Waggregate-return -Wmissing-prototypes -Wnested-externs -Wsign-compare  -Wl,-O1 -Wl,--sort-common -Wl,--as-needed -o optipal optipal.o  
  551. /bin/sh ../libtool  --tag=CC   --mode=link x86_64-pc-linux-gnu-gcc  -march=sandybridge -O2 -pipe  -Wall -Wpointer-arith -Wcast-align -Wcast-qual -Wstrict-prototypes -Wshadow -Waggregate-return -Wmissing-prototypes -Wnested-externs -Wsign-compare  -Wl,-O1 -Wl,--sort-common -Wl,--as-needed -o sortchars sortchars.o ../caca/libcaca.la
  552. libtool: link: x86_64-pc-linux-gnu-gcc -march=sandybridge -O2 -pipe -Wall -Wpointer-arith -Wcast-align -Wcast-qual -Wstrict-prototypes -Wshadow -Waggregate-return -Wmissing-prototypes -Wnested-externs -Wsign-compare -Wl,-O1 -Wl,--sort-common -o optipal optipal.o  -Wl,--as-needed
  553. libtool: link: x86_64-pc-linux-gnu-gcc -march=sandybridge -O2 -pipe -Wall -Wpointer-arith -Wcast-align -Wcast-qual -Wstrict-prototypes -Wshadow -Waggregate-return -Wmissing-prototypes -Wnested-externs -Wsign-compare -Wl,-O1 -Wl,--sort-common -o .libs/sortchars sortchars.o  -Wl,--as-needed ../caca/.libs/libcaca.so -L/usr/lib64 -lncursesw -lX11 -lGL -lGLU -lglut -lftgl -lz
  554. /bin/sh ../libtool  --tag=CC   --mode=link x86_64-pc-linux-gnu-gcc -I/usr/include/pango-1.0  -I/usr/include/freetype2 -I/usr/include/harfbuzz -I/usr/include/glib-2.0 -I/usr/lib64/glib-2.0/include   -march=sandybridge -O2 -pipe  -Wall -Wpointer-arith -Wcast-align -Wcast-qual -Wstrict-prototypes -Wshadow -Waggregate-return -Wmissing-prototypes -Wnested-externs -Wsign-compare -lpangoft2-1.0 -lpango-1.0 -lgobject-2.0 -lglib-2.0 -lfontconfig -lfreetype   -Wl,-O1 -Wl,--sort-common -Wl,--as-needed -o makefont makefont-makefont.o ../caca/libcaca.la
  555. libtool: link: x86_64-pc-linux-gnu-gcc -I/usr/include/pango-1.0 -I/usr/include/freetype2 -I/usr/include/harfbuzz -I/usr/include/glib-2.0 -I/usr/lib64/glib-2.0/include -march=sandybridge -O2 -pipe -Wall -Wpointer-arith -Wcast-align -Wcast-qual -Wstrict-prototypes -Wshadow -Waggregate-return -Wmissing-prototypes -Wnested-externs -Wsign-compare -Wl,-O1 -Wl,--sort-common -o .libs/makefont makefont-makefont.o  -lpangoft2-1.0 -lpango-1.0 -lgobject-2.0 -lglib-2.0 -lfontconfig -lfreetype -Wl,--as-needed ../caca/.libs/libcaca.so -L/usr/lib64 -lncursesw -lX11 -lGL -lGLU -lglut -lftgl -lz
  556. make[2]: Leaving directory '/var/tmp/portage/media-libs/libcaca-0.99_beta19/work/libcaca-0.99.beta19-abi_x86_64.amd64/tools'
  557. Making all in cxx
  558. make[2]: Entering directory '/var/tmp/portage/media-libs/libcaca-0.99_beta19/work/libcaca-0.99.beta19-abi_x86_64.amd64/cxx'
  559. /bin/sh ../libtool  --tag=CXX   --mode=compile x86_64-pc-linux-gnu-g++ -DHAVE_CONFIG_H -I. -I/var/tmp/portage/media-libs/libcaca-0.99_beta19/work/libcaca-0.99.beta19/cxx -I..  -I/var/tmp/portage/media-libs/libcaca-0.99_beta19/work/libcaca-0.99.beta19 -I/var/tmp/portage/media-libs/libcaca-0.99_beta19/work/libcaca-0.99.beta19/caca -I../caca   -march=sandybridge -O2 -pipe -Wall -Wpointer-arith -Wcast-align -Wcast-qual -Wshadow -Wsign-compare -c -o caca++.lo /var/tmp/portage/media-libs/libcaca-0.99_beta19/work/libcaca-0.99.beta19/cxx/caca++.cpp
  560. x86_64-pc-linux-gnu-g++ -DHAVE_CONFIG_H -I. -I/var/tmp/portage/media-libs/libcaca-0.99_beta19/work/libcaca-0.99.beta19/cxx -I..  -I/var/tmp/portage/media-libs/libcaca-0.99_beta19/work/libcaca-0.99.beta19 -I/var/tmp/portage/media-libs/libcaca-0.99_beta19/work/libcaca-0.99.beta19/caca -I../caca   -march=sandybridge -O2 -pipe -Wall -Wpointer-arith -Wcast-align -Wcast-qual -Wshadow -Wsign-compare -c -o cxxtest.o /var/tmp/portage/media-libs/libcaca-0.99_beta19/work/libcaca-0.99.beta19/cxx/cxxtest.cpp
  561. libtool: compile:  x86_64-pc-linux-gnu-g++ -DHAVE_CONFIG_H -I. -I/var/tmp/portage/media-libs/libcaca-0.99_beta19/work/libcaca-0.99.beta19/cxx -I.. -I/var/tmp/portage/media-libs/libcaca-0.99_beta19/work/libcaca-0.99.beta19 -I/var/tmp/portage/media-libs/libcaca-0.99_beta19/work/libcaca-0.99.beta19/caca -I../caca -march=sandybridge -O2 -pipe -Wall -Wpointer-arith -Wcast-align -Wcast-qual -Wshadow -Wsign-compare -c /var/tmp/portage/media-libs/libcaca-0.99_beta19/work/libcaca-0.99.beta19/cxx/caca++.cpp  -fPIC -DPIC -o .libs/caca++.o
  562. /bin/sh ../libtool  --tag=CXX   --mode=link x86_64-pc-linux-gnu-g++  -march=sandybridge -O2 -pipe -Wall -Wpointer-arith -Wcast-align -Wcast-qual -Wshadow -Wsign-compare -no-undefined -version-number 0:99:19 -Wl,-O1 -Wl,--sort-common -Wl,--as-needed -o libcaca++.la -rpath /usr/lib64 caca++.lo ../caca/libcaca.la
  563. libtool: link: x86_64-pc-linux-gnu-g++  -fPIC -DPIC -shared -nostdlib /usr/lib/gcc/x86_64-pc-linux-gnu/5.3.0/../../../../lib64/crti.o /usr/lib/gcc/x86_64-pc-linux-gnu/5.3.0/crtbeginS.o  .libs/caca++.o   -Wl,-rpath -Wl,/var/tmp/portage/media-libs/libcaca-0.99_beta19/work/libcaca-0.99.beta19-abi_x86_64.amd64/caca/.libs -Wl,--as-needed ../caca/.libs/libcaca.so -L/usr/lib64 -lncursesw -lX11 -lGL -lGLU -lglut -lftgl -lz -L/usr/lib/gcc/x86_64-pc-linux-gnu/5.3.0 -L/usr/lib/gcc/x86_64-pc-linux-gnu/5.3.0/../../../../lib64 -L/lib/../lib64 -L/usr/lib/../lib64 -L/usr/lib/gcc/x86_64-pc-linux-gnu/5.3.0/../../../../x86_64-pc-linux-gnu/lib -L/usr/lib/gcc/x86_64-pc-linux-gnu/5.3.0/../../.. -lstdc++ -lm -lc -lgcc_s /usr/lib/gcc/x86_64-pc-linux-gnu/5.3.0/crtendS.o /usr/lib/gcc/x86_64-pc-linux-gnu/5.3.0/../../../../lib64/crtn.o  -march=sandybridge -O2 -Wl,-O1 -Wl,--sort-common   -Wl,-soname -Wl,libcaca++.so.0 -o .libs/libcaca++.so.0.99.19
  564. libtool: link: (cd ".libs" && rm -f "libcaca++.so.0" && ln -s "libcaca++.so.0.99.19" "libcaca++.so.0")
  565. libtool: link: (cd ".libs" && rm -f "libcaca++.so" && ln -s "libcaca++.so.0.99.19" "libcaca++.so")
  566. libtool: link: ( cd ".libs" && rm -f "libcaca++.la" && ln -s "../libcaca++.la" "libcaca++.la" )
  567. /bin/sh ../libtool  --tag=CXX   --mode=link x86_64-pc-linux-gnu-g++  -march=sandybridge -O2 -pipe -Wall -Wpointer-arith -Wcast-align -Wcast-qual -Wshadow -Wsign-compare  -Wl,-O1 -Wl,--sort-common -Wl,--as-needed -o cxxtest cxxtest.o libcaca++.la ../caca/libcaca.la
  568. libtool: link: x86_64-pc-linux-gnu-g++ -march=sandybridge -O2 -pipe -Wall -Wpointer-arith -Wcast-align -Wcast-qual -Wshadow -Wsign-compare -Wl,-O1 -Wl,--sort-common -o .libs/cxxtest cxxtest.o  -Wl,--as-needed ./.libs/libcaca++.so -L/usr/lib64 /var/tmp/portage/media-libs/libcaca-0.99_beta19/work/libcaca-0.99.beta19-abi_x86_64.amd64/caca/.libs/libcaca.so ../caca/.libs/libcaca.so -lncursesw -lX11 -lGL -lGLU -lglut -lftgl -lz
  569. make[2]: Leaving directory '/var/tmp/portage/media-libs/libcaca-0.99_beta19/work/libcaca-0.99.beta19-abi_x86_64.amd64/cxx'
  570. Making all in caca-sharp
  571. make[2]: Entering directory '/var/tmp/portage/media-libs/libcaca-0.99_beta19/work/libcaca-0.99.beta19-abi_x86_64.amd64/caca-sharp'
  572. make[2]: Nothing to be done for 'all'.
  573. make[2]: Leaving directory '/var/tmp/portage/media-libs/libcaca-0.99_beta19/work/libcaca-0.99.beta19-abi_x86_64.amd64/caca-sharp'
  574. Making all in python
  575. make[2]: Entering directory '/var/tmp/portage/media-libs/libcaca-0.99_beta19/work/libcaca-0.99.beta19-abi_x86_64.amd64/python'
  576. make[2]: Nothing to be done for 'all'.
  577. make[2]: Leaving directory '/var/tmp/portage/media-libs/libcaca-0.99_beta19/work/libcaca-0.99.beta19-abi_x86_64.amd64/python'
  578. Making all in ruby
  579. make[2]: Entering directory '/var/tmp/portage/media-libs/libcaca-0.99_beta19/work/libcaca-0.99.beta19-abi_x86_64.amd64/ruby'
  580. make[2]: Nothing to be done for 'all'.
  581. make[2]: Leaving directory '/var/tmp/portage/media-libs/libcaca-0.99_beta19/work/libcaca-0.99.beta19-abi_x86_64.amd64/ruby'
  582. Making all in java
  583. make[2]: Entering directory '/var/tmp/portage/media-libs/libcaca-0.99_beta19/work/libcaca-0.99.beta19-abi_x86_64.amd64/java'
  584. make  all-am
  585. make[3]: Entering directory '/var/tmp/portage/media-libs/libcaca-0.99_beta19/work/libcaca-0.99.beta19-abi_x86_64.amd64/java'
  586. make[3]: Nothing to be done for 'all-am'.
  587. make[3]: Leaving directory '/var/tmp/portage/media-libs/libcaca-0.99_beta19/work/libcaca-0.99.beta19-abi_x86_64.amd64/java'
  588. make[2]: Leaving directory '/var/tmp/portage/media-libs/libcaca-0.99_beta19/work/libcaca-0.99.beta19-abi_x86_64.amd64/java'
  589. Making all in doc
  590. make[2]: Entering directory '/var/tmp/portage/media-libs/libcaca-0.99_beta19/work/libcaca-0.99.beta19-abi_x86_64.amd64/doc'
  591. make[2]: Nothing to be done for 'all'.
  592. make[2]: Leaving directory '/var/tmp/portage/media-libs/libcaca-0.99_beta19/work/libcaca-0.99.beta19-abi_x86_64.amd64/doc'
  593. Making all in test
  594. make[2]: Entering directory '/var/tmp/portage/media-libs/libcaca-0.99_beta19/work/libcaca-0.99.beta19-abi_x86_64.amd64/test'
  595. x86_64-pc-linux-gnu-gcc -DHAVE_CONFIG_H -I. -I/var/tmp/portage/media-libs/libcaca-0.99_beta19/work/libcaca-0.99.beta19/test -I..  -I/var/tmp/portage/media-libs/libcaca-0.99_beta19/work/libcaca-0.99.beta19 -I/var/tmp/portage/media-libs/libcaca-0.99_beta19/work/libcaca-0.99.beta19/caca -I../caca   -march=sandybridge -O2 -pipe  -Wall -Wpointer-arith -Wcast-align -Wcast-qual -Wstrict-prototypes -Wshadow -Waggregate-return -Wmissing-prototypes -Wnested-externs -Wsign-compare -c -o simple.o /var/tmp/portage/media-libs/libcaca-0.99_beta19/work/libcaca-0.99.beta19/test/simple.c
  596. x86_64-pc-linux-gnu-gcc -DHAVE_CONFIG_H -I. -I/var/tmp/portage/media-libs/libcaca-0.99_beta19/work/libcaca-0.99.beta19/test -I..  -I/var/tmp/portage/media-libs/libcaca-0.99_beta19/work/libcaca-0.99.beta19 -I/var/tmp/portage/media-libs/libcaca-0.99_beta19/work/libcaca-0.99.beta19/caca -I../caca   -march=sandybridge -O2 -pipe  -Wall -Wpointer-arith -Wcast-align -Wcast-qual -Wstrict-prototypes -Wshadow -Waggregate-return -Wmissing-prototypes -Wnested-externs -Wsign-compare -c -o bench.o /var/tmp/portage/media-libs/libcaca-0.99_beta19/work/libcaca-0.99.beta19/test/bench.c
  597. x86_64-pc-linux-gnu-g++ -DHAVE_CONFIG_H -I. -I/var/tmp/portage/media-libs/libcaca-0.99_beta19/work/libcaca-0.99.beta19/test -I..  -I/var/tmp/portage/media-libs/libcaca-0.99_beta19/work/libcaca-0.99.beta19 -I/var/tmp/portage/media-libs/libcaca-0.99_beta19/work/libcaca-0.99.beta19/caca -I../caca   -march=sandybridge -O2 -pipe -Wall -Wpointer-arith -Wcast-align -Wcast-qual -Wshadow -Wsign-compare -c -o caca_test-caca-test.o `test -f 'caca-test.cpp' || echo '/var/tmp/portage/media-libs/libcaca-0.99_beta19/work/libcaca-0.99.beta19/test/'`caca-test.cpp
  598. x86_64-pc-linux-gnu-g++ -DHAVE_CONFIG_H -I. -I/var/tmp/portage/media-libs/libcaca-0.99_beta19/work/libcaca-0.99.beta19/test -I..  -I/var/tmp/portage/media-libs/libcaca-0.99_beta19/work/libcaca-0.99.beta19 -I/var/tmp/portage/media-libs/libcaca-0.99_beta19/work/libcaca-0.99.beta19/caca -I../caca   -march=sandybridge -O2 -pipe -Wall -Wpointer-arith -Wcast-align -Wcast-qual -Wshadow -Wsign-compare -c -o caca_test-canvas.o `test -f 'canvas.cpp' || echo '/var/tmp/portage/media-libs/libcaca-0.99_beta19/work/libcaca-0.99.beta19/test/'`canvas.cpp
  599. x86_64-pc-linux-gnu-g++ -DHAVE_CONFIG_H -I. -I/var/tmp/portage/media-libs/libcaca-0.99_beta19/work/libcaca-0.99.beta19/test -I..  -I/var/tmp/portage/media-libs/libcaca-0.99_beta19/work/libcaca-0.99.beta19 -I/var/tmp/portage/media-libs/libcaca-0.99_beta19/work/libcaca-0.99.beta19/caca -I../caca   -march=sandybridge -O2 -pipe -Wall -Wpointer-arith -Wcast-align -Wcast-qual -Wshadow -Wsign-compare -c -o caca_test-dirty.o `test -f 'dirty.cpp' || echo '/var/tmp/portage/media-libs/libcaca-0.99_beta19/work/libcaca-0.99.beta19/test/'`dirty.cpp
  600. x86_64-pc-linux-gnu-g++ -DHAVE_CONFIG_H -I. -I/var/tmp/portage/media-libs/libcaca-0.99_beta19/work/libcaca-0.99.beta19/test -I..  -I/var/tmp/portage/media-libs/libcaca-0.99_beta19/work/libcaca-0.99.beta19 -I/var/tmp/portage/media-libs/libcaca-0.99_beta19/work/libcaca-0.99.beta19/caca -I../caca   -march=sandybridge -O2 -pipe -Wall -Wpointer-arith -Wcast-align -Wcast-qual -Wshadow -Wsign-compare -c -o caca_test-driver.o `test -f 'driver.cpp' || echo '/var/tmp/portage/media-libs/libcaca-0.99_beta19/work/libcaca-0.99.beta19/test/'`driver.cpp
  601. x86_64-pc-linux-gnu-g++ -DHAVE_CONFIG_H -I. -I/var/tmp/portage/media-libs/libcaca-0.99_beta19/work/libcaca-0.99.beta19/test -I..  -I/var/tmp/portage/media-libs/libcaca-0.99_beta19/work/libcaca-0.99.beta19 -I/var/tmp/portage/media-libs/libcaca-0.99_beta19/work/libcaca-0.99.beta19/caca -I../caca   -march=sandybridge -O2 -pipe -Wall -Wpointer-arith -Wcast-align -Wcast-qual -Wshadow -Wsign-compare -c -o caca_test-export.o `test -f 'export.cpp' || echo '/var/tmp/portage/media-libs/libcaca-0.99_beta19/work/libcaca-0.99.beta19/test/'`export.cpp
  602. In file included from /usr/lib/gcc/x86_64-pc-linux-gnu/5.3.0/include/g++-v5.3.0/type_traits:35:0,
  603.                  from /usr/include/cppunit/tools/StringHelper.h:7,
  604.                  from /usr/include/cppunit/TestAssert.h:8,
  605.                  from /usr/include/cppunit/TestCase.h:6,
  606.                  from /usr/include/cppunit/TestCaller.h:5,
  607.                  from /usr/include/cppunit/extensions/HelperMacros.h:9,
  608.                  from /var/tmp/portage/media-libs/libcaca-0.99_beta19/work/libcaca-0.99.beta19/test/canvas.cpp:15:
  609. /usr/lib/gcc/x86_64-pc-linux-gnu/5.3.0/include/g++-v5.3.0/bits/c++0x_warning.h:32:2: error: #error This file requires compiler and library support for the ISO C++ 2011 standard. This support is currently experimental, and must be enabled with the -std=c++11 or -std=gnu++11 compiler options.
  610.  #error This file requires compiler and library support for the \
  611.   ^
  612. /bin/sh ../libtool  --tag=CC   --mode=link x86_64-pc-linux-gnu-gcc  -march=sandybridge -O2 -pipe  -Wall -Wpointer-arith -Wcast-align -Wcast-qual -Wstrict-prototypes -Wshadow -Waggregate-return -Wmissing-prototypes -Wnested-externs -Wsign-compare  -Wl,-O1 -Wl,--sort-common -Wl,--as-needed -o bench bench.o ../caca/libcaca.la
  613. In file included from /usr/lib/gcc/x86_64-pc-linux-gnu/5.3.0/include/g++-v5.3.0/type_traits:35:0,
  614.                  from /usr/include/cppunit/tools/StringHelper.h:7,
  615.                  from /usr/include/cppunit/TestAssert.h:8,
  616.                  from /usr/include/cppunit/TestCase.h:6,
  617.                  from /usr/include/cppunit/TestCaller.h:5,
  618.                  from /usr/include/cppunit/extensions/HelperMacros.h:9,
  619.                  from /var/tmp/portage/media-libs/libcaca-0.99_beta19/work/libcaca-0.99.beta19/test/driver.cpp:15:
  620. /usr/lib/gcc/x86_64-pc-linux-gnu/5.3.0/include/g++-v5.3.0/bits/c++0x_warning.h:32:2: error: #error This file requires compiler and library support for the ISO C++ 2011 standard. This support is currently experimental, and must be enabled with the -std=c++11 or -std=gnu++11 compiler options.
  621.  #error This file requires compiler and library support for the \
  622.   ^
  623. In file included from /usr/lib/gcc/x86_64-pc-linux-gnu/5.3.0/include/g++-v5.3.0/type_traits:35:0,
  624.                  from /usr/include/cppunit/tools/StringHelper.h:7,
  625.                  from /usr/include/cppunit/TestAssert.h:8,
  626.                  from /usr/include/cppunit/TestCase.h:6,
  627.                  from /usr/include/cppunit/TestCaller.h:5,
  628.                  from /usr/include/cppunit/extensions/HelperMacros.h:9,
  629.                  from /var/tmp/portage/media-libs/libcaca-0.99_beta19/work/libcaca-0.99.beta19/test/export.cpp:15:
  630. /usr/lib/gcc/x86_64-pc-linux-gnu/5.3.0/include/g++-v5.3.0/bits/c++0x_warning.h:32:2: error: #error This file requires compiler and library support for the ISO C++ 2011 standard. This support is currently experimental, and must be enabled with the -std=c++11 or -std=gnu++11 compiler options.
  631.  #error This file requires compiler and library support for the \
  632.   ^
  633. In file included from /usr/lib/gcc/x86_64-pc-linux-gnu/5.3.0/include/g++-v5.3.0/type_traits:35:0,
  634.                  from /usr/include/cppunit/tools/StringHelper.h:7,
  635.                  from /usr/include/cppunit/TestAssert.h:8,
  636.                  from /usr/include/cppunit/TestCase.h:6,
  637.                  from /usr/include/cppunit/TestCaller.h:5,
  638.                  from /usr/include/cppunit/extensions/HelperMacros.h:9,
  639.                  from /var/tmp/portage/media-libs/libcaca-0.99_beta19/work/libcaca-0.99.beta19/test/dirty.cpp:15:
  640. /usr/lib/gcc/x86_64-pc-linux-gnu/5.3.0/include/g++-v5.3.0/bits/c++0x_warning.h:32:2: error: #error This file requires compiler and library support for the ISO C++ 2011 standard. This support is currently experimental, and must be enabled with the -std=c++11 or -std=gnu++11 compiler options.
  641.  #error This file requires compiler and library support for the \
  642.   ^
  643. /bin/sh ../libtool  --tag=CC   --mode=link x86_64-pc-linux-gnu-gcc  -march=sandybridge -O2 -pipe  -Wall -Wpointer-arith -Wcast-align -Wcast-qual -Wstrict-prototypes -Wshadow -Waggregate-return -Wmissing-prototypes -Wnested-externs -Wsign-compare  -Wl,-O1 -Wl,--sort-common -Wl,--as-needed -o simple simple.o ../caca/libcaca.la
  644. In file included from /usr/include/cppunit/TestAssert.h:8:0,
  645.                  from /usr/include/cppunit/TestCase.h:6,
  646.                  from /usr/include/cppunit/TestCaller.h:5,
  647.                  from /usr/include/cppunit/extensions/HelperMacros.h:9,
  648.                  from /var/tmp/portage/media-libs/libcaca-0.99_beta19/work/libcaca-0.99.beta19/test/canvas.cpp:15:
  649. /usr/include/cppunit/tools/StringHelper.h:22:15: error: ‘enable_if’ in namespace ‘std’ does not name a template type
  650.  typename std::enable_if<!std::is_enum<T>::value, std::string>::type toString(const T& x)
  651.                ^
  652. /usr/include/cppunit/tools/StringHelper.h:22:24: error: expected unqualified-id before ‘<’ token
  653.  typename std::enable_if<!std::is_enum<T>::value, std::string>::type toString(const T& x)
  654.                         ^
  655. /usr/include/cppunit/tools/StringHelper.h:31:15: error: ‘enable_if’ in namespace ‘std’ does not name a template type
  656.  typename std::enable_if<std::is_enum<T>::value, std::string>::type toString(const T& x)
  657.                ^
  658. /usr/include/cppunit/tools/StringHelper.h:31:24: error: expected unqualified-id before ‘<’ token
  659.  typename std::enable_if<std::is_enum<T>::value, std::string>::type toString(const T& x)
  660.                         ^
  661. In file included from /usr/include/cppunit/Exception.h:4:0,
  662.                  from /usr/include/cppunit/TestCaller.h:4,
  663.                  from /usr/include/cppunit/extensions/HelperMacros.h:9,
  664.                  from /var/tmp/portage/media-libs/libcaca-0.99_beta19/work/libcaca-0.99.beta19/test/canvas.cpp:15:
  665. /usr/include/cppunit/TestAssert.h: In static member function ‘static std::__cxx11::string CppUnit::assertion_traits<T>::toString(const T&)’:
  666. /usr/include/cppunit/TestAssert.h:74:16: error: ‘toString’ is not a member of ‘CppUnit::StringHelper’
  667.          return CPPUNIT_NS::StringHelper::toString(x);
  668.                 ^
  669. In file included from /usr/include/cppunit/extensions/HelperMacros.h:9:0,
  670.                  from /var/tmp/portage/media-libs/libcaca-0.99_beta19/work/libcaca-0.99.beta19/test/canvas.cpp:15:
  671. /usr/include/cppunit/TestCaller.h: At global scope:
  672. /usr/include/cppunit/TestCaller.h:159:37: error: ‘std::function’ has not been declared
  673.    TestCaller(std::string name, std::function<void()> test_function, Fixture* fixture):
  674.                                      ^
  675. /usr/include/cppunit/TestCaller.h:159:45: error: expected ‘,’ or ‘...’ before ‘<’ token
  676.    TestCaller(std::string name, std::function<void()> test_function, Fixture* fixture):
  677.                                              ^
  678. /usr/include/cppunit/TestCaller.h:200:8: error: ‘function’ in namespace ‘std’ does not name a template type
  679.    std::function<void()> m_test_function;
  680.         ^
  681. /usr/include/cppunit/TestCaller.h: In constructor ‘CppUnit::TestCaller<Fixture>::TestCaller(std::__cxx11::string, CppUnit::TestCaller<Fixture>::TestMethod)’:
  682. /usr/include/cppunit/TestCaller.h:121:6: error: class ‘CppUnit::TestCaller<Fixture>’ does not have any field named ‘m_test_function’
  683.       m_test_function( std::bind(test, m_fixture) )
  684.       ^
  685. /usr/include/cppunit/TestCaller.h:121:23: error: ‘bind’ is not a member of ‘std’
  686.       m_test_function( std::bind(test, m_fixture) )
  687.                        ^
  688. /usr/include/cppunit/TestCaller.h: In constructor ‘CppUnit::TestCaller<Fixture>::TestCaller(std::__cxx11::string, CppUnit::TestCaller<Fixture>::TestMethod, Fixture&)’:
  689. /usr/include/cppunit/TestCaller.h:138:6: error: class ‘CppUnit::TestCaller<Fixture>’ does not have any field named ‘m_test_function’
  690.       m_test_function( std::bind(test, &fixture) )
  691.       ^
  692. /usr/include/cppunit/TestCaller.h:138:23: error: ‘bind’ is not a member of ‘std’
  693.       m_test_function( std::bind(test, &fixture) )
  694.                        ^
  695. /usr/include/cppunit/TestCaller.h: In constructor ‘CppUnit::TestCaller<Fixture>::TestCaller(std::__cxx11::string, CppUnit::TestCaller<Fixture>::TestMethod, Fixture*)’:
  696. /usr/include/cppunit/TestCaller.h:155:6: error: class ‘CppUnit::TestCaller<Fixture>’ does not have any field named ‘m_test_function’
  697.       m_test_function( std::bind(test, fixture) )
  698.       ^
  699. /usr/include/cppunit/TestCaller.h:155:23: error: ‘bind’ is not a member of ‘std’
  700.       m_test_function( std::bind(test, fixture) )
  701.                        ^
  702. /usr/include/cppunit/TestCaller.h: In constructor ‘CppUnit::TestCaller<Fixture>::TestCaller(std::__cxx11::string, int)’:
  703. /usr/include/cppunit/TestCaller.h:162:17: error: ‘fixture’ was not declared in this scope
  704.        m_fixture(fixture),
  705.                  ^
  706. /usr/include/cppunit/TestCaller.h:163:7: error: class ‘CppUnit::TestCaller<Fixture>’ does not have any field named ‘m_test_function’
  707.        m_test_function(test_function)
  708.        ^
  709. /usr/include/cppunit/TestCaller.h:163:23: error: ‘test_function’ was not declared in this scope
  710.        m_test_function(test_function)
  711.                        ^
  712. /usr/include/cppunit/TestCaller.h: In member function ‘void CppUnit::TestCaller<Fixture>::runTest()’:
  713. /usr/include/cppunit/TestCaller.h:175:23: error: there are no arguments to ‘m_test_function’ that depend on a template parameter, so a declaration of ‘m_test_function’ must be available [-fpermissive]
  714.        m_test_function();
  715.                        ^
  716. /usr/include/cppunit/TestCaller.h:175:23: note: (if you use ‘-fpermissive’, G++ will accept your code, but allowing the use of an undeclared name is deprecated)
  717. In file included from /usr/include/cppunit/TestAssert.h:8:0,
  718.                  from /usr/include/cppunit/TestCase.h:6,
  719.                  from /usr/include/cppunit/TestCaller.h:5,
  720.                  from /usr/include/cppunit/extensions/HelperMacros.h:9,
  721.                  from /var/tmp/portage/media-libs/libcaca-0.99_beta19/work/libcaca-0.99.beta19/test/export.cpp:15:
  722. /usr/include/cppunit/tools/StringHelper.h:22:15: error: ‘enable_if’ in namespace ‘std’ does not name a template type
  723.  typename std::enable_if<!std::is_enum<T>::value, std::string>::type toString(const T& x)
  724.                ^
  725. /usr/include/cppunit/tools/StringHelper.h:22:24: error: expected unqualified-id before ‘<’ token
  726.  typename std::enable_if<!std::is_enum<T>::value, std::string>::type toString(const T& x)
  727.                         ^
  728. /usr/include/cppunit/tools/StringHelper.h:31:15: error: ‘enable_if’ in namespace ‘std’ does not name a template type
  729.  typename std::enable_if<std::is_enum<T>::value, std::string>::type toString(const T& x)
  730.                ^
  731. /usr/include/cppunit/tools/StringHelper.h:31:24: error: expected unqualified-id before ‘<’ token
  732.  typename std::enable_if<std::is_enum<T>::value, std::string>::type toString(const T& x)
  733.                         ^
  734. In file included from /usr/include/cppunit/Exception.h:4:0,
  735.                  from /usr/include/cppunit/TestCaller.h:4,
  736.                  from /usr/include/cppunit/extensions/HelperMacros.h:9,
  737.                  from /var/tmp/portage/media-libs/libcaca-0.99_beta19/work/libcaca-0.99.beta19/test/export.cpp:15:
  738. /usr/include/cppunit/TestAssert.h: In static member function ‘static std::__cxx11::string CppUnit::assertion_traits<T>::toString(const T&)’:
  739. /usr/include/cppunit/TestAssert.h:74:16: error: ‘toString’ is not a member of ‘CppUnit::StringHelper’
  740.          return CPPUNIT_NS::StringHelper::toString(x);
  741.                 ^
  742. In file included from /usr/include/cppunit/extensions/HelperMacros.h:9:0,
  743.                  from /var/tmp/portage/media-libs/libcaca-0.99_beta19/work/libcaca-0.99.beta19/test/export.cpp:15:
  744. /usr/include/cppunit/TestCaller.h: At global scope:
  745. /usr/include/cppunit/TestCaller.h:159:37: error: ‘std::function’ has not been declared
  746.    TestCaller(std::string name, std::function<void()> test_function, Fixture* fixture):
  747.                                      ^
  748. /usr/include/cppunit/TestCaller.h:159:45: error: expected ‘,’ or ‘...’ before ‘<’ token
  749.    TestCaller(std::string name, std::function<void()> test_function, Fixture* fixture):
  750.                                              ^
  751. /usr/include/cppunit/TestCaller.h:200:8: error: ‘function’ in namespace ‘std’ does not name a template type
  752.    std::function<void()> m_test_function;
  753.         ^
  754. /usr/include/cppunit/TestCaller.h: In constructor ‘CppUnit::TestCaller<Fixture>::TestCaller(std::__cxx11::string, CppUnit::TestCaller<Fixture>::TestMethod)’:
  755. /usr/include/cppunit/TestCaller.h:121:6: error: class ‘CppUnit::TestCaller<Fixture>’ does not have any field named ‘m_test_function’
  756.       m_test_function( std::bind(test, m_fixture) )
  757.       ^
  758. /usr/include/cppunit/TestCaller.h:121:23: error: ‘bind’ is not a member of ‘std’
  759.       m_test_function( std::bind(test, m_fixture) )
  760.                        ^
  761. /usr/include/cppunit/TestCaller.h: In constructor ‘CppUnit::TestCaller<Fixture>::TestCaller(std::__cxx11::string, CppUnit::TestCaller<Fixture>::TestMethod, Fixture&)’:
  762. /usr/include/cppunit/TestCaller.h:138:6: error: class ‘CppUnit::TestCaller<Fixture>’ does not have any field named ‘m_test_function’
  763.       m_test_function( std::bind(test, &fixture) )
  764.       ^
  765. /usr/include/cppunit/TestCaller.h:138:23: error: ‘bind’ is not a member of ‘std’
  766.       m_test_function( std::bind(test, &fixture) )
  767.                        ^
  768. /usr/include/cppunit/TestCaller.h: In constructor ‘CppUnit::TestCaller<Fixture>::TestCaller(std::__cxx11::string, CppUnit::TestCaller<Fixture>::TestMethod, Fixture*)’:
  769. /usr/include/cppunit/TestCaller.h:155:6: error: class ‘CppUnit::TestCaller<Fixture>’ does not have any field named ‘m_test_function’
  770.       m_test_function( std::bind(test, fixture) )
  771.       ^
  772. /usr/include/cppunit/TestCaller.h:155:23: error: ‘bind’ is not a member of ‘std’
  773.       m_test_function( std::bind(test, fixture) )
  774.                        ^
  775. /usr/include/cppunit/TestCaller.h: In constructor ‘CppUnit::TestCaller<Fixture>::TestCaller(std::__cxx11::string, int)’:
  776. /usr/include/cppunit/TestCaller.h:162:17: error: ‘fixture’ was not declared in this scope
  777.        m_fixture(fixture),
  778.                  ^
  779. /usr/include/cppunit/TestCaller.h:163:7: error: class ‘CppUnit::TestCaller<Fixture>’ does not have any field named ‘m_test_function’
  780.        m_test_function(test_function)
  781.        ^
  782. /usr/include/cppunit/TestCaller.h:163:23: error: ‘test_function’ was not declared in this scope
  783.        m_test_function(test_function)
  784.                        ^
  785. /usr/include/cppunit/TestCaller.h: In member function ‘void CppUnit::TestCaller<Fixture>::runTest()’:
  786. /usr/include/cppunit/TestCaller.h:175:23: error: there are no arguments to ‘m_test_function’ that depend on a template parameter, so a declaration of ‘m_test_function’ must be available [-fpermissive]
  787.        m_test_function();
  788.                        ^
  789. /usr/include/cppunit/TestCaller.h:175:23: note: (if you use ‘-fpermissive’, G++ will accept your code, but allowing the use of an undeclared name is deprecated)
  790. In file included from /usr/include/cppunit/Exception.h:4:0,
  791.                  from /usr/include/cppunit/TestCaller.h:4,
  792.                  from /usr/include/cppunit/extensions/HelperMacros.h:9,
  793.                  from /var/tmp/portage/media-libs/libcaca-0.99_beta19/work/libcaca-0.99.beta19/test/canvas.cpp:15:
  794. /usr/include/cppunit/extensions/TestNamer.h: In member function ‘std::__cxx11::string CppUnit::TestNamer::getTestNameFor(const string&, const E&) const’:
  795. /usr/include/cppunit/extensions/TestNamer.h:70:69: error: ‘toString’ is not a member of ‘CppUnit::StringHelper’
  796.        return getTestNameFor(testMethodName) + " with parameter: " + CPPUNIT_NS::StringHelper::toString(val);
  797.                                                                      ^
  798. In file included from /usr/include/cppunit/TestAssert.h:8:0,
  799.                  from /usr/include/cppunit/TestCase.h:6,
  800.                  from /usr/include/cppunit/TestCaller.h:5,
  801.                  from /usr/include/cppunit/extensions/HelperMacros.h:9,
  802.                  from /var/tmp/portage/media-libs/libcaca-0.99_beta19/work/libcaca-0.99.beta19/test/dirty.cpp:15:
  803. /usr/include/cppunit/tools/StringHelper.h:22:15: error: ‘enable_if’ in namespace ‘std’ does not name a template type
  804.  typename std::enable_if<!std::is_enum<T>::value, std::string>::type toString(const T& x)
  805.                ^
  806. /usr/include/cppunit/tools/StringHelper.h:22:24: error: expected unqualified-id before ‘<’ token
  807.  typename std::enable_if<!std::is_enum<T>::value, std::string>::type toString(const T& x)
  808.                         ^
  809. /usr/include/cppunit/tools/StringHelper.h:31:15: error: ‘enable_if’ in namespace ‘std’ does not name a template type
  810.  typename std::enable_if<std::is_enum<T>::value, std::string>::type toString(const T& x)
  811.                ^
  812. /usr/include/cppunit/tools/StringHelper.h:31:24: error: expected unqualified-id before ‘<’ token
  813.  typename std::enable_if<std::is_enum<T>::value, std::string>::type toString(const T& x)
  814.                         ^
  815. In file included from /usr/include/cppunit/Exception.h:4:0,
  816.                  from /usr/include/cppunit/TestCaller.h:4,
  817.                  from /usr/include/cppunit/extensions/HelperMacros.h:9,
  818.                  from /var/tmp/portage/media-libs/libcaca-0.99_beta19/work/libcaca-0.99.beta19/test/dirty.cpp:15:
  819. /usr/include/cppunit/TestAssert.h: In static member function ‘static std::__cxx11::string CppUnit::assertion_traits<T>::toString(const T&)’:
  820. /usr/include/cppunit/TestAssert.h:74:16: error: ‘toString’ is not a member of ‘CppUnit::StringHelper’
  821.          return CPPUNIT_NS::StringHelper::toString(x);
  822.                 ^
  823. In file included from /usr/include/cppunit/Exception.h:4:0,
  824.                  from /usr/include/cppunit/TestCaller.h:4,
  825.                  from /usr/include/cppunit/extensions/HelperMacros.h:9,
  826.                  from /var/tmp/portage/media-libs/libcaca-0.99_beta19/work/libcaca-0.99.beta19/test/export.cpp:15:
  827. /usr/include/cppunit/extensions/TestNamer.h: In member function ‘std::__cxx11::string CppUnit::TestNamer::getTestNameFor(const string&, const E&) const’:
  828. /usr/include/cppunit/extensions/TestNamer.h:70:69: error: ‘toString’ is not a member of ‘CppUnit::StringHelper’
  829.        return getTestNameFor(testMethodName) + " with parameter: " + CPPUNIT_NS::StringHelper::toString(val);
  830.                                                                      ^
  831. In file included from /usr/include/cppunit/extensions/HelperMacros.h:9:0,
  832.                  from /var/tmp/portage/media-libs/libcaca-0.99_beta19/work/libcaca-0.99.beta19/test/dirty.cpp:15:
  833. /usr/include/cppunit/TestCaller.h: At global scope:
  834. /usr/include/cppunit/TestCaller.h:159:37: error: ‘std::function’ has not been declared
  835.    TestCaller(std::string name, std::function<void()> test_function, Fixture* fixture):
  836.                                      ^
  837. /usr/include/cppunit/TestCaller.h:159:45: error: expected ‘,’ or ‘...’ before ‘<’ token
  838.    TestCaller(std::string name, std::function<void()> test_function, Fixture* fixture):
  839.                                              ^
  840. /usr/include/cppunit/TestCaller.h:200:8: error: ‘function’ in namespace ‘std’ does not name a template type
  841.    std::function<void()> m_test_function;
  842.         ^
  843. /usr/include/cppunit/TestCaller.h: In constructor ‘CppUnit::TestCaller<Fixture>::TestCaller(std::__cxx11::string, CppUnit::TestCaller<Fixture>::TestMethod)’:
  844. /usr/include/cppunit/TestCaller.h:121:6: error: class ‘CppUnit::TestCaller<Fixture>’ does not have any field named ‘m_test_function’
  845.       m_test_function( std::bind(test, m_fixture) )
  846.       ^
  847. /usr/include/cppunit/TestCaller.h:121:23: error: ‘bind’ is not a member of ‘std’
  848.       m_test_function( std::bind(test, m_fixture) )
  849.                        ^
  850. /usr/include/cppunit/TestCaller.h: In constructor ‘CppUnit::TestCaller<Fixture>::TestCaller(std::__cxx11::string, CppUnit::TestCaller<Fixture>::TestMethod, Fixture&)’:
  851. /usr/include/cppunit/TestCaller.h:138:6: error: class ‘CppUnit::TestCaller<Fixture>’ does not have any field named ‘m_test_function’
  852.       m_test_function( std::bind(test, &fixture) )
  853.       ^
  854. /usr/include/cppunit/TestCaller.h:138:23: error: ‘bind’ is not a member of ‘std’
  855.       m_test_function( std::bind(test, &fixture) )
  856.                        ^
  857. /usr/include/cppunit/TestCaller.h: In constructor ‘CppUnit::TestCaller<Fixture>::TestCaller(std::__cxx11::string, CppUnit::TestCaller<Fixture>::TestMethod, Fixture*)’:
  858. /usr/include/cppunit/TestCaller.h:155:6: error: class ‘CppUnit::TestCaller<Fixture>’ does not have any field named ‘m_test_function’
  859.       m_test_function( std::bind(test, fixture) )
  860.       ^
  861. /usr/include/cppunit/TestCaller.h:155:23: error: ‘bind’ is not a member of ‘std’
  862.       m_test_function( std::bind(test, fixture) )
  863.                        ^
  864. /usr/include/cppunit/TestCaller.h: In constructor ‘CppUnit::TestCaller<Fixture>::TestCaller(std::__cxx11::string, int)’:
  865. /usr/include/cppunit/TestCaller.h:162:17: error: ‘fixture’ was not declared in this scope
  866.        m_fixture(fixture),
  867.                  ^
  868. /usr/include/cppunit/TestCaller.h:163:7: error: class ‘CppUnit::TestCaller<Fixture>’ does not have any field named ‘m_test_function’
  869.        m_test_function(test_function)
  870.        ^
  871. /usr/include/cppunit/TestCaller.h:163:23: error: ‘test_function’ was not declared in this scope
  872.        m_test_function(test_function)
  873.                        ^
  874. /usr/include/cppunit/TestCaller.h: In member function ‘void CppUnit::TestCaller<Fixture>::runTest()’:
  875. /usr/include/cppunit/TestCaller.h:175:23: error: there are no arguments to ‘m_test_function’ that depend on a template parameter, so a declaration of ‘m_test_function’ must be available [-fpermissive]
  876.        m_test_function();
  877.                        ^
  878. /usr/include/cppunit/TestCaller.h:175:23: note: (if you use ‘-fpermissive’, G++ will accept your code, but allowing the use of an undeclared name is deprecated)
  879. In file included from /var/tmp/portage/media-libs/libcaca-0.99_beta19/work/libcaca-0.99.beta19/test/canvas.cpp:15:0:
  880. /var/tmp/portage/media-libs/libcaca-0.99_beta19/work/libcaca-0.99.beta19/test/canvas.cpp: In static member function ‘static CppUnit::TestSuite* CanvasTest::suite()’:
  881. /var/tmp/portage/media-libs/libcaca-0.99_beta19/work/libcaca-0.99.beta19/test/canvas.cpp:29:5: error: ‘unique_ptr’ is not a member of ‘std’
  882.      CPPUNIT_TEST_SUITE_END();
  883.      ^
  884. /var/tmp/portage/media-libs/libcaca-0.99_beta19/work/libcaca-0.99.beta19/test/canvas.cpp:29:5: error: expected primary-expression before ‘>’ token
  885.      CPPUNIT_TEST_SUITE_END();
  886.      ^
  887. /var/tmp/portage/media-libs/libcaca-0.99_beta19/work/libcaca-0.99.beta19/test/canvas.cpp:29:5: error: ‘guard’ was not declared in this scope
  888.      CPPUNIT_TEST_SUITE_END();
  889.      ^
  890. libtool: link: x86_64-pc-linux-gnu-gcc -march=sandybridge -O2 -pipe -Wall -Wpointer-arith -Wcast-align -Wcast-qual -Wstrict-prototypes -Wshadow -Waggregate-return -Wmissing-prototypes -Wnested-externs -Wsign-compare -Wl,-O1 -Wl,--sort-common -o .libs/simple simple.o  -Wl,--as-needed ../caca/.libs/libcaca.so -L/usr/lib64 -lncursesw -lX11 -lGL -lGLU -lglut -lftgl -lz
  891. In file included from /usr/include/cppunit/TestAssert.h:8:0,
  892.                  from /usr/include/cppunit/TestCase.h:6,
  893.                  from /usr/include/cppunit/TestCaller.h:5,
  894.                  from /usr/include/cppunit/extensions/HelperMacros.h:9,
  895.                  from /var/tmp/portage/media-libs/libcaca-0.99_beta19/work/libcaca-0.99.beta19/test/driver.cpp:15:
  896. /usr/include/cppunit/tools/StringHelper.h:22:15: error: ‘enable_if’ in namespace ‘std’ does not name a template type
  897.  typename std::enable_if<!std::is_enum<T>::value, std::string>::type toString(const T& x)
  898.                ^
  899. /usr/include/cppunit/tools/StringHelper.h:22:24: error: expected unqualified-id before ‘<’ token
  900.  typename std::enable_if<!std::is_enum<T>::value, std::string>::type toString(const T& x)
  901.                         ^
  902. /usr/include/cppunit/tools/StringHelper.h:31:15: error: ‘enable_if’ in namespace ‘std’ does not name a template type
  903.  typename std::enable_if<std::is_enum<T>::value, std::string>::type toString(const T& x)
  904.                ^
  905. /usr/include/cppunit/tools/StringHelper.h:31:24: error: expected unqualified-id before ‘<’ token
  906.  typename std::enable_if<std::is_enum<T>::value, std::string>::type toString(const T& x)
  907.                         ^
  908. In file included from /usr/include/cppunit/Exception.h:4:0,
  909.                  from /usr/include/cppunit/TestCaller.h:4,
  910.                  from /usr/include/cppunit/extensions/HelperMacros.h:9,
  911.                  from /var/tmp/portage/media-libs/libcaca-0.99_beta19/work/libcaca-0.99.beta19/test/driver.cpp:15:
  912. /usr/include/cppunit/TestAssert.h: In static member function ‘static std::__cxx11::string CppUnit::assertion_traits<T>::toString(const T&)’:
  913. /usr/include/cppunit/TestAssert.h:74:16: error: ‘toString’ is not a member of ‘CppUnit::StringHelper’
  914.          return CPPUNIT_NS::StringHelper::toString(x);
  915.                 ^
  916. In file included from /usr/include/cppunit/extensions/HelperMacros.h:9:0,
  917.                  from /var/tmp/portage/media-libs/libcaca-0.99_beta19/work/libcaca-0.99.beta19/test/driver.cpp:15:
  918. /usr/include/cppunit/TestCaller.h: At global scope:
  919. /usr/include/cppunit/TestCaller.h:159:37: error: ‘std::function’ has not been declared
  920.    TestCaller(std::string name, std::function<void()> test_function, Fixture* fixture):
  921.                                      ^
  922. /usr/include/cppunit/TestCaller.h:159:45: error: expected ‘,’ or ‘...’ before ‘<’ token
  923.    TestCaller(std::string name, std::function<void()> test_function, Fixture* fixture):
  924.                                              ^
  925. /usr/include/cppunit/TestCaller.h:200:8: error: ‘function’ in namespace ‘std’ does not name a template type
  926.    std::function<void()> m_test_function;
  927.         ^
  928. /usr/include/cppunit/TestCaller.h: In constructor ‘CppUnit::TestCaller<Fixture>::TestCaller(std::__cxx11::string, CppUnit::TestCaller<Fixture>::TestMethod)’:
  929. /usr/include/cppunit/TestCaller.h:121:6: error: class ‘CppUnit::TestCaller<Fixture>’ does not have any field named ‘m_test_function’
  930.       m_test_function( std::bind(test, m_fixture) )
  931.       ^
  932. /usr/include/cppunit/TestCaller.h:121:23: error: ‘bind’ is not a member of ‘std’
  933.       m_test_function( std::bind(test, m_fixture) )
  934.                        ^
  935. /usr/include/cppunit/TestCaller.h: In constructor ‘CppUnit::TestCaller<Fixture>::TestCaller(std::__cxx11::string, CppUnit::TestCaller<Fixture>::TestMethod, Fixture&)’:
  936. /usr/include/cppunit/TestCaller.h:138:6: error: class ‘CppUnit::TestCaller<Fixture>’ does not have any field named ‘m_test_function’
  937.       m_test_function( std::bind(test, &fixture) )
  938.       ^
  939. /usr/include/cppunit/TestCaller.h:138:23: error: ‘bind’ is not a member of ‘std’
  940.       m_test_function( std::bind(test, &fixture) )
  941.                        ^
  942. /usr/include/cppunit/TestCaller.h: In constructor ‘CppUnit::TestCaller<Fixture>::TestCaller(std::__cxx11::string, CppUnit::TestCaller<Fixture>::TestMethod, Fixture*)’:
  943. /usr/include/cppunit/TestCaller.h:155:6: error: class ‘CppUnit::TestCaller<Fixture>’ does not have any field named ‘m_test_function’
  944.       m_test_function( std::bind(test, fixture) )
  945.       ^
  946. /usr/include/cppunit/TestCaller.h:155:23: error: ‘bind’ is not a member of ‘std’
  947.       m_test_function( std::bind(test, fixture) )
  948.                        ^
  949. In file included from /var/tmp/portage/media-libs/libcaca-0.99_beta19/work/libcaca-0.99.beta19/test/export.cpp:15:0:
  950. /var/tmp/portage/media-libs/libcaca-0.99_beta19/work/libcaca-0.99.beta19/test/export.cpp: In static member function ‘static CppUnit::TestSuite* ExportTest::suite()’:
  951. /var/tmp/portage/media-libs/libcaca-0.99_beta19/work/libcaca-0.99.beta19/test/export.cpp:26:5: error: ‘unique_ptr’ is not a member of ‘std’
  952.      CPPUNIT_TEST_SUITE_END();
  953.      ^
  954. /var/tmp/portage/media-libs/libcaca-0.99_beta19/work/libcaca-0.99.beta19/test/export.cpp:26:5: error: expected primary-expression before ‘>’ token
  955.      CPPUNIT_TEST_SUITE_END();
  956.      ^
  957. /usr/include/cppunit/TestCaller.h: In constructor ‘CppUnit::TestCaller<Fixture>::TestCaller(std::__cxx11::string, int)’:
  958. /usr/include/cppunit/TestCaller.h:162:17: error: ‘fixture’ was not declared in this scope
  959.        m_fixture(fixture),
  960.                  ^
  961. /usr/include/cppunit/TestCaller.h:163:7: error: class ‘CppUnit::TestCaller<Fixture>’ does not have any field named ‘m_test_function’
  962.        m_test_function(test_function)
  963.        ^
  964. /usr/include/cppunit/TestCaller.h:163:23: error: ‘test_function’ was not declared in this scope
  965.        m_test_function(test_function)
  966.                        ^
  967. /usr/include/cppunit/TestCaller.h: In member function ‘void CppUnit::TestCaller<Fixture>::runTest()’:
  968. /usr/include/cppunit/TestCaller.h:175:23: error: there are no arguments to ‘m_test_function’ that depend on a template parameter, so a declaration of ‘m_test_function’ must be available [-fpermissive]
  969.        m_test_function();
  970.                        ^
  971. /usr/include/cppunit/TestCaller.h:175:23: note: (if you use ‘-fpermissive’, G++ will accept your code, but allowing the use of an undeclared name is deprecated)
  972. /var/tmp/portage/media-libs/libcaca-0.99_beta19/work/libcaca-0.99.beta19/test/export.cpp:26:5: error: ‘guard’ was not declared in this scope
  973.      CPPUNIT_TEST_SUITE_END();
  974.      ^
  975. libtool: link: x86_64-pc-linux-gnu-gcc -march=sandybridge -O2 -pipe -Wall -Wpointer-arith -Wcast-align -Wcast-qual -Wstrict-prototypes -Wshadow -Waggregate-return -Wmissing-prototypes -Wnested-externs -Wsign-compare -Wl,-O1 -Wl,--sort-common -o .libs/bench bench.o  -Wl,--as-needed ../caca/.libs/libcaca.so -L/usr/lib64 -lncursesw -lX11 -lGL -lGLU -lglut -lftgl -lz
  976. In file included from /usr/include/cppunit/extensions/HelperMacros.h:9:0,
  977.                  from /var/tmp/portage/media-libs/libcaca-0.99_beta19/work/libcaca-0.99.beta19/test/canvas.cpp:15:
  978. /usr/include/cppunit/TestCaller.h: In instantiation of ‘void CppUnit::TestCaller<Fixture>::runTest() [with Fixture = CanvasTest]’:
  979. /var/tmp/portage/media-libs/libcaca-0.99_beta19/work/libcaca-0.99.beta19/test/canvas.cpp:109:44:   required from here
  980. /usr/include/cppunit/TestCaller.h:175:22: error: ‘m_test_function’ was not declared in this scope
  981.        m_test_function();
  982.                       ^
  983. In file included from /usr/include/cppunit/extensions/HelperMacros.h:9:0,
  984.                  from /var/tmp/portage/media-libs/libcaca-0.99_beta19/work/libcaca-0.99.beta19/test/export.cpp:15:
  985. /usr/include/cppunit/TestCaller.h: In instantiation of ‘void CppUnit::TestCaller<Fixture>::runTest() [with Fixture = ExportTest]’:
  986. /var/tmp/portage/media-libs/libcaca-0.99_beta19/work/libcaca-0.99.beta19/test/export.cpp:71:44:   required from here
  987. /usr/include/cppunit/TestCaller.h:175:22: error: ‘m_test_function’ was not declared in this scope
  988.        m_test_function();
  989.                       ^
  990. Makefile:744: recipe for target 'caca_test-canvas.o' failed
  991. make[2]: *** [caca_test-canvas.o] Error 1
  992. make[2]: *** Waiting for unfinished jobs....
  993. Makefile:786: recipe for target 'caca_test-export.o' failed
  994. make[2]: *** [caca_test-export.o] Error 1
  995. In file included from /usr/include/cppunit/Exception.h:4:0,
  996.                  from /usr/include/cppunit/TestCaller.h:4,
  997.                  from /usr/include/cppunit/extensions/HelperMacros.h:9,
  998.                  from /var/tmp/portage/media-libs/libcaca-0.99_beta19/work/libcaca-0.99.beta19/test/dirty.cpp:15:
  999. /usr/include/cppunit/extensions/TestNamer.h: In member function ‘std::__cxx11::string CppUnit::TestNamer::getTestNameFor(const string&, const E&) const’:
  1000. /usr/include/cppunit/extensions/TestNamer.h:70:69: error: ‘toString’ is not a member of ‘CppUnit::StringHelper’
  1001.        return getTestNameFor(testMethodName) + " with parameter: " + CPPUNIT_NS::StringHelper::toString(val);
  1002.                                                                      ^
  1003. In file included from /usr/include/cppunit/Exception.h:4:0,
  1004.                  from /usr/include/cppunit/TestCaller.h:4,
  1005.                  from /usr/include/cppunit/extensions/HelperMacros.h:9,
  1006.                  from /var/tmp/portage/media-libs/libcaca-0.99_beta19/work/libcaca-0.99.beta19/test/driver.cpp:15:
  1007. /usr/include/cppunit/extensions/TestNamer.h: In member function ‘std::__cxx11::string CppUnit::TestNamer::getTestNameFor(const string&, const E&) const’:
  1008. /usr/include/cppunit/extensions/TestNamer.h:70:69: error: ‘toString’ is not a member of ‘CppUnit::StringHelper’
  1009.        return getTestNameFor(testMethodName) + " with parameter: " + CPPUNIT_NS::StringHelper::toString(val);
  1010.                                                                      ^
  1011. In file included from /var/tmp/portage/media-libs/libcaca-0.99_beta19/work/libcaca-0.99.beta19/test/dirty.cpp:15:0:
  1012. /var/tmp/portage/media-libs/libcaca-0.99_beta19/work/libcaca-0.99.beta19/test/dirty.cpp: In static member function ‘static CppUnit::TestSuite* DirtyTest::suite()’:
  1013. /var/tmp/portage/media-libs/libcaca-0.99_beta19/work/libcaca-0.99.beta19/test/dirty.cpp:31:5: error: ‘unique_ptr’ is not a member of ‘std’
  1014.      CPPUNIT_TEST_SUITE_END();
  1015.      ^
  1016. /var/tmp/portage/media-libs/libcaca-0.99_beta19/work/libcaca-0.99.beta19/test/dirty.cpp:31:5: error: expected primary-expression before ‘>’ token
  1017.      CPPUNIT_TEST_SUITE_END();
  1018.      ^
  1019. /var/tmp/portage/media-libs/libcaca-0.99_beta19/work/libcaca-0.99.beta19/test/dirty.cpp:31:5: error: ‘guard’ was not declared in this scope
  1020.      CPPUNIT_TEST_SUITE_END();
  1021.      ^
  1022. In file included from /var/tmp/portage/media-libs/libcaca-0.99_beta19/work/libcaca-0.99.beta19/test/driver.cpp:15:0:
  1023. /var/tmp/portage/media-libs/libcaca-0.99_beta19/work/libcaca-0.99.beta19/test/driver.cpp: In static member function ‘static CppUnit::TestSuite* DriverTest::suite()’:
  1024. /var/tmp/portage/media-libs/libcaca-0.99_beta19/work/libcaca-0.99.beta19/test/driver.cpp:26:5: error: ‘unique_ptr’ is not a member of ‘std’
  1025.      CPPUNIT_TEST_SUITE_END();
  1026.      ^
  1027. /var/tmp/portage/media-libs/libcaca-0.99_beta19/work/libcaca-0.99.beta19/test/driver.cpp:26:5: error: expected primary-expression before ‘>’ token
  1028.      CPPUNIT_TEST_SUITE_END();
  1029.      ^
  1030. /var/tmp/portage/media-libs/libcaca-0.99_beta19/work/libcaca-0.99.beta19/test/driver.cpp:26:5: error: ‘guard’ was not declared in this scope
  1031.      CPPUNIT_TEST_SUITE_END();
  1032.      ^
  1033. In file included from /usr/include/cppunit/extensions/HelperMacros.h:9:0,
  1034.                  from /var/tmp/portage/media-libs/libcaca-0.99_beta19/work/libcaca-0.99.beta19/test/dirty.cpp:15:
  1035. /usr/include/cppunit/TestCaller.h: In instantiation of ‘void CppUnit::TestCaller<Fixture>::runTest() [with Fixture = DirtyTest]’:
  1036. /var/tmp/portage/media-libs/libcaca-0.99_beta19/work/libcaca-0.99.beta19/test/dirty.cpp:289:43:   required from here
  1037. /usr/include/cppunit/TestCaller.h:175:22: error: ‘m_test_function’ was not declared in this scope
  1038.        m_test_function();
  1039.                       ^
  1040. In file included from /usr/include/cppunit/extensions/HelperMacros.h:9:0,
  1041.                  from /var/tmp/portage/media-libs/libcaca-0.99_beta19/work/libcaca-0.99.beta19/test/driver.cpp:15:
  1042. /usr/include/cppunit/TestCaller.h: In instantiation of ‘void CppUnit::TestCaller<Fixture>::runTest() [with Fixture = DriverTest]’:
  1043. /var/tmp/portage/media-libs/libcaca-0.99_beta19/work/libcaca-0.99.beta19/test/driver.cpp:45:44:   required from here
  1044. /usr/include/cppunit/TestCaller.h:175:22: error: ‘m_test_function’ was not declared in this scope
  1045.        m_test_function();
  1046.                       ^
  1047. Makefile:772: recipe for target 'caca_test-driver.o' failed
  1048. make[2]: *** [caca_test-driver.o] Error 1
  1049. Makefile:758: recipe for target 'caca_test-dirty.o' failed
  1050. make[2]: *** [caca_test-dirty.o] Error 1
  1051. make[2]: Leaving directory '/var/tmp/portage/media-libs/libcaca-0.99_beta19/work/libcaca-0.99.beta19-abi_x86_64.amd64/test'
  1052. Makefile:541: recipe for target 'all-recursive' failed
  1053. make[1]: *** [all-recursive] Error 1
  1054. make[1]: Leaving directory '/var/tmp/portage/media-libs/libcaca-0.99_beta19/work/libcaca-0.99.beta19-abi_x86_64.amd64'
  1055. Makefile:436: recipe for target 'all' failed
  1056. make: *** [all] Error 2
  1057.  * ERROR: media-libs/libcaca-0.99_beta19::gentoo failed (compile phase):
  1058.  *   emake failed
  1059.  *
  1060.  * If you need support, post the output of `emerge --info '=media-libs/libcaca-0.99_beta19::gentoo'`,
  1061.  * the complete build log and the output of `emerge -pqv '=media-libs/libcaca-0.99_beta19::gentoo'`.
  1062.  * The complete build log is located at '/var/tmp/portage/media-libs/libcaca-0.99_beta19/temp/build.log'.
  1063.  * The ebuild environment file is located at '/var/tmp/portage/media-libs/libcaca-0.99_beta19/temp/environment'.
  1064.  * Working directory: '/var/tmp/portage/media-libs/libcaca-0.99_beta19/work/libcaca-0.99.beta19-abi_x86_64.amd64'
  1065.  * S: '/var/tmp/portage/media-libs/libcaca-0.99_beta19/work/libcaca-0.99.beta19'
  1066. !!! When you file a bug report, please include the following information:
  1067. GENTOO_VM=  CLASSPATH="" JAVA_HOME="/etc/java-config-2/current-system-vm"
  1068. JAVACFLAGS="" COMPILER=""
  1069. and of course, the output of emerge --info =libcaca-0.99_beta19
RAW Paste Data
Top