Guest User

bartus

a guest
Jul 24th, 2018
169
Never
Not a member of Pastebin yet? Sign Up, it unlocks many cool features!
  1. ==> Retrieving sources...
  2. -> Found gulp-fixes.patch
  3. -> Found popcorntime.desktop
  4. -> Found 0.31.4-linux-x64.zip
  5. ==> WARNING: Skipping all source file integrity checks.
  6. ==> Extracting sources...
  7. -> Creating working copy of popcorn-desktop git repo...
  8. Cloning into 'popcorn-desktop'...
  9. done.
  10. Switched to a new branch 'makepkg'
  11. -> Extracting 0.31.4-linux-x64.zip with bsdtar
  12. ==> Starting prepare()...
  13. -> Cache changed to /build/popcorntime/src/npm_cache
  14. -> Install missing dependencies, if any ...
  15. -> Installing missing dependency natives@1.1.3
  16. npm WARN deprecated natives@1.1.3: This module relies on Node.js's internals and will break at some point. Do not use it, and update to graceful-fs@4.x.
  17. npm WARN deprecated natives@1.1.0: This module relies on Node.js's internals and will break at some point. Do not use it, and update to graceful-fs@4.x.
  18.  
  19. > typechecker@2.0.8 preinstall /build/popcorntime/src/popcorn-desktop/node_modules/extract-opts/node_modules/typechecker
  20. > node ./cyclic.js
  21.  
  22.  
  23. > typechecker@2.0.8 preinstall /build/popcorntime/src/popcorn-desktop/node_modules/extendr/node_modules/typechecker
  24. > node ./cyclic.js
  25.  
  26.  
  27. > bufferutil@3.0.2 install /build/popcorntime/src/popcorn-desktop/node_modules/bufferutil
  28. > prebuild-install || node-gyp rebuild
  29.  
  30. prebuild-install info begin Prebuild-install version 2.2.2
  31. prebuild-install info looking for local prebuild @ prebuilds/bufferutil-v3.0.2-node-v64-linux-x64.tar.gz
  32. prebuild-install info looking for cached prebuild @ /build/popcorntime/src/npm_cache/_prebuilds/https-github.com-websockets-bufferutil-releases-download-v3.0.2-bufferutil-v3.0.2-node-v64-linux-x64.tar.gz
  33. prebuild-install http request GET https://github.com/websockets/bufferutil/releases/download/v3.0.2/bufferutil-v3.0.2-node-v64-linux-x64.tar.gz
  34. prebuild-install http 404 https://github.com/websockets/bufferutil/releases/download/v3.0.2/bufferutil-v3.0.2-node-v64-linux-x64.tar.gz
  35. prebuild-install WARN install No prebuilt binaries found (target=10.7.0 runtime=node arch=x64 platform=linux)
  36. make: Entering directory '/build/popcorntime/src/popcorn-desktop/node_modules/bufferutil/build'
  37. CXX(target) Release/obj.target/bufferutil/src/bufferutil.o
  38. In file included from ../../nan/nan.h:192,
  39. from ../src/bufferutil.cc:7:
  40. ../../nan/nan_maybe_43_inl.h: In function ‘Nan::Maybe<bool> Nan::ForceSet(v8::Local<v8::Object>, v8::Local<v8::Value>, v8::Local<v8::Value>, v8::PropertyAttribute)’:
  41. ../../nan/nan_maybe_43_inl.h:112:15: error: ‘class v8::Object’ has no member named ‘ForceSet’
  42. return obj->ForceSet(isolate->GetCurrentContext(), key, value, attribs);
  43. ^~~~~~~~
  44. In file included from ../src/bufferutil.cc:7:
  45. ../../nan/nan.h: In function ‘v8::Local<v8::Value> Nan::MakeCallback(v8::Local<v8::Object>, v8::Local<v8::Function>, int, v8::Local<v8::Value>*)’:
  46. ../../nan/nan.h:835:60: warning: ‘v8::Local<v8::Value> node::MakeCallback(v8::Isolate*, v8::Local<v8::Object>, v8::Local<v8::Function>, int, v8::Local<v8::Value>*)’ is deprecated: Use MakeCallback(..., async_context) [-Wdeprecated-declarations]
  47. v8::Isolate::GetCurrent(), target, func, argc, argv);
  48. ^
  49. In file included from ../../nan/nan.h:49,
  50. from ../src/bufferutil.cc:7:
  51. /build/.node-gyp/10.7.0/include/node/node.h:172:50: note: declared here
  52. NODE_EXTERN v8::Local<v8::Value> MakeCallback(
  53. ^~~~~~~~~~~~
  54. /build/.node-gyp/10.7.0/include/node/node.h:88:42: note: in definition of macro ‘NODE_DEPRECATED’
  55. __attribute__((deprecated(message))) declarator
  56. ^~~~~~~~~~
  57. In file included from ../src/bufferutil.cc:7:
  58. ../../nan/nan.h:835:60: warning: ‘v8::Local<v8::Value> node::MakeCallback(v8::Isolate*, v8::Local<v8::Object>, v8::Local<v8::Function>, int, v8::Local<v8::Value>*)’ is deprecated: Use MakeCallback(..., async_context) [-Wdeprecated-declarations]
  59. v8::Isolate::GetCurrent(), target, func, argc, argv);
  60. ^
  61. In file included from ../../nan/nan.h:49,
  62. from ../src/bufferutil.cc:7:
  63. /build/.node-gyp/10.7.0/include/node/node.h:172:50: note: declared here
  64. NODE_EXTERN v8::Local<v8::Value> MakeCallback(
  65. ^~~~~~~~~~~~
  66. /build/.node-gyp/10.7.0/include/node/node.h:88:42: note: in definition of macro ‘NODE_DEPRECATED’
  67. __attribute__((deprecated(message))) declarator
  68. ^~~~~~~~~~
  69. In file included from ../src/bufferutil.cc:7:
  70. ../../nan/nan.h: In function ‘v8::Local<v8::Value> Nan::MakeCallback(v8::Local<v8::Object>, v8::Local<v8::String>, int, v8::Local<v8::Value>*)’:
  71. ../../nan/nan.h:850:62: warning: ‘v8::Local<v8::Value> node::MakeCallback(v8::Isolate*, v8::Local<v8::Object>, v8::Local<v8::String>, int, v8::Local<v8::Value>*)’ is deprecated: Use MakeCallback(..., async_context) [-Wdeprecated-declarations]
  72. v8::Isolate::GetCurrent(), target, symbol, argc, argv);
  73. ^
  74. In file included from ../../nan/nan.h:49,
  75. from ../src/bufferutil.cc:7:
  76. /build/.node-gyp/10.7.0/include/node/node.h:165:50: note: declared here
  77. NODE_EXTERN v8::Local<v8::Value> MakeCallback(
  78. ^~~~~~~~~~~~
  79. /build/.node-gyp/10.7.0/include/node/node.h:88:42: note: in definition of macro ‘NODE_DEPRECATED’
  80. __attribute__((deprecated(message))) declarator
  81. ^~~~~~~~~~
  82. In file included from ../src/bufferutil.cc:7:
  83. ../../nan/nan.h:850:62: warning: ‘v8::Local<v8::Value> node::MakeCallback(v8::Isolate*, v8::Local<v8::Object>, v8::Local<v8::String>, int, v8::Local<v8::Value>*)’ is deprecated: Use MakeCallback(..., async_context) [-Wdeprecated-declarations]
  84. v8::Isolate::GetCurrent(), target, symbol, argc, argv);
  85. ^
  86. In file included from ../../nan/nan.h:49,
  87. from ../src/bufferutil.cc:7:
  88. /build/.node-gyp/10.7.0/include/node/node.h:165:50: note: declared here
  89. NODE_EXTERN v8::Local<v8::Value> MakeCallback(
  90. ^~~~~~~~~~~~
  91. /build/.node-gyp/10.7.0/include/node/node.h:88:42: note: in definition of macro ‘NODE_DEPRECATED’
  92. __attribute__((deprecated(message))) declarator
  93. ^~~~~~~~~~
  94. In file included from ../src/bufferutil.cc:7:
  95. ../../nan/nan.h: In function ‘v8::Local<v8::Value> Nan::MakeCallback(v8::Local<v8::Object>, const char*, int, v8::Local<v8::Value>*)’:
  96. ../../nan/nan.h:865:62: warning: ‘v8::Local<v8::Value> node::MakeCallback(v8::Isolate*, v8::Local<v8::Object>, const char*, int, v8::Local<v8::Value>*)’ is deprecated: Use MakeCallback(..., async_context) [-Wdeprecated-declarations]
  97. v8::Isolate::GetCurrent(), target, method, argc, argv);
  98. ^
  99. In file included from ../../nan/nan.h:49,
  100. from ../src/bufferutil.cc:7:
  101. /build/.node-gyp/10.7.0/include/node/node.h:158:50: note: declared here
  102. NODE_EXTERN v8::Local<v8::Value> MakeCallback(
  103. ^~~~~~~~~~~~
  104. /build/.node-gyp/10.7.0/include/node/node.h:88:42: note: in definition of macro ‘NODE_DEPRECATED’
  105. __attribute__((deprecated(message))) declarator
  106. ^~~~~~~~~~
  107. In file included from ../src/bufferutil.cc:7:
  108. ../../nan/nan.h:865:62: warning: ‘v8::Local<v8::Value> node::MakeCallback(v8::Isolate*, v8::Local<v8::Object>, const char*, int, v8::Local<v8::Value>*)’ is deprecated: Use MakeCallback(..., async_context) [-Wdeprecated-declarations]
  109. v8::Isolate::GetCurrent(), target, method, argc, argv);
  110. ^
  111. In file included from ../../nan/nan.h:49,
  112. from ../src/bufferutil.cc:7:
  113. /build/.node-gyp/10.7.0/include/node/node.h:158:50: note: declared here
  114. NODE_EXTERN v8::Local<v8::Value> MakeCallback(
  115. ^~~~~~~~~~~~
  116. /build/.node-gyp/10.7.0/include/node/node.h:88:42: note: in definition of macro ‘NODE_DEPRECATED’
  117. __attribute__((deprecated(message))) declarator
  118. ^~~~~~~~~~
  119. In file included from ../src/bufferutil.cc:7:
  120. ../../nan/nan.h: In member function ‘v8::Local<v8::Value> Nan::Callback::Call_(v8::Isolate*, v8::Local<v8::Object>, int, v8::Local<v8::Value>*) const’:
  121. ../../nan/nan.h:1479:5: warning: ‘v8::Local<v8::Value> node::MakeCallback(v8::Isolate*, v8::Local<v8::Object>, v8::Local<v8::Function>, int, v8::Local<v8::Value>*)’ is deprecated: Use MakeCallback(..., async_context) [-Wdeprecated-declarations]
  122. ));
  123. ^
  124. In file included from ../../nan/nan.h:49,
  125. from ../src/bufferutil.cc:7:
  126. /build/.node-gyp/10.7.0/include/node/node.h:172:50: note: declared here
  127. NODE_EXTERN v8::Local<v8::Value> MakeCallback(
  128. ^~~~~~~~~~~~
  129. /build/.node-gyp/10.7.0/include/node/node.h:88:42: note: in definition of macro ‘NODE_DEPRECATED’
  130. __attribute__((deprecated(message))) declarator
  131. ^~~~~~~~~~
  132. In file included from ../src/bufferutil.cc:7:
  133. ../../nan/nan.h:1479:5: warning: ‘v8::Local<v8::Value> node::MakeCallback(v8::Isolate*, v8::Local<v8::Object>, v8::Local<v8::Function>, int, v8::Local<v8::Value>*)’ is deprecated: Use MakeCallback(..., async_context) [-Wdeprecated-declarations]
  134. ));
  135. ^
  136. In file included from ../../nan/nan.h:49,
  137. from ../src/bufferutil.cc:7:
  138. /build/.node-gyp/10.7.0/include/node/node.h:172:50: note: declared here
  139. NODE_EXTERN v8::Local<v8::Value> MakeCallback(
  140. ^~~~~~~~~~~~
  141. /build/.node-gyp/10.7.0/include/node/node.h:88:42: note: in definition of macro ‘NODE_DEPRECATED’
  142. __attribute__((deprecated(message))) declarator
  143. ^~~~~~~~~~
  144. In file included from ../src/bufferutil.cc:7:
  145. ../../nan/nan.h: In function ‘void Nan::AsyncQueueWorker(Nan::AsyncWorker*)’:
  146. ../../nan/nan.h:1732:62: warning: cast between incompatible function types from ‘void (*)(uv_work_t*)’ {aka ‘void (*)(uv_work_s*)’} to ‘uv_after_work_cb’ {aka ‘void (*)(uv_work_s*, int)’} [-Wcast-function-type]
  147. , reinterpret_cast<uv_after_work_cb>(AsyncExecuteComplete)
  148. ^
  149. In file included from ../../nan/nan.h:49,
  150. from ../src/bufferutil.cc:7:
  151. ../src/bufferutil.cc: At global scope:
  152. /build/.node-gyp/10.7.0/include/node/node.h:537:43: warning: cast between incompatible function types from ‘void (*)(Nan::ADDON_REGISTER_FUNCTION_ARGS_TYPE)’ {aka ‘void (*)(v8::Local<v8::Object>)’} to ‘node::addon_register_func’ {aka ‘void (*)(v8::Local<v8::Object>, v8::Local<v8::Value>, void*)’} [-Wcast-function-type]
  153. (node::addon_register_func) (regfunc), \
  154. ^
  155. /build/.node-gyp/10.7.0/include/node/node.h:571:3: note: in expansion of macro ‘NODE_MODULE_X’
  156. NODE_MODULE_X(modname, regfunc, NULL, 0) // NOLINT (readability/null_usage)
  157. ^~~~~~~~~~~~~
  158. ../src/bufferutil.cc:113:1: note: in expansion of macro ‘NODE_MODULE’
  159. NODE_MODULE(bufferutil, init)
  160. ^~~~~~~~~~~
  161. In file included from /build/.node-gyp/10.7.0/include/node/node.h:63,
  162. from ../../nan/nan.h:49,
  163. from ../src/bufferutil.cc:7:
  164. /build/.node-gyp/10.7.0/include/node/v8.h: In instantiation of ‘void v8::PersistentBase<T>::SetWeak(P*, typename v8::WeakCallbackInfo<P>::Callback, v8::WeakCallbackType) [with P = node::ObjectWrap; T = v8::Object; typename v8::WeakCallbackInfo<P>::Callback = void (*)(const v8::WeakCallbackInfo<node::ObjectWrap>&)]’:
  165. /build/.node-gyp/10.7.0/include/node/node_object_wrap.h:85:78: required from here
  166. /build/.node-gyp/10.7.0/include/node/v8.h:9402:16: warning: cast between incompatible function types from ‘v8::WeakCallbackInfo<node::ObjectWrap>::Callback’ {aka ‘void (*)(const v8::WeakCallbackInfo<node::ObjectWrap>&)’} to ‘Callback’ {aka ‘void (*)(const v8::WeakCallbackInfo<void>&)’} [-Wcast-function-type]
  167. reinterpret_cast<Callback>(callback), type);
  168. ^~~~~~~~~~~~~~~~~~~~~~~~~~~~~~~~~~~~
  169. /build/.node-gyp/10.7.0/include/node/v8.h: In instantiation of ‘void v8::PersistentBase<T>::SetWeak(P*, typename v8::WeakCallbackInfo<P>::Callback, v8::WeakCallbackType) [with P = Nan::ObjectWrap; T = v8::Object; typename v8::WeakCallbackInfo<P>::Callback = void (*)(const v8::WeakCallbackInfo<Nan::ObjectWrap>&)]’:
  170. ../../nan/nan_object_wrap.h:66:61: required from here
  171. /build/.node-gyp/10.7.0/include/node/v8.h:9402:16: warning: cast between incompatible function types from ‘v8::WeakCallbackInfo<Nan::ObjectWrap>::Callback’ {aka ‘void (*)(const v8::WeakCallbackInfo<Nan::ObjectWrap>&)’} to ‘Callback’ {aka ‘void (*)(const v8::WeakCallbackInfo<void>&)’} [-Wcast-function-type]
  172. make: *** [bufferutil.target.mk:101: Release/obj.target/bufferutil/src/bufferutil.o] Error 1
  173. make: Leaving directory '/build/popcorntime/src/popcorn-desktop/node_modules/bufferutil/build'
  174. gyp ERR! build error
  175. gyp ERR! stack Error: `make` failed with exit code: 2
  176. gyp ERR! stack at ChildProcess.onExit (/usr/lib/node_modules/node-gyp/lib/build.js:262:23)
  177. gyp ERR! stack at ChildProcess.emit (events.js:182:13)
  178. gyp ERR! stack at Process.ChildProcess._handle.onexit (internal/child_process.js:237:12)
  179. gyp ERR! System Linux 4.17.8-1-ARCH
  180. gyp ERR! command "/usr/bin/node" "/usr/lib/node_modules/node-gyp/bin/node-gyp.js" "rebuild"
  181. gyp ERR! cwd /build/popcorntime/src/popcorn-desktop/node_modules/bufferutil
  182. gyp ERR! node -v v10.7.0
  183. gyp ERR! node-gyp -v v3.7.0
  184. gyp ERR! not ok
  185.  
  186. > guppy-pre-commit@0.4.0 postinstall /build/popcorntime/src/popcorn-desktop/node_modules/guppy-pre-commit
  187. > guppy pre-commit
  188.  
  189. guppy: Installed git-hook: /build/popcorntime/src/popcorn-desktop/.git/hooks/pre-commit
  190. npm WARN optional SKIPPING OPTIONAL DEPENDENCY: fsevents@1.1.2 (node_modules/fsevents):
  191. npm WARN notsup SKIPPING OPTIONAL DEPENDENCY: Unsupported platform for fsevents@1.1.2: wanted {"os":"darwin","arch":"any"} (current: {"os":"linux","arch":"x64"})
  192. npm WARN optional SKIPPING OPTIONAL DEPENDENCY: bufferutil@3.0.2 (node_modules/bufferutil):
  193. npm WARN optional SKIPPING OPTIONAL DEPENDENCY: bufferutil@3.0.2 install: `prebuild-install || node-gyp rebuild`
  194. npm WARN optional SKIPPING OPTIONAL DEPENDENCY: Exit status 1
  195.  
  196. + natives@1.1.3
  197. added 1148 packages from 683 contributors and audited 7297 packages in 17.924s
  198. found 332 vulnerabilities (257 low, 47 moderate, 28 high)
  199. run `npm audit fix` to fix them, or `npm audit` for details
  200. -> Set up the $PATH to allow npm-installed executables...
  201. -> Patching wrong packages versions, if any ...
  202. -> Installing normal dependencies
  203.  
  204. > bufferutil@3.0.2 install /build/popcorntime/src/popcorn-desktop/node_modules/bufferutil
  205. > prebuild-install || node-gyp rebuild
  206.  
  207. prebuild-install info begin Prebuild-install version 2.2.2
  208. prebuild-install info looking for local prebuild @ prebuilds/bufferutil-v3.0.2-node-v64-linux-x64.tar.gz
  209. prebuild-install info looking for cached prebuild @ /build/popcorntime/src/npm_cache/_prebuilds/https-github.com-websockets-bufferutil-releases-download-v3.0.2-bufferutil-v3.0.2-node-v64-linux-x64.tar.gz
  210. prebuild-install http request GET https://github.com/websockets/bufferutil/releases/download/v3.0.2/bufferutil-v3.0.2-node-v64-linux-x64.tar.gz
  211. prebuild-install http 404 https://github.com/websockets/bufferutil/releases/download/v3.0.2/bufferutil-v3.0.2-node-v64-linux-x64.tar.gz
  212. prebuild-install WARN install No prebuilt binaries found (target=10.7.0 runtime=node arch=x64 platform=linux)
  213. make: Entering directory '/build/popcorntime/src/popcorn-desktop/node_modules/bufferutil/build'
  214. CXX(target) Release/obj.target/bufferutil/src/bufferutil.o
  215. In file included from ../../nan/nan.h:192,
  216. from ../src/bufferutil.cc:7:
  217. ../../nan/nan_maybe_43_inl.h: In function ‘Nan::Maybe<bool> Nan::ForceSet(v8::Local<v8::Object>, v8::Local<v8::Value>, v8::Local<v8::Value>, v8::PropertyAttribute)’:
  218. ../../nan/nan_maybe_43_inl.h:112:15: error: ‘class v8::Object’ has no member named ‘ForceSet’
  219. return obj->ForceSet(isolate->GetCurrentContext(), key, value, attribs);
  220. ^~~~~~~~
  221. In file included from ../src/bufferutil.cc:7:
  222. ../../nan/nan.h: In function ‘v8::Local<v8::Value> Nan::MakeCallback(v8::Local<v8::Object>, v8::Local<v8::Function>, int, v8::Local<v8::Value>*)’:
  223. ../../nan/nan.h:835:60: warning: ‘v8::Local<v8::Value> node::MakeCallback(v8::Isolate*, v8::Local<v8::Object>, v8::Local<v8::Function>, int, v8::Local<v8::Value>*)’ is deprecated: Use MakeCallback(..., async_context) [-Wdeprecated-declarations]
  224. v8::Isolate::GetCurrent(), target, func, argc, argv);
  225. ^
  226. In file included from ../../nan/nan.h:49,
  227. from ../src/bufferutil.cc:7:
  228. /build/.node-gyp/10.7.0/include/node/node.h:172:50: note: declared here
  229. NODE_EXTERN v8::Local<v8::Value> MakeCallback(
  230. ^~~~~~~~~~~~
  231. /build/.node-gyp/10.7.0/include/node/node.h:88:42: note: in definition of macro ‘NODE_DEPRECATED’
  232. __attribute__((deprecated(message))) declarator
  233. ^~~~~~~~~~
  234. In file included from ../src/bufferutil.cc:7:
  235. ../../nan/nan.h:835:60: warning: ‘v8::Local<v8::Value> node::MakeCallback(v8::Isolate*, v8::Local<v8::Object>, v8::Local<v8::Function>, int, v8::Local<v8::Value>*)’ is deprecated: Use MakeCallback(..., async_context) [-Wdeprecated-declarations]
  236. v8::Isolate::GetCurrent(), target, func, argc, argv);
  237. ^
  238. In file included from ../../nan/nan.h:49,
  239. from ../src/bufferutil.cc:7:
  240. /build/.node-gyp/10.7.0/include/node/node.h:172:50: note: declared here
  241. NODE_EXTERN v8::Local<v8::Value> MakeCallback(
  242. ^~~~~~~~~~~~
  243. /build/.node-gyp/10.7.0/include/node/node.h:88:42: note: in definition of macro ‘NODE_DEPRECATED’
  244. __attribute__((deprecated(message))) declarator
  245. ^~~~~~~~~~
  246. In file included from ../src/bufferutil.cc:7:
  247. ../../nan/nan.h: In function ‘v8::Local<v8::Value> Nan::MakeCallback(v8::Local<v8::Object>, v8::Local<v8::String>, int, v8::Local<v8::Value>*)’:
  248. ../../nan/nan.h:850:62: warning: ‘v8::Local<v8::Value> node::MakeCallback(v8::Isolate*, v8::Local<v8::Object>, v8::Local<v8::String>, int, v8::Local<v8::Value>*)’ is deprecated: Use MakeCallback(..., async_context) [-Wdeprecated-declarations]
  249. v8::Isolate::GetCurrent(), target, symbol, argc, argv);
  250. ^
  251. In file included from ../../nan/nan.h:49,
  252. from ../src/bufferutil.cc:7:
  253. /build/.node-gyp/10.7.0/include/node/node.h:165:50: note: declared here
  254. NODE_EXTERN v8::Local<v8::Value> MakeCallback(
  255. ^~~~~~~~~~~~
  256. /build/.node-gyp/10.7.0/include/node/node.h:88:42: note: in definition of macro ‘NODE_DEPRECATED’
  257. __attribute__((deprecated(message))) declarator
  258. ^~~~~~~~~~
  259. In file included from ../src/bufferutil.cc:7:
  260. ../../nan/nan.h:850:62: warning: ‘v8::Local<v8::Value> node::MakeCallback(v8::Isolate*, v8::Local<v8::Object>, v8::Local<v8::String>, int, v8::Local<v8::Value>*)’ is deprecated: Use MakeCallback(..., async_context) [-Wdeprecated-declarations]
  261. v8::Isolate::GetCurrent(), target, symbol, argc, argv);
  262. ^
  263. In file included from ../../nan/nan.h:49,
  264. from ../src/bufferutil.cc:7:
  265. /build/.node-gyp/10.7.0/include/node/node.h:165:50: note: declared here
  266. NODE_EXTERN v8::Local<v8::Value> MakeCallback(
  267. ^~~~~~~~~~~~
  268. /build/.node-gyp/10.7.0/include/node/node.h:88:42: note: in definition of macro ‘NODE_DEPRECATED’
  269. __attribute__((deprecated(message))) declarator
  270. ^~~~~~~~~~
  271. In file included from ../src/bufferutil.cc:7:
  272. ../../nan/nan.h: In function ‘v8::Local<v8::Value> Nan::MakeCallback(v8::Local<v8::Object>, const char*, int, v8::Local<v8::Value>*)’:
  273. ../../nan/nan.h:865:62: warning: ‘v8::Local<v8::Value> node::MakeCallback(v8::Isolate*, v8::Local<v8::Object>, const char*, int, v8::Local<v8::Value>*)’ is deprecated: Use MakeCallback(..., async_context) [-Wdeprecated-declarations]
  274. v8::Isolate::GetCurrent(), target, method, argc, argv);
  275. ^
  276. In file included from ../../nan/nan.h:49,
  277. from ../src/bufferutil.cc:7:
  278. /build/.node-gyp/10.7.0/include/node/node.h:158:50: note: declared here
  279. NODE_EXTERN v8::Local<v8::Value> MakeCallback(
  280. ^~~~~~~~~~~~
  281. /build/.node-gyp/10.7.0/include/node/node.h:88:42: note: in definition of macro ‘NODE_DEPRECATED’
  282. __attribute__((deprecated(message))) declarator
  283. ^~~~~~~~~~
  284. In file included from ../src/bufferutil.cc:7:
  285. ../../nan/nan.h:865:62: warning: ‘v8::Local<v8::Value> node::MakeCallback(v8::Isolate*, v8::Local<v8::Object>, const char*, int, v8::Local<v8::Value>*)’ is deprecated: Use MakeCallback(..., async_context) [-Wdeprecated-declarations]
  286. v8::Isolate::GetCurrent(), target, method, argc, argv);
  287. ^
  288. In file included from ../../nan/nan.h:49,
  289. from ../src/bufferutil.cc:7:
  290. /build/.node-gyp/10.7.0/include/node/node.h:158:50: note: declared here
  291. NODE_EXTERN v8::Local<v8::Value> MakeCallback(
  292. ^~~~~~~~~~~~
  293. /build/.node-gyp/10.7.0/include/node/node.h:88:42: note: in definition of macro ‘NODE_DEPRECATED’
  294. __attribute__((deprecated(message))) declarator
  295. ^~~~~~~~~~
  296. In file included from ../src/bufferutil.cc:7:
  297. ../../nan/nan.h: In member function ‘v8::Local<v8::Value> Nan::Callback::Call_(v8::Isolate*, v8::Local<v8::Object>, int, v8::Local<v8::Value>*) const’:
  298. ../../nan/nan.h:1479:5: warning: ‘v8::Local<v8::Value> node::MakeCallback(v8::Isolate*, v8::Local<v8::Object>, v8::Local<v8::Function>, int, v8::Local<v8::Value>*)’ is deprecated: Use MakeCallback(..., async_context) [-Wdeprecated-declarations]
  299. ));
  300. ^
  301. In file included from ../../nan/nan.h:49,
  302. from ../src/bufferutil.cc:7:
  303. /build/.node-gyp/10.7.0/include/node/node.h:172:50: note: declared here
  304. NODE_EXTERN v8::Local<v8::Value> MakeCallback(
  305. ^~~~~~~~~~~~
  306. /build/.node-gyp/10.7.0/include/node/node.h:88:42: note: in definition of macro ‘NODE_DEPRECATED’
  307. __attribute__((deprecated(message))) declarator
  308. ^~~~~~~~~~
  309. In file included from ../src/bufferutil.cc:7:
  310. ../../nan/nan.h:1479:5: warning: ‘v8::Local<v8::Value> node::MakeCallback(v8::Isolate*, v8::Local<v8::Object>, v8::Local<v8::Function>, int, v8::Local<v8::Value>*)’ is deprecated: Use MakeCallback(..., async_context) [-Wdeprecated-declarations]
  311. ));
  312. ^
  313. In file included from ../../nan/nan.h:49,
  314. from ../src/bufferutil.cc:7:
  315. /build/.node-gyp/10.7.0/include/node/node.h:172:50: note: declared here
  316. NODE_EXTERN v8::Local<v8::Value> MakeCallback(
  317. ^~~~~~~~~~~~
  318. /build/.node-gyp/10.7.0/include/node/node.h:88:42: note: in definition of macro ‘NODE_DEPRECATED’
  319. __attribute__((deprecated(message))) declarator
  320. ^~~~~~~~~~
  321. In file included from ../src/bufferutil.cc:7:
  322. ../../nan/nan.h: In function ‘void Nan::AsyncQueueWorker(Nan::AsyncWorker*)’:
  323. ../../nan/nan.h:1732:62: warning: cast between incompatible function types from ‘void (*)(uv_work_t*)’ {aka ‘void (*)(uv_work_s*)’} to ‘uv_after_work_cb’ {aka ‘void (*)(uv_work_s*, int)’} [-Wcast-function-type]
  324. , reinterpret_cast<uv_after_work_cb>(AsyncExecuteComplete)
  325. ^
  326. In file included from ../../nan/nan.h:49,
  327. from ../src/bufferutil.cc:7:
  328. ../src/bufferutil.cc: At global scope:
  329. /build/.node-gyp/10.7.0/include/node/node.h:537:43: warning: cast between incompatible function types from ‘void (*)(Nan::ADDON_REGISTER_FUNCTION_ARGS_TYPE)’ {aka ‘void (*)(v8::Local<v8::Object>)’} to ‘node::addon_register_func’ {aka ‘void (*)(v8::Local<v8::Object>, v8::Local<v8::Value>, void*)’} [-Wcast-function-type]
  330. (node::addon_register_func) (regfunc), \
  331. ^
  332. /build/.node-gyp/10.7.0/include/node/node.h:571:3: note: in expansion of macro ‘NODE_MODULE_X’
  333. NODE_MODULE_X(modname, regfunc, NULL, 0) // NOLINT (readability/null_usage)
  334. ^~~~~~~~~~~~~
  335. ../src/bufferutil.cc:113:1: note: in expansion of macro ‘NODE_MODULE’
  336. NODE_MODULE(bufferutil, init)
  337. ^~~~~~~~~~~
  338. In file included from /build/.node-gyp/10.7.0/include/node/node.h:63,
  339. from ../../nan/nan.h:49,
  340. from ../src/bufferutil.cc:7:
  341. /build/.node-gyp/10.7.0/include/node/v8.h: In instantiation of ‘void v8::PersistentBase<T>::SetWeak(P*, typename v8::WeakCallbackInfo<P>::Callback, v8::WeakCallbackType) [with P = node::ObjectWrap; T = v8::Object; typename v8::WeakCallbackInfo<P>::Callback = void (*)(const v8::WeakCallbackInfo<node::ObjectWrap>&)]’:
  342. /build/.node-gyp/10.7.0/include/node/node_object_wrap.h:85:78: required from here
  343. /build/.node-gyp/10.7.0/include/node/v8.h:9402:16: warning: cast between incompatible function types from ‘v8::WeakCallbackInfo<node::ObjectWrap>::Callback’ {aka ‘void (*)(const v8::WeakCallbackInfo<node::ObjectWrap>&)’} to ‘Callback’ {aka ‘void (*)(const v8::WeakCallbackInfo<void>&)’} [-Wcast-function-type]
  344. reinterpret_cast<Callback>(callback), type);
  345. ^~~~~~~~~~~~~~~~~~~~~~~~~~~~~~~~~~~~
  346. /build/.node-gyp/10.7.0/include/node/v8.h: In instantiation of ‘void v8::PersistentBase<T>::SetWeak(P*, typename v8::WeakCallbackInfo<P>::Callback, v8::WeakCallbackType) [with P = Nan::ObjectWrap; T = v8::Object; typename v8::WeakCallbackInfo<P>::Callback = void (*)(const v8::WeakCallbackInfo<Nan::ObjectWrap>&)]’:
  347. ../../nan/nan_object_wrap.h:66:61: required from here
  348. /build/.node-gyp/10.7.0/include/node/v8.h:9402:16: warning: cast between incompatible function types from ‘v8::WeakCallbackInfo<Nan::ObjectWrap>::Callback’ {aka ‘void (*)(const v8::WeakCallbackInfo<Nan::ObjectWrap>&)’} to ‘Callback’ {aka ‘void (*)(const v8::WeakCallbackInfo<void>&)’} [-Wcast-function-type]
  349. make: *** [bufferutil.target.mk:101: Release/obj.target/bufferutil/src/bufferutil.o] Error 1
  350. make: Leaving directory '/build/popcorntime/src/popcorn-desktop/node_modules/bufferutil/build'
  351. gyp ERR! build error
  352. gyp ERR! stack Error: `make` failed with exit code: 2
  353. gyp ERR! stack at ChildProcess.onExit (/usr/lib/node_modules/node-gyp/lib/build.js:262:23)
  354. gyp ERR! stack at ChildProcess.emit (events.js:182:13)
  355. gyp ERR! stack at Process.ChildProcess._handle.onexit (internal/child_process.js:237:12)
  356. gyp ERR! System Linux 4.17.8-1-ARCH
  357. gyp ERR! command "/usr/bin/node" "/usr/lib/node_modules/node-gyp/bin/node-gyp.js" "rebuild"
  358. gyp ERR! cwd /build/popcorntime/src/popcorn-desktop/node_modules/bufferutil
  359. gyp ERR! node -v v10.7.0
  360. gyp ERR! node-gyp -v v3.7.0
  361. gyp ERR! not ok
  362.  
  363. > Popcorn-Time@0.3.10 postinstall /build/popcorntime/src/popcorn-desktop
  364. > bower install --config.interactive=false && npm run postupdate
  365.  
  366. bower marionette#~3.x.x not-cached https://github.com/marionettejs/backbone.marionette.git#~3.x.x
  367. bower marionette#~3.x.x resolve https://github.com/marionettejs/backbone.marionette.git#~3.x.x
  368. bower bootstrap#~3.3.7 not-cached https://github.com/twbs/bootstrap.git#~3.3.7
  369. bower bootstrap#~3.3.7 resolve https://github.com/twbs/bootstrap.git#~3.3.7
  370. bower font-awesome#~4.6.3 not-cached https://github.com/FortAwesome/Font-Awesome.git#~4.6.3
  371. bower font-awesome#~4.6.3 resolve https://github.com/FortAwesome/Font-Awesome.git#~4.6.3
  372. bower videojs-youtube#1.2.10 not-cached https://github.com/eXon/videojs-youtube.git#1.2.10
  373. bower videojs-youtube#1.2.10 resolve https://github.com/eXon/videojs-youtube.git#1.2.10
  374. bower backbone#1.3.3 not-cached https://github.com/jashkenas/backbone.git#1.3.3
  375. bower backbone#1.3.3 resolve https://github.com/jashkenas/backbone.git#1.3.3
  376. bower video.js#4.11.4 not-cached https://github.com/videojs/video.js.git#4.11.4
  377. bower video.js#4.11.4 resolve https://github.com/videojs/video.js.git#4.11.4
  378. bower mousetrap#~1.6.0 not-cached https://github.com/ccampbell/mousetrap.git#~1.6.0
  379. bower mousetrap#~1.6.0 resolve https://github.com/ccampbell/mousetrap.git#~1.6.0
  380. bower font-awesome#~4.6.3 download https://github.com/FortAwesome/Font-Awesome/archive/v4.6.3.tar.gz
  381. bower marionette#~3.x.x download https://github.com/marionettejs/backbone.marionette/archive/v3.5.1.tar.gz
  382. bower video.js#4.11.4 download https://github.com/videojs/video.js/archive/v4.11.4.tar.gz
  383. bower backbone#1.3.3 download https://github.com/jashkenas/backbone/archive/1.3.3.tar.gz
  384. bower bootstrap#~3.3.7 download https://github.com/twbs/bootstrap/archive/v3.3.7.tar.gz
  385. bower videojs-youtube#1.2.10 download https://github.com/eXon/videojs-youtube/archive/v1.2.10.tar.gz
  386. bower mousetrap#~1.6.0 download https://github.com/ccampbell/mousetrap/archive/1.6.2.tar.gz
  387. bower marionette#~3.x.x extract archive.tar.gz
  388. bower mousetrap#~1.6.0 extract archive.tar.gz
  389. bower marionette#~3.x.x resolved https://github.com/marionettejs/backbone.marionette.git#3.5.1
  390. bower mousetrap#~1.6.0 resolved https://github.com/ccampbell/mousetrap.git#1.6.2
  391. bower videojs-youtube#1.2.10 extract archive.tar.gz
  392. bower backbone.radio#^2.0.0 not-cached https://github.com/marionettejs/backbone.radio.git#^2.0.0
  393. bower backbone.radio#^2.0.0 resolve https://github.com/marionettejs/backbone.radio.git#^2.0.0
  394. bower videojs-youtube#1.2.10 resolved https://github.com/eXon/videojs-youtube.git#1.2.10
  395. bower font-awesome#~4.6.3 extract archive.tar.gz
  396. bower backbone.radio#^2.0.0 download https://github.com/marionettejs/backbone.radio/archive/v2.0.0.tar.gz
  397. bower font-awesome#~4.6.3 resolved https://github.com/FortAwesome/Font-Awesome.git#4.6.3
  398. bower bootstrap#~3.3.7 extract archive.tar.gz
  399. bower backbone.radio#^2.0.0 extract archive.tar.gz
  400. bower backbone.radio#^2.0.0 resolved https://github.com/marionettejs/backbone.radio.git#2.0.0
  401. bower bootstrap#~3.3.7 resolved https://github.com/twbs/bootstrap.git#3.3.7
  402. bower video.js#4.11.4 extract archive.tar.gz
  403. bower jquery#1.9.1 - 3 not-cached https://github.com/jquery/jquery-dist.git#1.9.1 - 3
  404. bower jquery#1.9.1 - 3 resolve https://github.com/jquery/jquery-dist.git#1.9.1 - 3
  405. bower backbone#1.3.3 extract archive.tar.gz
  406. bower video.js#4.11.4 invalid-meta for:/tmp/builduser/bower/1f9dbb19ecd8ca348a4b7045422110ec-1483-6FNv73/bower.json
  407. bower video.js#4.11.4 invalid-meta The "main" field cannot contain font, image, audio, or video files
  408. bower video.js#4.11.4 invalid-meta The "main" field cannot contain font, image, audio, or video files
  409. bower video.js#4.11.4 invalid-meta The "main" field cannot contain font, image, audio, or video files
  410. bower video.js#4.11.4 invalid-meta The "main" field cannot contain font, image, audio, or video files
  411. bower backbone#1.3.3 resolved https://github.com/jashkenas/backbone.git#1.3.3
  412. bower underscore#>=1.8.3 not-cached https://github.com/jashkenas/underscore.git#>=1.8.3
  413. bower underscore#>=1.8.3 resolve https://github.com/jashkenas/underscore.git#>=1.8.3
  414. bower video.js#4.11.4 resolved https://github.com/videojs/video.js.git#4.11.4
  415. bower jquery#1.9.1 - 3 download https://github.com/jquery/jquery-dist/archive/3.3.1.tar.gz
  416. bower underscore#>=1.8.3 download https://github.com/jashkenas/underscore/archive/1.9.1.tar.gz
  417. bower jquery#1.9.1 - 3 extract archive.tar.gz
  418. bower jquery#1.9.1 - 3 resolved https://github.com/jquery/jquery-dist.git#3.3.1
  419. bower underscore#>=1.8.3 extract archive.tar.gz
  420. bower underscore#>=1.8.3 resolved https://github.com/jashkenas/underscore.git#1.9.1
  421. bower underscore extra-resolution Unnecessary resolution: underscore#>=1.8.0
  422. bower marionette#~3.x.x install marionette#3.5.1
  423. bower mousetrap#~1.6.0 install mousetrap#1.6.2
  424. bower videojs-youtube#1.2.10 install videojs-youtube#1.2.10
  425. bower font-awesome#~4.6.3 install font-awesome#4.6.3
  426. bower backbone.radio#^2.0.0 install backbone.radio#2.0.0
  427. bower bootstrap#~3.3.7 install bootstrap#3.3.7
  428. bower backbone#1.3.3 install backbone#1.3.3
  429. bower video.js#4.11.4 install video.js#4.11.4
  430. bower jquery#1.9.1 - 3 install jquery#3.3.1
  431. bower underscore#>=1.8.3 install underscore#1.9.1
  432.  
  433. marionette#3.5.1 src/app/vendor/marionette
  434. └── backbone.radio#2.0.0
  435.  
  436. mousetrap#1.6.2 src/app/vendor/mousetrap
  437.  
  438. videojs-youtube#1.2.10 src/app/vendor/videojs-youtube
  439. └── video.js#4.11.4
  440.  
  441. font-awesome#4.6.3 src/app/vendor/font-awesome
  442.  
  443. backbone.radio#2.0.0 src/app/vendor/backbone.radio
  444.  
  445. bootstrap#3.3.7 src/app/vendor/bootstrap
  446. └── jquery#3.3.1
  447.  
  448. backbone#1.3.3 src/app/vendor/backbone
  449. └── underscore#1.9.1
  450.  
  451. video.js#4.11.4 src/app/vendor/video.js
  452.  
  453. jquery#3.3.1 src/app/vendor/jquery
  454.  
  455. underscore#1.9.1 src/app/vendor/underscore
  456.  
  457. > Popcorn-Time@0.3.10 postupdate /build/popcorntime/src/popcorn-desktop
  458. > bower update --config.interactive=false
  459.  
  460. bower backbone#1.3.3 cached https://github.com/jashkenas/backbone.git#1.3.3
  461. bower backbone#1.3.3 validate 1.3.3 against https://github.com/jashkenas/backbone.git#1.3.3
  462. bower bootstrap#~3.3.7 cached https://github.com/twbs/bootstrap.git#3.3.7
  463. bower bootstrap#~3.3.7 validate 3.3.7 against https://github.com/twbs/bootstrap.git#~3.3.7
  464. bower videojs-youtube#1.2.10 cached https://github.com/eXon/videojs-youtube.git#1.2.10
  465. bower videojs-youtube#1.2.10 validate 1.2.10 against https://github.com/eXon/videojs-youtube.git#1.2.10
  466. bower marionette#~3.x.x cached https://github.com/marionettejs/backbone.marionette.git#3.5.1
  467. bower marionette#~3.x.x validate 3.5.1 against https://github.com/marionettejs/backbone.marionette.git#~3.x.x
  468. bower mousetrap#~1.6.0 cached https://github.com/ccampbell/mousetrap.git#1.6.2
  469. bower mousetrap#~1.6.0 validate 1.6.2 against https://github.com/ccampbell/mousetrap.git#~1.6.0
  470. bower font-awesome#~4.6.3 cached https://github.com/FortAwesome/Font-Awesome.git#4.6.3
  471. bower font-awesome#~4.6.3 validate 4.6.3 against https://github.com/FortAwesome/Font-Awesome.git#~4.6.3
  472. bower video.js#4.11.4 cached https://github.com/videojs/video.js.git#4.11.4
  473. bower video.js#4.11.4 validate 4.11.4 against https://github.com/videojs/video.js.git#4.11.4
  474. bower backbone.radio#^2.0.0 cached https://github.com/marionettejs/backbone.radio.git#2.0.0
  475. bower backbone.radio#^2.0.0 validate 2.0.0 against https://github.com/marionettejs/backbone.radio.git#^2.0.0
  476. bower underscore#>=1.8.3 cached https://github.com/jashkenas/underscore.git#1.9.1
  477. bower underscore#>=1.8.3 validate 1.9.1 against https://github.com/jashkenas/underscore.git#>=1.8.3
  478. bower jquery#1.9.1 - 3 cached https://github.com/jquery/jquery-dist.git#3.3.1
  479. bower jquery#1.9.1 - 3 validate 3.3.1 against https://github.com/jquery/jquery-dist.git#1.9.1 - 3
  480. bower underscore extra-resolution Unnecessary resolution: underscore#>=1.8.0
  481. npm WARN optional SKIPPING OPTIONAL DEPENDENCY: fsevents@1.1.2 (node_modules/fsevents):
  482. npm WARN notsup SKIPPING OPTIONAL DEPENDENCY: Unsupported platform for fsevents@1.1.2: wanted {"os":"darwin","arch":"any"} (current: {"os":"linux","arch":"x64"})
  483. npm WARN optional SKIPPING OPTIONAL DEPENDENCY: bufferutil@3.0.2 (node_modules/bufferutil):
  484. npm WARN optional SKIPPING OPTIONAL DEPENDENCY: bufferutil@3.0.2 install: `prebuild-install || node-gyp rebuild`
  485. npm WARN optional SKIPPING OPTIONAL DEPENDENCY: Exit status 1
  486.  
  487. added 29 packages from 30 contributors in 20.543s
  488. ==> Starting build()...
  489. gulp[1588]: ../src/node_contextify.cc:635:static void node::contextify::ContextifyScript::New(const v8::FunctionCallbackInfo<v8::Value>&): Assertion `args[1]->IsString()' failed.
  490. 1: 0x5591578e7d61 node::Abort() [gulp]
  491. 2: 0x5591578e7e5b [gulp]
  492. 3: 0x5591579176c4 node::contextify::ContextifyScript::New(v8::FunctionCallbackInfo<v8::Value> const&) [gulp]
  493. 4: 0x559157b21b1f [gulp]
  494. 5: 0x559157b2221f [gulp]
  495. 6: 0x3af3b20841bd
  496. /startdir/PKGBUILD: line 95: 1588 Aborted (core dumped) gulp build
  497. ==> ERROR: A failure occurred in build().
  498. Aborting...
  499. ==> Removing chroot copy [/tmp/x86_64/bartus-1110]...done
  500. ==> ERROR: Build failed
  501. ==> ERROR: build: failure on package
RAW Paste Data