Pastebin
API
tools
faq
paste
Login
Sign up
Please fix the following errors:
New Paste
Syntax Highlighting
kage 14:31:58.079 [DEBUG] [com.sun.xml.internal.bind.v2.runtime.reflect.opt.OptimizedAccessorFactory] Using optimized Accessor for protected com.android.repository.impl.generated.v1.TypeDetails com.android.repository.impl .generated.v1.RemotePackage.typeDetails 14:31:58.099 [DEBUG] [com.sun.xml.internal.bind.v2.runtime.reflect.opt.OptimizedAccessorFactory] Using optimized Accessor for protected com.android.repository.impl.generated.v1.RevisionType com.android.repository.imp l.generated.v1.RemotePackage.revision 14:31:58.117 [DEBUG] [com.sun.xml.internal.bind.v2.runtime.reflect.opt.OptimizedAccessorFactory] Using optimized Accessor for protected int com.android.repository.impl.generated.v1.RevisionType.major 14:31:58.134 [DEBUG] [com.sun.xml.internal.bind.v2.runtime.reflect.opt.OptimizedAccessorFactory] Using optimized Accessor for protected java.lang.Integer com.android.repository.impl.generated.v1.RevisionType.minor 14:31:58.149 [DEBUG] [com.sun.xml.internal.bind.v2.runtime.reflect.opt.OptimizedAccessorFactory] Using optimized Accessor for protected java.lang.Integer com.android.repository.impl.generated.v1.RevisionType.minor 14:31:58.171 [DEBUG] [com.sun.xml.internal.bind.v2.runtime.reflect.opt.OptimizedAccessorFactory] Using optimized Accessor for protected java.lang.Integer com.android.repository.impl.generated.v1.RevisionType.micro 14:31:58.189 [DEBUG] [com.sun.xml.internal.bind.v2.runtime.reflect.opt.OptimizedAccessorFactory] Using optimized Accessor for protected java.lang.Integer com.android.repository.impl.generated.v1.RevisionType.micro 14:31:58.215 [DEBUG] [com.sun.xml.internal.bind.v2.runtime.reflect.opt.OptimizedAccessorFactory] Using optimized Accessor for protected java.lang.Integer com.android.repository.impl.generated.v1.RevisionType.preview 14:31:58.239 [DEBUG] [com.sun.xml.internal.bind.v2.runtime.reflect.opt.OptimizedAccessorFactory] Using optimized Accessor for protected java.lang.Integer com.android.repository.impl.generated.v1.RevisionType.preview 14:31:58.269 [DEBUG] [com.sun.xml.internal.bind.v2.runtime.reflect.opt.OptimizedAccessorFactory] Using optimized Accessor for protected com.android.repository.impl.generated.v1.LicenseRefType com.android.repository.i mpl.generated.v1.RemotePackage.usesLicense 14:31:58.297 [DEBUG] [com.sun.xml.internal.bind.v2.runtime.reflect.opt.OptimizedAccessorFactory] Using optimized Accessor for protected com.android.repository.impl.generated.v1.DependenciesType com.android.repository .impl.generated.v1.RemotePackage.dependencies 14:31:58.317 [DEBUG] [com.sun.xml.internal.bind.v2.runtime.reflect.opt.OptimizedAccessorFactory] Using optimized Accessor for protected java.util.List com.android.repository.impl.generated.v1.DependenciesType.depende ncy 14:31:58.341 [DEBUG] [com.sun.xml.internal.bind.v2.runtime.reflect.opt.OptimizedAccessorFactory] Using optimized Accessor for protected com.android.repository.impl.generated.v1.RevisionType com.android.repository.imp l.generated.v1.DependencyType.minRevision 14:31:58.360 [DEBUG] [com.sun.xml.internal.bind.v2.runtime.reflect.opt.OptimizedAccessorFactory] Using optimized Accessor for protected com.android.repository.impl.generated.v1.ChannelRefType com.android.repository.i mpl.generated.v1.RemotePackage.channelRef 14:31:58.386 [DEBUG] [com.sun.xml.internal.bind.v2.runtime.reflect.opt.OptimizedAccessorFactory] Using optimized Accessor for protected com.android.repository.impl.generated.v1.ArchivesType com.android.repository.imp l.generated.v1.RemotePackage.archives 14:31:58.405 [DEBUG] [com.sun.xml.internal.bind.v2.runtime.reflect.opt.OptimizedAccessorFactory] Using optimized Accessor for protected java.util.List com.android.repository.impl.generated.v1.ArchivesType.archive 14:31:58.424 [DEBUG] [com.sun.xml.internal.bind.v2.runtime.reflect.opt.OptimizedAccessorFactory] Using optimized Accessor for protected java.lang.Integer com.android.repository.impl.generated.v1.ArchiveType.hostBits 14:31:58.445 [DEBUG] [com.sun.xml.internal.bind.v2.runtime.reflect.opt.OptimizedAccessorFactory] Using optimized Accessor for protected java.lang.Integer com.android.repository.impl.generated.v1.ArchiveType.hostBits 14:31:58.471 [DEBUG] [com.sun.xml.internal.bind.v2.runtime.reflect.opt.OptimizedAccessorFactory] Using optimized Accessor for protected java.lang.Integer com.android.repository.impl.generated.v1.ArchiveType.jvmBits 14:31:58.494 [DEBUG] [com.sun.xml.internal.bind.v2.runtime.reflect.opt.OptimizedAccessorFactory] Using optimized Accessor for protected java.lang.Integer com.android.repository.impl.generated.v1.ArchiveType.jvmBits 14:31:58.516 [DEBUG] [com.sun.xml.internal.bind.v2.runtime.reflect.opt.OptimizedAccessorFactory] Using optimized Accessor for protected com.android.repository.impl.generated.v1.RevisionType com.android.repository.imp l.generated.v1.ArchiveType.minJvmVersion 14:31:58.537 [DEBUG] [com.sun.xml.internal.bind.v2.runtime.reflect.opt.OptimizedAccessorFactory] Using optimized Accessor for protected com.android.repository.impl.generated.v1.CompleteType com.android.repository.imp l.generated.v1.ArchiveType.complete 14:31:58.560 [DEBUG] [com.sun.xml.internal.bind.v2.runtime.reflect.opt.OptimizedAccessorFactory] Using optimized Accessor for public abstract java.lang.String com.android.repository.impl.meta.Archive$ArchiveFile.getC hecksum() and public void com.android.repository.impl.meta.Archive$ArchiveFile.setChecksum(java.lang.String) 14:31:58.585 [DEBUG] [com.sun.xml.internal.bind.v2.runtime.reflect.opt.OptimizedAccessorFactory] Using optimized Accessor for public abstract java.lang.String com.android.repository.impl.meta.Archive$ArchiveFile.getC hecksum() and public void com.android.repository.impl.meta.Archive$ArchiveFile.setChecksum(java.lang.String) 14:31:58.617 [DEBUG] [com.sun.xml.internal.bind.v2.runtime.reflect.opt.OptimizedAccessorFactory] Using optimized Accessor for public abstract long com.android.repository.impl.meta.Archive$ArchiveFile.getSize() and pu blic void com.android.repository.impl.meta.Archive$ArchiveFile.setSize(long) 14:31:58.646 [DEBUG] [com.sun.xml.internal.bind.v2.runtime.reflect.opt.OptimizedAccessorFactory] Using optimized Accessor for public abstract java.lang.String com.android.repository.impl.meta.Archive$ArchiveFile.getU rl() and public void com.android.repository.impl.meta.Archive$ArchiveFile.setUrl(java.lang.String) 14:31:58.670 [DEBUG] [com.sun.xml.internal.bind.v2.runtime.reflect.opt.OptimizedAccessorFactory] Using optimized Accessor for public abstract java.lang.String com.android.repository.impl.meta.Archive$ArchiveFile.getU rl() and public void com.android.repository.impl.meta.Archive$ArchiveFile.setUrl(java.lang.String) 14:31:58.691 [DEBUG] [com.sun.xml.internal.bind.v2.runtime.reflect.opt.OptimizedAccessorFactory] Using optimized Accessor for protected long com.android.repository.impl.generated.v1.CompleteType.size 14:31:58.712 [DEBUG] [com.sun.xml.internal.bind.v2.runtime.reflect.opt.OptimizedAccessorFactory] Using optimized Accessor for protected com.android.repository.impl.generated.v1.PatchesType com.android.repository.impl .generated.v1.ArchiveType.patches 14:31:58.732 [DEBUG] [com.sun.xml.internal.bind.v2.runtime.reflect.opt.OptimizedAccessorFactory] Using optimized Accessor for protected java.util.List com.android.repository.impl.generated.v1.PatchesType.patch 14:31:58.751 [DEBUG] [com.sun.xml.internal.bind.v2.runtime.reflect.opt.OptimizedAccessorFactory] Using optimized Accessor for protected com.android.repository.impl.generated.v1.RevisionType com.android.repository.imp l.generated.v1.PatchType.basedOn 14:31:58.778 [DEBUG] [com.sun.xml.internal.bind.v2.runtime.reflect.opt.OptimizedAccessorFactory] Using optimized Accessor for protected long com.android.repository.impl.generated.v1.PatchType.size 14:31:58.801 [DEBUG] [com.sun.xml.internal.bind.v2.runtime.reflect.opt.OptimizedAccessorFactory] Using optimized Accessor for protected java.lang.Boolean com.android.repository.impl.generated.v1.RemotePackage.obsolet e 14:31:58.822 [DEBUG] [com.sun.xml.internal.bind.v2.runtime.reflect.opt.OptimizedAccessorFactory] Using optimized Accessor for protected com.android.repository.impl.generated.v1.LocalPackage com.android.repository.imp l.generated.v1.RepositoryType.localPackage 14:31:58.840 [DEBUG] [com.sun.xml.internal.bind.v2.runtime.reflect.opt.OptimizedAccessorFactory] Using optimized Accessor for protected com.android.repository.impl.generated.v1.TypeDetails com.android.repository.impl .generated.v1.LocalPackage.typeDetails 14:31:58.861 [DEBUG] [com.sun.xml.internal.bind.v2.runtime.reflect.opt.OptimizedAccessorFactory] Using optimized Accessor for protected com.android.repository.impl.generated.v1.RevisionType com.android.repository.imp l.generated.v1.LocalPackage.revision 14:31:58.882 [DEBUG] [com.sun.xml.internal.bind.v2.runtime.reflect.opt.OptimizedAccessorFactory] Using optimized Accessor for protected com.android.repository.impl.generated.v1.LicenseRefType com.android.repository.i mpl.generated.v1.LocalPackage.usesLicense 14:31:58.904 [DEBUG] [com.sun.xml.internal.bind.v2.runtime.reflect.opt.OptimizedAccessorFactory] Using optimized Accessor for protected com.android.repository.impl.generated.v1.DependenciesType com.android.repository .impl.generated.v1.LocalPackage.dependencies 14:31:58.928 [DEBUG] [com.sun.xml.internal.bind.v2.runtime.reflect.opt.OptimizedAccessorFactory] Using optimized Accessor for protected java.lang.Boolean com.android.repository.impl.generated.v1.LocalPackage.obsolete 14:31:58.949 [DEBUG] [com.sun.xml.internal.bind.v2.runtime.reflect.opt.OptimizedAccessorFactory] Using optimized Accessor for protected java.util.List com.android.sdklib.repositoryv2.generated.addon.v1.LibrariesType. library 14:31:58.967 [DEBUG] [com.sun.xml.internal.bind.v2.runtime.reflect.opt.OptimizedAccessorFactory] Using optimized Accessor for protected com.android.sdklib.repositoryv2.generated.common.v1.IdDisplayType com.android.sd klib.repositoryv2.generated.addon.v1.ExtraDetailsType.vendor 14:31:58.994 [DEBUG] [com.sun.xml.internal.bind.v2.runtime.reflect.opt.OptimizedAccessorFactory] Using optimized Accessor for protected int com.android.sdklib.repositoryv2.generated.common.v1.ApiDetailsType.apiLevel 14:31:59.018 [DEBUG] [com.sun.xml.internal.bind.v2.runtime.reflect.opt.OptimizedAccessorFactory] Using optimized Accessor for protected java.lang.String com.android.sdklib.repositoryv2.generated.common.v1.ApiDetailsT ype.codename 14:31:59.044 [DEBUG] [com.sun.xml.internal.bind.v2.runtime.reflect.opt.OptimizedAccessorFactory] Using optimized Accessor for protected java.lang.String com.android.sdklib.repositoryv2.generated.common.v1.ApiDetailsT ype.codename 14:31:59.063 [DEBUG] [com.sun.xml.internal.bind.v2.runtime.reflect.opt.OptimizedAccessorFactory] Using optimized Accessor for protected com.android.sdklib.repositoryv2.generated.common.v1.IdDisplayType com.android.sd klib.repositoryv2.generated.addon.v1.AddonDetailsType.vendor 14:31:59.086 [DEBUG] [com.sun.xml.internal.bind.v2.runtime.reflect.opt.OptimizedAccessorFactory] Using optimized Accessor for protected com.android.sdklib.repositoryv2.generated.common.v1.IdDisplayType com.android.sd klib.repositoryv2.generated.addon.v1.AddonDetailsType.tag 14:31:59.110 [DEBUG] [com.sun.xml.internal.bind.v2.runtime.reflect.opt.OptimizedAccessorFactory] Using optimized Accessor for protected java.lang.String com.android.sdklib.repositoryv2.generated.addon.v1.AddonDetails Type.defaultSkin 14:31:59.125 [DEBUG] [com.sun.xml.internal.bind.v2.runtime.reflect.opt.OptimizedAccessorFactory] Using optimized Accessor for protected java.lang.String com.android.sdklib.repositoryv2.generated.addon.v1.AddonDetails Type.defaultSkin 14:31:59.145 [DEBUG] [com.sun.xml.internal.bind.v2.runtime.reflect.opt.OptimizedAccessorFactory] Using optimized Accessor for protected com.android.sdklib.repositoryv2.generated.addon.v1.LibrariesType com.android.sdk lib.repositoryv2.generated.addon.v1.AddonDetailsType.libraries 14:31:59.170 [DEBUG] [com.sun.xml.internal.bind.v2.runtime.reflect.opt.OptimizedAccessorFactory] Using optimized Accessor for protected com.android.sdklib.repositoryv2.generated.common.v1.IdDisplayType com.android.sd klib.repositoryv2.generated.addon.v1.MavenType.vendor 14:31:59.192 [DEBUG] [com.sun.xml.internal.bind.v2.runtime.reflect.opt.OptimizedAccessorFactory] Using optimized Accessor for protected com.android.sdklib.repositoryv2.generated.common.v1.IdDisplayType com.android.sd klib.repositoryv2.generated.sysimg.v1.SysImgDetailsType.tag 14:31:59.217 [DEBUG] [com.sun.xml.internal.bind.v2.runtime.reflect.opt.OptimizedAccessorFactory] Using optimized Accessor for protected com.android.sdklib.repositoryv2.generated.common.v1.IdDisplayType com.android.sd klib.repositoryv2.generated.sysimg.v1.SysImgDetailsType.vendor 14:31:59.247 [DEBUG] [com.sun.xml.internal.bind.v2.runtime.reflect.opt.OptimizedAccessorFactory] Using optimized Accessor for protected java.lang.String com.android.sdklib.repositoryv2.generated.sysimg.v1.SysImgDetai lsType.abi 14:31:59.267 [DEBUG] [com.sun.xml.internal.bind.v2.runtime.reflect.opt.OptimizedAccessorFactory] Using optimized Accessor for protected java.lang.String com.android.sdklib.repositoryv2.generated.sysimg.v1.SysImgDetai lsType.abi 14:31:59.294 [DEBUG] [com.sun.xml.internal.bind.v2.runtime.reflect.opt.OptimizedAccessorFactory] Using optimized Accessor for protected com.android.sdklib.repositoryv2.generated.repository.v1.LayoutlibType com.androi d.sdklib.repositoryv2.generated.repository.v1.PlatformDetailsType.layoutlib 14:31:59.314 [DEBUG] [com.sun.xml.internal.bind.v2.runtime.reflect.opt.OptimizedTransducedAccessorFactory] Using optimized TransducedAccessor for com.android.sdklib.repositoryv2.generated.repository.v1.LayoutlibType# api 14:31:59.638 [INFO] [org.gradle.api.Project] Parsing E:\Mahach\AndroidDeveloment\Programms\sdk\build-tools\20.0.0\package.xml 14:31:59.692 [INFO] [org.gradle.api.Project] Parsing E:\Mahach\AndroidDeveloment\Programms\sdk\build-tools\21.0.0\package.xml 14:31:59.739 [INFO] [org.gradle.api.Project] Parsing E:\Mahach\AndroidDeveloment\Programms\sdk\build-tools\21.1.0\package.xml 14:31:59.781 [INFO] [org.gradle.api.Project] Parsing E:\Mahach\AndroidDeveloment\Programms\sdk\build-tools\21.1.1\package.xml 14:31:59.826 [INFO] [org.gradle.api.Project] Parsing E:\Mahach\AndroidDeveloment\Programms\sdk\build-tools\21.1.2\package.xml 14:31:59.872 [INFO] [org.gradle.api.Project] Parsing E:\Mahach\AndroidDeveloment\Programms\sdk\build-tools\22.0.1\package.xml 14:31:59.923 [INFO] [org.gradle.api.Project] Parsing E:\Mahach\AndroidDeveloment\Programms\sdk\build-tools\23.0.0\package.xml 14:31:59.962 [INFO] [org.gradle.api.Project] Parsing E:\Mahach\AndroidDeveloment\Programms\sdk\build-tools\23.0.1\package.xml 14:31:59.996 [INFO] [org.gradle.api.Project] Parsing E:\Mahach\AndroidDeveloment\Programms\sdk\build-tools\23.0.2\package.xml 14:32:00.039 [INFO] [org.gradle.api.Project] Parsing E:\Mahach\AndroidDeveloment\Programms\sdk\build-tools\23.0.3\package.xml 14:32:00.069 [INFO] [org.gradle.api.Project] Parsing E:\Mahach\AndroidDeveloment\Programms\sdk\build-tools\24.0.0\package.xml 14:32:00.104 [INFO] [org.gradle.api.Project] Parsing E:\Mahach\AndroidDeveloment\Programms\sdk\extras\android\gapid\package.xml 14:32:00.141 [INFO] [org.gradle.api.Project] Parsing E:\Mahach\AndroidDeveloment\Programms\sdk\extras\android\m2repository\package.xml 14:32:00.180 [INFO] [org.gradle.api.Project] Parsing E:\Mahach\AndroidDeveloment\Programms\sdk\extras\android\support\package.xml 14:32:00.215 [INFO] [org.gradle.api.Project] Parsing E:\Mahach\AndroidDeveloment\Programms\sdk\extras\google\auto\package.xml 14:32:00.262 [INFO] [org.gradle.api.Project] Parsing E:\Mahach\AndroidDeveloment\Programms\sdk\extras\google\google_play_services\package.xml 14:32:00.300 [INFO] [org.gradle.api.Project] Parsing E:\Mahach\AndroidDeveloment\Programms\sdk\extras\google\m2repository\package.xml 14:32:00.337 [INFO] [org.gradle.api.Project] Parsing E:\Mahach\AndroidDeveloment\Programms\sdk\extras\google\play_apk_expansion\package.xml 14:32:00.377 [INFO] [org.gradle.api.Project] Parsing E:\Mahach\AndroidDeveloment\Programms\sdk\extras\google\play_billing\package.xml 14:32:00.413 [INFO] [org.gradle.api.Project] Parsing E:\Mahach\AndroidDeveloment\Programms\sdk\extras\google\play_licensing\package.xml 14:32:00.449 [INFO] [org.gradle.api.Project] Parsing E:\Mahach\AndroidDeveloment\Programms\sdk\extras\google\simulators\package.xml 14:32:00.493 [INFO] [org.gradle.api.Project] Parsing E:\Mahach\AndroidDeveloment\Programms\sdk\extras\google\usb_driver\package.xml 14:32:00.526 [INFO] [org.gradle.api.Project] Parsing E:\Mahach\AndroidDeveloment\Programms\sdk\extras\google\webdriver\package.xml 14:32:00.569 [INFO] [org.gradle.api.Project] Parsing E:\Mahach\AndroidDeveloment\Programms\sdk\extras\intel\Hardware_Accelerated_Execution_Manager\package.xml 14:32:00.605 [INFO] [org.gradle.api.Project] Parsing E:\Mahach\AndroidDeveloment\Programms\sdk\platform-tools\package.xml 14:32:00.638 [INFO] [org.gradle.api.Project] Parsing E:\Mahach\AndroidDeveloment\Programms\sdk\platforms\android-13\package.xml 14:32:00.666 [INFO] [org.gradle.api.Project] Parsing E:\Mahach\AndroidDeveloment\Programms\sdk\platforms\android-17\package.xml 14:32:00.700 [INFO] [org.gradle.api.Project] Parsing E:\Mahach\AndroidDeveloment\Programms\sdk\platforms\android-18\package.xml 14:32:00.733 [INFO] [org.gradle.api.Project] Parsing E:\Mahach\AndroidDeveloment\Programms\sdk\platforms\android-19\package.xml 14:32:00.771 [INFO] [org.gradle.api.Project] Parsing E:\Mahach\AndroidDeveloment\Programms\sdk\platforms\android-21\package.xml 14:32:00.806 [INFO] [org.gradle.api.Project] Parsing E:\Mahach\AndroidDeveloment\Programms\sdk\platforms\android-22\package.xml 14:32:00.847 [INFO] [org.gradle.api.Project] Parsing E:\Mahach\AndroidDeveloment\Programms\sdk\platforms\android-23\package.xml 14:32:00.880 [INFO] [org.gradle.api.Project] Parsing E:\Mahach\AndroidDeveloment\Programms\sdk\platforms\android-24\package.xml 14:32:00.914 [INFO] [org.gradle.api.Project] Parsing E:\Mahach\AndroidDeveloment\Programms\sdk\sources\android-23\package.xml 14:32:00.949 [INFO] [org.gradle.api.Project] Parsing E:\Mahach\AndroidDeveloment\Programms\sdk\system-images\android-21\google_apis\armeabi-v7a\package.xml 14:32:00.986 [INFO] [org.gradle.api.Project] Parsing E:\Mahach\AndroidDeveloment\Programms\sdk\system-images\android-21\google_apis\x86_64\package.xml 14:32:01.023 [INFO] [org.gradle.api.Project] Parsing E:\Mahach\AndroidDeveloment\Programms\sdk\system-images\android-23\android-tv\armeabi-v7a\package.xml 14:32:01.056 [INFO] [org.gradle.api.Project] Parsing E:\Mahach\AndroidDeveloment\Programms\sdk\system-images\android-23\android-tv\x86\package.xml 14:32:01.092 [INFO] [org.gradle.api.Project] Parsing E:\Mahach\AndroidDeveloment\Programms\sdk\system-images\android-23\android-wear\armeabi-v7a\package.xml 14:32:01.126 [INFO] [org.gradle.api.Project] Parsing E:\Mahach\AndroidDeveloment\Programms\sdk\system-images\android-23\android-wear\x86\package.xml 14:32:01.156 [INFO] [org.gradle.api.Project] Parsing E:\Mahach\AndroidDeveloment\Programms\sdk\system-images\android-23\default\armeabi-v7a\package.xml 14:32:01.196 [INFO] [org.gradle.api.Project] Parsing E:\Mahach\AndroidDeveloment\Programms\sdk\system-images\android-23\default\x86\package.xml 14:32:01.236 [INFO] [org.gradle.api.Project] Parsing E:\Mahach\AndroidDeveloment\Programms\sdk\system-images\android-23\default\x86_64\package.xml 14:32:01.273 [INFO] [org.gradle.api.Project] Parsing E:\Mahach\AndroidDeveloment\Programms\sdk\tools\package.xml 14:32:01.520 [DEBUG] [org.gradle.api.Project] SDK initialized in 4652 ms 14:32:01.618 [INFO] [org.gradle.configuration.project.BuildScriptProcessor] Evaluating project ':lib' using build file 'E:\Mahach\AndroidDeveloment\Wokspaces\github\Scripto\lib\build.gradle'. 14:32:01.650 [DEBUG] [org.gradle.cache.internal.DefaultFileLockManager] Waiting to acquire shared lock on cp_proj class cache for build file 'E:\Mahach\AndroidDeveloment\Wokspaces\github\Scripto\lib\build.gradle' (C: \Users\Admin\.gradle\caches\2.10\scripts\build_d0uuewuob0v77uv3o3peswl81\cp_proj). 14:32:01.671 [DEBUG] [org.gradle.cache.internal.DefaultFileLockManager] Lock acquired. 14:32:01.695 [DEBUG] [org.gradle.cache.internal.DefaultFileLockManager] Waiting to acquire shared lock on proj class cache for build file 'E:\Mahach\AndroidDeveloment\Wokspaces\github\Scripto\lib\build.gradle' (C:\Us ers\Admin\.gradle\caches\2.10\scripts\build_d0uuewuob0v77uv3o3peswl81\proj). 14:32:01.717 [DEBUG] [org.gradle.cache.internal.DefaultFileLockManager] Lock acquired. 14:32:01.779 [DEBUG] [org.gradle.model.internal.registry.DefaultModelRegistry] Transitioning model element 'tasks.assemble' from state Registered to Initialized 14:32:01.802 [DEBUG] [org.gradle.model.internal.registry.DefaultModelRegistry] Running model element 'tasks.assemble' rule action tasks.addPlaceholderAction(assemble) 14:32:01.826 [DEBUG] [org.gradle.model.internal.registry.DefaultModelRegistry] Mutating tasks.assemble using tasks.addPlaceholderAction(assemble) 14:32:01.845 [DEBUG] [org.gradle.model.internal.registry.DefaultModelRegistry] Transitioning model element 'tasks.assemble' to state Discovered. 14:32:01.870 [DEBUG] [org.gradle.model.internal.registry.DefaultModelRegistry] Running model element 'tasks.assemble' rule action tasks.addPlaceholderAction(assemble) 14:32:01.891 [DEBUG] [org.gradle.model.internal.registry.DefaultModelRegistry] Mutating tasks.assemble using tasks.addPlaceholderAction(assemble) 14:32:01.916 [DEBUG] [org.gradle.model.internal.registry.DefaultModelRegistry] Transitioning model element 'tasks.assemble' to state Created. 14:32:01.936 [DEBUG] [org.gradle.model.internal.registry.DefaultModelRegistry] Transitioning model element 'tasks.assemble' to state DefaultsApplied. 14:32:01.959 [DEBUG] [org.gradle.model.internal.registry.DefaultModelRegistry] Running model element 'tasks.assemble' rule action copyToTaskContainer 14:32:01.980 [DEBUG] [org.gradle.model.internal.registry.DefaultModelRegistry] Mutating tasks.assemble using copyToTaskContainer 14:32:01.996 [DEBUG] [org.gradle.model.internal.registry.DefaultModelRegistry] Transitioning model element 'tasks.assemble' to state Initialized. 14:32:02.018 [DEBUG] [org.gradle.model.internal.registry.DefaultModelRegistry] Transitioning model element 'languageSourceSetFactory' from state Registered to Discovered 14:32:02.043 [DEBUG] [org.gradle.model.internal.registry.DefaultModelRegistry] Running model element 'languageSourceSetFactory' rule action LanguageBasePlugin.Rules#languageSourceSetFactory 14:32:02.059 [DEBUG] [org.gradle.model.internal.registry.DefaultModelRegistry] Mutating languageSourceSetFactory using LanguageBasePlugin.Rules#languageSourceSetFactory 14:32:02.080 [DEBUG] [org.gradle.model.internal.registry.DefaultModelRegistry] Transitioning model element 'languageSourceSetFactory' to state Discovered. 14:32:02.099 [DEBUG] [org.gradle.model.internal.registry.DefaultModelRegistry] Transitioning model element 'languages' from state Registered to Discovered 14:32:02.125 [DEBUG] [org.gradle.model.internal.registry.DefaultModelRegistry] Running model element 'languages' rule action LanguageBasePlugin.Rules#languages 14:32:02.145 [DEBUG] [org.gradle.model.internal.registry.DefaultModelRegistry] Mutating languages using LanguageBasePlugin.Rules#languages 14:32:02.166 [DEBUG] [org.gradle.model.internal.registry.DefaultModelRegistry] Transitioning model element 'languages' to state Discovered. 14:32:02.184 [DEBUG] [org.gradle.model.internal.registry.DefaultModelRegistry] Transitioning model element 'languageTransforms' from state Registered to Discovered 14:32:02.207 [DEBUG] [org.gradle.model.internal.registry.DefaultModelRegistry] Running model element 'languageTransforms' rule action ComponentModelBasePlugin.Rules#languageTransforms 14:32:02.229 [DEBUG] [org.gradle.model.internal.registry.DefaultModelRegistry] Mutating languageTransforms using ComponentModelBasePlugin.Rules#languageTransforms 14:32:02.248 [DEBUG] [org.gradle.model.internal.registry.DefaultModelRegistry] Transitioning model element 'languageTransforms' to state Discovered. 14:32:02.267 [DEBUG] [org.gradle.model.internal.registry.DefaultModelRegistry] Transitioning model element 'binarySpecFactory' from state Registered to Discovered 14:32:02.285 [DEBUG] [org.gradle.model.internal.registry.DefaultModelRegistry] Running model element 'binarySpecFactory' rule action ComponentModelBasePlugin.Rules#binarySpecFactory 14:32:02.308 [DEBUG] [org.gradle.model.internal.registry.DefaultModelRegistry] Mutating binarySpecFactory using ComponentModelBasePlugin.Rules#binarySpecFactory 14:32:02.327 [DEBUG] [org.gradle.model.internal.registry.DefaultModelRegistry] Transitioning model element 'binarySpecFactory' to state Discovered. 14:32:02.354 [DEBUG] [org.gradle.model.internal.registry.DefaultModelRegistry] Transitioning model element 'componentSpecFactory' from state Registered to Discovered 14:32:02.373 [DEBUG] [org.gradle.model.internal.registry.DefaultModelRegistry] Running model element 'componentSpecFactory' rule action ComponentModelBasePlugin.Rules#componentSpecFactory 14:32:02.390 [DEBUG] [org.gradle.model.internal.registry.DefaultModelRegistry] Mutating componentSpecFactory using ComponentModelBasePlugin.Rules#componentSpecFactory 14:32:02.413 [DEBUG] [org.gradle.model.internal.registry.DefaultModelRegistry] Transitioning model element 'componentSpecFactory' to state Discovered. 14:32:02.430 [DEBUG] [org.gradle.model.internal.registry.DefaultModelRegistry] Transitioning model element 'platformResolver' from state Registered to Discovered 14:32:02.450 [DEBUG] [org.gradle.model.internal.registry.DefaultModelRegistry] Running model element 'platformResolver' rule action ComponentModelBasePlugin.Rules#platformResolver 14:32:02.467 [DEBUG] [org.gradle.model.internal.registry.DefaultModelRegistry] Mutating platformResolver using ComponentModelBasePlugin.Rules#platformResolver 14:32:02.485 [DEBUG] [org.gradle.model.internal.registry.DefaultModelRegistry] Transitioning model element 'platformResolver' to state Discovered. 14:32:02.539 [INFO] [com.android.build.gradle.LibraryExtension_Decorated] Creating configuration compile 14:32:02.566 [INFO] [com.android.build.gradle.LibraryExtension_Decorated] Creating configuration publish 14:32:02.590 [INFO] [com.android.build.gradle.LibraryExtension_Decorated] Creating configuration provided 14:32:02.614 [INFO] [com.android.build.gradle.LibraryExtension_Decorated] Creating configuration wearApp 14:32:02.636 [INFO] [com.android.build.gradle.LibraryExtension_Decorated] Creating configuration androidTestCompile 14:32:02.664 [INFO] [com.android.build.gradle.LibraryExtension_Decorated] Creating configuration androidTestPublish 14:32:02.688 [INFO] [com.android.build.gradle.LibraryExtension_Decorated] Creating configuration androidTestProvided 14:32:02.711 [INFO] [com.android.build.gradle.LibraryExtension_Decorated] Creating configuration androidTestWearApp 14:32:02.735 [INFO] [com.android.build.gradle.LibraryExtension_Decorated] Creating configuration testCompile 14:32:02.756 [INFO] [com.android.build.gradle.LibraryExtension_Decorated] Creating configuration testPublish 14:32:02.780 [INFO] [com.android.build.gradle.LibraryExtension_Decorated] Creating configuration testProvided 14:32:02.800 [INFO] [com.android.build.gradle.LibraryExtension_Decorated] Creating configuration testWearApp 14:32:02.868 [INFO] [com.android.build.gradle.LibraryExtension_Decorated] Creating configuration debugCompile 14:32:02.889 [INFO] [com.android.build.gradle.LibraryExtension_Decorated] Creating configuration debugPublish 14:32:02.916 [INFO] [com.android.build.gradle.LibraryExtension_Decorated] Creating configuration debugProvided 14:32:02.939 [INFO] [com.android.build.gradle.LibraryExtension_Decorated] Creating configuration debugWearApp 14:32:02.966 [INFO] [com.android.build.gradle.LibraryExtension_Decorated] Creating configuration testDebugCompile 14:32:02.987 [INFO] [com.android.build.gradle.LibraryExtension_Decorated] Creating configuration testDebugPublish 14:32:03.006 [INFO] [com.android.build.gradle.LibraryExtension_Decorated] Creating configuration testDebugProvided 14:32:03.024 [INFO] [com.android.build.gradle.LibraryExtension_Decorated] Creating configuration testDebugWearApp 14:32:03.048 [INFO] [com.android.build.gradle.LibraryExtension_Decorated] Creating configuration releaseCompile 14:32:03.071 [INFO] [com.android.build.gradle.LibraryExtension_Decorated] Creating configuration releasePublish 14:32:03.091 [INFO] [com.android.build.gradle.LibraryExtension_Decorated] Creating configuration releaseProvided 14:32:03.113 [INFO] [com.android.build.gradle.LibraryExtension_Decorated] Creating configuration releaseWearApp 14:32:03.138 [INFO] [com.android.build.gradle.LibraryExtension_Decorated] Creating configuration testReleaseCompile 14:32:03.163 [INFO] [com.android.build.gradle.LibraryExtension_Decorated] Creating configuration testReleasePublish 14:32:03.184 [INFO] [com.android.build.gradle.LibraryExtension_Decorated] Creating configuration testReleaseProvided 14:32:03.212 [INFO] [com.android.build.gradle.LibraryExtension_Decorated] Creating configuration testReleaseWearApp 14:32:03.238 [DEBUG] [org.gradle.model.internal.registry.DefaultModelRegistry] Transitioning model element 'tasks.check' from state Registered to Initialized 14:32:03.263 [DEBUG] [org.gradle.model.internal.registry.DefaultModelRegistry] Running model element 'tasks.check' rule action tasks.addPlaceholderAction(check) 14:32:03.284 [DEBUG] [org.gradle.model.internal.registry.DefaultModelRegistry] Mutating tasks.check using tasks.addPlaceholderAction(check) 14:32:03.307 [DEBUG] [org.gradle.model.internal.registry.DefaultModelRegistry] Transitioning model element 'tasks.check' to state Discovered. 14:32:03.328 [DEBUG] [org.gradle.model.internal.registry.DefaultModelRegistry] Running model element 'tasks.check' rule action tasks.addPlaceholderAction(check) 14:32:03.351 [DEBUG] [org.gradle.model.internal.registry.DefaultModelRegistry] Mutating tasks.check using tasks.addPlaceholderAction(check) 14:32:03.371 [DEBUG] [org.gradle.model.internal.registry.DefaultModelRegistry] Transitioning model element 'tasks.check' to state Created. 14:32:03.396 [DEBUG] [org.gradle.model.internal.registry.DefaultModelRegistry] Transitioning model element 'tasks.check' to state DefaultsApplied. 14:32:03.415 [DEBUG] [org.gradle.model.internal.registry.DefaultModelRegistry] Running model element 'tasks.check' rule action copyToTaskContainer 14:32:03.432 [DEBUG] [org.gradle.model.internal.registry.DefaultModelRegistry] Mutating tasks.check using copyToTaskContainer 14:32:03.454 [DEBUG] [org.gradle.model.internal.registry.DefaultModelRegistry] Transitioning model element 'tasks.check' to state Initialized. 14:32:03.748 [DEBUG] [org.gradle.configuration.project.BuildScriptProcessor] Timing: Running the build script took 2.106 secs 14:32:03.768 [INFO] [org.gradle.api.Project] Parsing the SDK, no caching allowed 14:32:03.784 [DEBUG] [org.gradle.api.Project] SDK initialized in 1 ms 14:32:03.809 [DEBUG] [org.gradle.api.internal.artifacts.ivyservice.resolveengine.DefaultArtifactDependencyResolver] Resolving configuration ':lib:_debugCompile' 14:32:03.832 [DEBUG] [org.gradle.api.internal.artifacts.ivyservice.ivyresolve.memcache.InMemoryCachedRepositoryFactory] Reusing in-memory cache for repo 'BintrayJCenter' [22da77b0d76ea8df17298218f3ec1f87]. 14:32:03.854 [DEBUG] [org.gradle.api.internal.artifacts.ivyservice.ivyresolve.memcache.InMemoryCachedRepositoryFactory] Creating new in-memory cache for repo 'MavenRepo' [4471c3b2f5ea2d40ffaa8b3948cdbacd]. 14:32:03.882 [DEBUG] [org.gradle.api.internal.artifacts.ivyservice.ivyresolve.memcache.InMemoryCachedRepositoryFactory] Creating new in-memory cache for repo 'maven' [d15538bd59e61aebad3eb4c485d5b49a]. 14:32:03.908 [DEBUG] [org.gradle.api.internal.artifacts.ivyservice.ivyresolve.memcache.InMemoryCachedRepositoryFactory] Creating new in-memory cache for repo 'maven2' [d5fcb9b240c54981ee59282cb1c54fd4]. 14:32:03.931 [DEBUG] [org.gradle.api.internal.artifacts.ivyservice.resolveengine.graph.DependencyGraphBuilder] Visiting configuration Scripto:lib:unspecified(_debugCompile). 14:32:03.957 [DEBUG] [org.gradle.api.internal.artifacts.ivyservice.resolveengine.graph.DependencyGraphBuilder] Visiting dependency Scripto:lib:unspecified(_debugCompile) -> com.google.code.gson:gson:2.7(compile) 14:32:03.978 [DEBUG] [org.gradle.api.internal.artifacts.ivyservice.resolveengine.graph.DependencyGraphBuilder] Selecting new module version com.google.code.gson:gson:2.7 14:32:03.997 [DEBUG] [org.gradle.api.internal.artifacts.ivyservice.ivyresolve.RepositoryChainComponentMetaDataResolver] Attempting to resolve component for com.google.code.gson:gson:2.7 using repositories [BintrayJCe nter, MavenRepo, maven, maven2] 14:32:04.027 [DEBUG] [org.gradle.api.internal.artifacts.ivyservice.ivyresolve.parser.IvyXmlModuleDescriptorParser] post 1.3 ivy file: using exact as default matcher 14:32:04.052 [DEBUG] [org.gradle.api.internal.artifacts.ivyservice.ivyresolve.CachingModuleComponentRepository] Using cached module metadata for module 'com.google.code.gson:gson:2.7' in 'BintrayJCenter' 14:32:04.073 [DEBUG] [org.gradle.api.internal.artifacts.ivyservice.ivyresolve.RepositoryChainComponentMetaDataResolver] Using com.google.code.gson:gson:2.7 from Maven repository 'BintrayJCenter' 14:32:04.098 [DEBUG] [org.gradle.api.internal.artifacts.ivyservice.resolveengine.graph.DependencyGraphBuilder] Visiting configuration com.google.code.gson:gson:2.7(default). 14:32:04.124 [DEBUG] [org.gradle.api.internal.artifacts.ivyservice.resolveengine.oldresult.TransientConfigurationResultsBuilder] Flushing resolved configuration data in Binary store in C:\Users\Admin\AppData\Local\Te mp\gradle322565546295813176.bin. Wrote root Scripto:lib:unspecified:_debugCompile. 14:32:04.155 [DEBUG] [org.gradle.api.internal.artifacts.ivyservice.resolveengine.DefaultArtifactDependencyResolver] Resolving configuration ':lib:_debugPublish' 14:32:04.179 [DEBUG] [org.gradle.api.internal.artifacts.ivyservice.ivyresolve.memcache.InMemoryCachedRepositoryFactory] Reusing in-memory cache for repo 'BintrayJCenter' [22da77b0d76ea8df17298218f3ec1f87]. 14:32:04.202 [DEBUG] [org.gradle.api.internal.artifacts.ivyservice.ivyresolve.memcache.InMemoryCachedRepositoryFactory] Reusing in-memory cache for repo 'MavenRepo' [4471c3b2f5ea2d40ffaa8b3948cdbacd]. 14:32:04.230 [DEBUG] [org.gradle.api.internal.artifacts.ivyservice.ivyresolve.memcache.InMemoryCachedRepositoryFactory] Reusing in-memory cache for repo 'maven' [d15538bd59e61aebad3eb4c485d5b49a]. 14:32:04.249 [DEBUG] [org.gradle.api.internal.artifacts.ivyservice.ivyresolve.memcache.InMemoryCachedRepositoryFactory] Reusing in-memory cache for repo 'maven2' [d5fcb9b240c54981ee59282cb1c54fd4]. 14:32:04.275 [DEBUG] [org.gradle.api.internal.artifacts.ivyservice.resolveengine.graph.DependencyGraphBuilder] Visiting configuration Scripto:lib:unspecified(_debugPublish). 14:32:04.296 [DEBUG] [org.gradle.api.internal.artifacts.ivyservice.resolveengine.graph.DependencyGraphBuilder] Visiting dependency Scripto:lib:unspecified(_debugPublish) -> com.google.code.gson:gson:2.7(compile) 14:32:04.318 [DEBUG] [org.gradle.api.internal.artifacts.ivyservice.resolveengine.graph.DependencyGraphBuilder] Selecting new module version com.google.code.gson:gson:2.7 14:32:04.339 [DEBUG] [org.gradle.api.internal.artifacts.ivyservice.ivyresolve.RepositoryChainComponentMetaDataResolver] Attempting to resolve component for com.google.code.gson:gson:2.7 using repositories [BintrayJCe nter, MavenRepo, maven, maven2] 14:32:04.362 [DEBUG] [org.gradle.api.internal.artifacts.ivyservice.ivyresolve.RepositoryChainComponentMetaDataResolver] Using com.google.code.gson:gson:2.7 from Maven repository 'BintrayJCenter' 14:32:04.389 [DEBUG] [org.gradle.api.internal.artifacts.ivyservice.resolveengine.graph.DependencyGraphBuilder] Visiting configuration com.google.code.gson:gson:2.7(default). 14:32:04.412 [DEBUG] [org.gradle.api.internal.artifacts.ivyservice.resolveengine.oldresult.TransientConfigurationResultsBuilder] Flushing resolved configuration data in Binary store in C:\Users\Admin\AppData\Local\Te mp\gradle322565546295813176.bin. Wrote root Scripto:lib:unspecified:_debugPublish. 14:32:04.449 [DEBUG] [org.gradle.api.internal.artifacts.ivyservice.resolveengine.result.StreamingResolutionResultBuilder$RootFactory] Loaded resolution results (0.005 secs) from Binary store in C:\Users\Admin\AppData \Local\Temp\gradle25031831863047105.bin (exist: true) 14:32:04.477 [DEBUG] [org.gradle.api.internal.artifacts.ivyservice.ivyresolve.CachingModuleComponentRepository] Found artifact 'gson.jar (com.google.code.gson:gson:2.7)' in resolver cache: C:\Users\Admin\.gradle\cach es\modules-2\files-2.1\com.google.code.gson\gson\2.7\751f548c85fa49f330cecbb1875893f971b33c4e\gson-2.7.jar 14:32:04.500 [DEBUG] [org.gradle.api.internal.artifacts.ivyservice.resolveengine.result.StreamingResolutionResultBuilder$RootFactory] Loaded resolution results (0.001 secs) from Binary store in C:\Users\Admin\AppData \Local\Temp\gradle25031831863047105.bin (exist: true) 14:32:04.534 [DEBUG] [org.gradle.api.internal.artifacts.ivyservice.resolveengine.DefaultArtifactDependencyResolver] Resolving configuration ':lib:_releaseCompile' 14:32:04.559 [DEBUG] [org.gradle.api.internal.artifacts.ivyservice.ivyresolve.memcache.InMemoryCachedRepositoryFactory] Reusing in-memory cache for repo 'BintrayJCenter' [22da77b0d76ea8df17298218f3ec1f87]. 14:32:04.624 [DEBUG] [org.gradle.api.internal.artifacts.ivyservice.ivyresolve.memcache.InMemoryCachedRepositoryFactory] Reusing in-memory cache for repo 'MavenRepo' [4471c3b2f5ea2d40ffaa8b3948cdbacd]. 14:32:04.651 [DEBUG] [org.gradle.api.internal.artifacts.ivyservice.ivyresolve.memcache.InMemoryCachedRepositoryFactory] Reusing in-memory cache for repo 'maven' [d15538bd59e61aebad3eb4c485d5b49a]. 14:32:04.676 [DEBUG] [org.gradle.api.internal.artifacts.ivyservice.ivyresolve.memcache.InMemoryCachedRepositoryFactory] Reusing in-memory cache for repo 'maven2' [d5fcb9b240c54981ee59282cb1c54fd4]. 14:32:04.703 [DEBUG] [org.gradle.api.internal.artifacts.ivyservice.resolveengine.graph.DependencyGraphBuilder] Visiting configuration Scripto:lib:unspecified(_releaseCompile). 14:32:04.725 [DEBUG] [org.gradle.api.internal.artifacts.ivyservice.resolveengine.graph.DependencyGraphBuilder] Visiting dependency Scripto:lib:unspecified(_releaseCompile) -> com.google.code.gson:gson:2.7(compile) 14:32:04.747 [DEBUG] [org.gradle.api.internal.artifacts.ivyservice.resolveengine.graph.DependencyGraphBuilder] Selecting new module version com.google.code.gson:gson:2.7 14:32:04.762 [DEBUG] [org.gradle.api.internal.artifacts.ivyservice.ivyresolve.RepositoryChainComponentMetaDataResolver] Attempting to resolve component for com.google.code.gson:gson:2.7 using repositories [BintrayJCe nter, MavenRepo, maven, maven2] 14:32:04.783 [DEBUG] [org.gradle.api.internal.artifacts.ivyservice.ivyresolve.RepositoryChainComponentMetaDataResolver] Using com.google.code.gson:gson:2.7 from Maven repository 'BintrayJCenter' 14:32:04.805 [DEBUG] [org.gradle.api.internal.artifacts.ivyservice.resolveengine.graph.DependencyGraphBuilder] Visiting configuration com.google.code.gson:gson:2.7(default). 14:32:04.828 [DEBUG] [org.gradle.api.internal.artifacts.ivyservice.resolveengine.oldresult.TransientConfigurationResultsBuilder] Flushing resolved configuration data in Binary store in C:\Users\Admin\AppData\Local\Te mp\gradle322565546295813176.bin. Wrote root Scripto:lib:unspecified:_releaseCompile. 14:32:04.853 [DEBUG] [org.gradle.api.internal.artifacts.ivyservice.resolveengine.DefaultArtifactDependencyResolver] Resolving configuration ':lib:_releasePublish' 14:32:04.878 [DEBUG] [org.gradle.api.internal.artifacts.ivyservice.ivyresolve.memcache.InMemoryCachedRepositoryFactory] Reusing in-memory cache for repo 'BintrayJCenter' [22da77b0d76ea8df17298218f3ec1f87]. 14:32:04.898 [DEBUG] [org.gradle.api.internal.artifacts.ivyservice.ivyresolve.memcache.InMemoryCachedRepositoryFactory] Reusing in-memory cache for repo 'MavenRepo' [4471c3b2f5ea2d40ffaa8b3948cdbacd]. 14:32:04.921 [DEBUG] [org.gradle.api.internal.artifacts.ivyservice.ivyresolve.memcache.InMemoryCachedRepositoryFactory] Reusing in-memory cache for repo 'maven' [d15538bd59e61aebad3eb4c485d5b49a]. 14:32:04.947 [DEBUG] [org.gradle.api.internal.artifacts.ivyservice.ivyresolve.memcache.InMemoryCachedRepositoryFactory] Reusing in-memory cache for repo 'maven2' [d5fcb9b240c54981ee59282cb1c54fd4]. 14:32:04.971 [DEBUG] [org.gradle.api.internal.artifacts.ivyservice.resolveengine.graph.DependencyGraphBuilder] Visiting configuration Scripto:lib:unspecified(_releasePublish). 14:32:04.997 [DEBUG] [org.gradle.api.internal.artifacts.ivyservice.resolveengine.graph.DependencyGraphBuilder] Visiting dependency Scripto:lib:unspecified(_releasePublish) -> com.google.code.gson:gson:2.7(compile) 14:32:05.018 [DEBUG] [org.gradle.api.internal.artifacts.ivyservice.resolveengine.graph.DependencyGraphBuilder] Selecting new module version com.google.code.gson:gson:2.7 14:32:05.035 [DEBUG] [org.gradle.api.internal.artifacts.ivyservice.ivyresolve.RepositoryChainComponentMetaDataResolver] Attempting to resolve component for com.google.code.gson:gson:2.7 using repositories [BintrayJCe nter, MavenRepo, maven, maven2] 14:32:05.056 [DEBUG] [org.gradle.api.internal.artifacts.ivyservice.ivyresolve.RepositoryChainComponentMetaDataResolver] Using com.google.code.gson:gson:2.7 from Maven repository 'BintrayJCenter' 14:32:05.074 [DEBUG] [org.gradle.api.internal.artifacts.ivyservice.resolveengine.graph.DependencyGraphBuilder] Visiting configuration com.google.code.gson:gson:2.7(default). 14:32:05.093 [DEBUG] [org.gradle.api.internal.artifacts.ivyservice.resolveengine.oldresult.TransientConfigurationResultsBuilder] Flushing resolved configuration data in Binary store in C:\Users\Admin\AppData\Local\Te mp\gradle322565546295813176.bin. Wrote root Scripto:lib:unspecified:_releasePublish. 14:32:05.116 [DEBUG] [org.gradle.api.internal.artifacts.ivyservice.resolveengine.result.StreamingResolutionResultBuilder$RootFactory] Loaded resolution results (0.0 secs) from Binary store in C:\Users\Admin\AppData\L ocal\Temp\gradle25031831863047105.bin (exist: true) 14:32:05.140 [DEBUG] [org.gradle.api.internal.artifacts.ivyservice.resolveengine.result.StreamingResolutionResultBuilder$RootFactory] Loaded resolution results (0.0 secs) from Binary store in C:\Users\Admin\AppData\L ocal\Temp\gradle25031831863047105.bin (exist: true) 14:32:05.827 [DEBUG] [com.android.build.gradle.internal.pipeline.TransformManager] ADDED TRANSFORM(debug): 14:32:05.848 [DEBUG] [com.android.build.gradle.internal.pipeline.TransformManager] Name: mergeJavaRes 14:32:05.868 [DEBUG] [com.android.build.gradle.internal.pipeline.TransformManager] Task: transformResourcesWithMergeJavaResForDebug 14:32:05.890 [DEBUG] [com.android.build.gradle.internal.pipeline.TransformManager] InputStream: OriginalStream{jarFiles=[], folders=[], scopes=[PROJECT_LOCAL_DEPS], contentTypes=[RESOURCES], dependencies=[]} 14:32:05.913 [DEBUG] [com.android.build.gradle.internal.pipeline.TransformManager] InputStream: OriginalStream{jarFiles=[], folders=[E:\Mahach\AndroidDeveloment\Wokspaces\github\Scripto\lib\build\intermediates\s ourceFolderJavaResources\debug], scopes=[PROJECT], contentTypes=[RESOURCES], dependencies=[processDebugJavaRes]} 14:32:05.934 [DEBUG] [com.android.build.gradle.internal.pipeline.TransformManager] OutputStream: IntermediateStream{rootLocation=E:\Mahach\AndroidDeveloment\Wokspaces\github\Scripto\lib\build\intermediates\trans forms\mergeJavaRes\debug, scopes=[PROJECT, PROJECT_LOCAL_DEPS], contentTypes=[RESOURCES], dependencies=[transformResourcesWithMergeJavaResForDebug]} 14:32:06.137 [INFO] [com.android.build.gradle.tasks.factory.JavaCompileConfigAction] Using incremental javac compilation. 14:32:06.158 [LIFECYCLE] [org.gradle.util.DeprecationLogger] Incremental java compilation is an incubating feature. 14:32:06.244 [DEBUG] [com.android.build.gradle.internal.pipeline.TransformManager] ADDED TRANSFORM(debug): 14:32:06.265 [DEBUG] [com.android.build.gradle.internal.pipeline.TransformManager] Name: mergeJniLibs 14:32:06.283 [DEBUG] [com.android.build.gradle.internal.pipeline.TransformManager] Task: transformNative_libsWithMergeJniLibsForDebug 14:32:06.305 [DEBUG] [com.android.build.gradle.internal.pipeline.TransformManager] InputStream: OriginalStream{jarFiles=[], folders=[], scopes=[PROJECT_LOCAL_DEPS], contentTypes=[NATIVE_LIBS], dependencies=[]} 14:32:06.327 [DEBUG] [com.android.build.gradle.internal.pipeline.TransformManager] InputStream: OriginalStream{jarFiles=[], folders=[E:\Mahach\AndroidDeveloment\Wokspaces\github\Scripto\lib\build\intermediates\j niLibs\debug], scopes=[PROJECT], contentTypes=[NATIVE_LIBS], dependencies=[mergeDebugJniLibFolders]} 14:32:06.344 [DEBUG] [com.android.build.gradle.internal.pipeline.TransformManager] InputStream: OriginalStream{jarFiles=[], folders=[E:\Mahach\AndroidDeveloment\Wokspaces\github\Scripto\lib\build\intermediates\n dk\debug\lib], scopes=[PROJECT], contentTypes=[NATIVE_LIBS], dependencies=[[task ':lib:compileDebugNdk']]} 14:32:06.363 [DEBUG] [com.android.build.gradle.internal.pipeline.TransformManager] OutputStream: IntermediateStream{rootLocation=E:\Mahach\AndroidDeveloment\Wokspaces\github\Scripto\lib\build\intermediates\trans forms\mergeJniLibs\debug, scopes=[PROJECT, PROJECT_LOCAL_DEPS], contentTypes=[NATIVE_LIBS], dependencies=[transformNative_libsWithMergeJniLibsForDebug]} 14:32:06.551 [DEBUG] [com.android.build.gradle.internal.pipeline.TransformManager] ADDED TRANSFORM(debug): 14:32:06.569 [DEBUG] [com.android.build.gradle.internal.pipeline.TransformManager] Name: syncLibJars 14:32:06.588 [DEBUG] [com.android.build.gradle.internal.pipeline.TransformManager] Task: transformClassesAndResourcesWithSyncLibJarsForDebug 14:32:06.604 [DEBUG] [com.android.build.gradle.internal.pipeline.TransformManager] Ref'edStream: OriginalStream{jarFiles=[], folders=[], scopes=[PROJECT_LOCAL_DEPS], contentTypes=[CLASSES], dependencies=[]} 14:32:06.622 [DEBUG] [com.android.build.gradle.internal.pipeline.TransformManager] Ref'edStream: IntermediateStream{rootLocation=E:\Mahach\AndroidDeveloment\Wokspaces\github\Scripto\lib\build\intermediates\trans forms\mergeJavaRes\debug, scopes=[PROJECT, PROJECT_LOCAL_DEPS], contentTypes=[RESOURCES], dependencies=[transformResourcesWithMergeJavaResForDebug]} 14:32:06.640 [DEBUG] [com.android.build.gradle.internal.pipeline.TransformManager] Ref'edStream: OriginalStream{jarFiles=[], folders=[E:\Mahach\AndroidDeveloment\Wokspaces\github\Scripto\lib\build\intermediates\ classes\debug], scopes=[PROJECT], contentTypes=[CLASSES], dependencies=[compileDebugJavaWithJavac]} 14:32:06.662 [DEBUG] [com.android.build.gradle.internal.pipeline.TransformManager] ADDED TRANSFORM(debug): 14:32:06.693 [DEBUG] [com.android.build.gradle.internal.pipeline.TransformManager] Name: syncJniLibs 14:32:06.714 [DEBUG] [com.android.build.gradle.internal.pipeline.TransformManager] Task: transformNative_libsWithSyncJniLibsForDebug 14:32:06.732 [DEBUG] [com.android.build.gradle.internal.pipeline.TransformManager] Ref'edStream: IntermediateStream{rootLocation=E:\Mahach\AndroidDeveloment\Wokspaces\github\Scripto\lib\build\intermediates\trans forms\mergeJniLibs\debug, scopes=[PROJECT, PROJECT_LOCAL_DEPS], contentTypes=[NATIVE_LIBS], dependencies=[transformNative_libsWithMergeJniLibsForDebug]} 14:32:06.806 [DEBUG] [org.gradle.api.internal.artifacts.ivyservice.resolveengine.DefaultArtifactDependencyResolver] Resolving configuration ':lib:_debugUnitTestCompile' 14:32:06.829 [DEBUG] [org.gradle.api.internal.artifacts.ivyservice.ivyresolve.memcache.InMemoryCachedRepositoryFactory] Reusing in-memory cache for repo 'BintrayJCenter' [22da77b0d76ea8df17298218f3ec1f87]. 14:32:06.856 [DEBUG] [org.gradle.api.internal.artifacts.ivyservice.ivyresolve.memcache.InMemoryCachedRepositoryFactory] Reusing in-memory cache for repo 'MavenRepo' [4471c3b2f5ea2d40ffaa8b3948cdbacd]. 14:32:06.874 [DEBUG] [org.gradle.api.internal.artifacts.ivyservice.ivyresolve.memcache.InMemoryCachedRepositoryFactory] Reusing in-memory cache for repo 'maven' [d15538bd59e61aebad3eb4c485d5b49a]. 14:32:06.900 [DEBUG] [org.gradle.api.internal.artifacts.ivyservice.ivyresolve.memcache.InMemoryCachedRepositoryFactory] Reusing in-memory cache for repo 'maven2' [d5fcb9b240c54981ee59282cb1c54fd4]. 14:32:06.926 [DEBUG] [org.gradle.api.internal.artifacts.ivyservice.resolveengine.graph.DependencyGraphBuilder] Visiting configuration Scripto:lib:unspecified(_debugUnitTestCompile). 14:32:06.949 [DEBUG] [org.gradle.api.internal.artifacts.ivyservice.resolveengine.graph.DependencyGraphBuilder] Visiting dependency Scripto:lib:unspecified(_debugUnitTestCompile) -> com.google.code.gson:gson:2.7(compi le) 14:32:06.969 [DEBUG] [org.gradle.api.internal.artifacts.ivyservice.resolveengine.graph.DependencyGraphBuilder] Selecting new module version com.google.code.gson:gson:2.7 14:32:06.988 [DEBUG] [org.gradle.api.internal.artifacts.ivyservice.ivyresolve.RepositoryChainComponentMetaDataResolver] Attempting to resolve component for com.google.code.gson:gson:2.7 using repositories [BintrayJCe nter, MavenRepo, maven, maven2] 14:32:07.013 [DEBUG] [org.gradle.api.internal.artifacts.ivyservice.ivyresolve.RepositoryChainComponentMetaDataResolver] Using com.google.code.gson:gson:2.7 from Maven repository 'BintrayJCenter' 14:32:07.031 [DEBUG] [org.gradle.api.internal.artifacts.ivyservice.resolveengine.graph.DependencyGraphBuilder] Visiting dependency Scripto:lib:unspecified(_debugUnitTestCompile) -> junit:junit:4.12(testCompile) 14:32:07.053 [DEBUG] [org.gradle.api.internal.artifacts.ivyservice.resolveengine.graph.DependencyGraphBuilder] Selecting new module version junit:junit:4.12 14:32:07.075 [DEBUG] [org.gradle.api.internal.artifacts.ivyservice.ivyresolve.RepositoryChainComponentMetaDataResolver] Attempting to resolve component for junit:junit:4.12 using repositories [BintrayJCenter, MavenRe po, maven, maven2] 14:32:07.100 [DEBUG] [org.gradle.api.internal.artifacts.ivyservice.ivyresolve.parser.IvyXmlModuleDescriptorParser] post 1.3 ivy file: using exact as default matcher 14:32:07.121 [DEBUG] [org.gradle.api.internal.artifacts.ivyservice.ivyresolve.CachingModuleComponentRepository] Using cached module metadata for module 'junit:junit:4.12' in 'BintrayJCenter' 14:32:07.144 [DEBUG] [org.gradle.api.internal.artifacts.ivyservice.ivyresolve.RepositoryChainComponentMetaDataResolver] Using junit:junit:4.12 from Maven repository 'BintrayJCenter' 14:32:07.166 [DEBUG] [org.gradle.api.internal.artifacts.ivyservice.resolveengine.graph.DependencyGraphBuilder] Visiting dependency Scripto:lib:unspecified(_debugUnitTestCompile) -> org.hamcrest:hamcrest-core:1.3(test Compile) 14:32:07.184 [DEBUG] [org.gradle.api.internal.artifacts.ivyservice.resolveengine.graph.DependencyGraphBuilder] Selecting new module version org.hamcrest:hamcrest-core:1.3 14:32:07.206 [DEBUG] [org.gradle.api.internal.artifacts.ivyservice.ivyresolve.RepositoryChainComponentMetaDataResolver] Attempting to resolve component for org.hamcrest:hamcrest-core:1.3 using repositories [BintrayJC enter, MavenRepo, maven, maven2] 14:32:07.240 [DEBUG] [org.gradle.api.internal.artifacts.ivyservice.ivyresolve.parser.IvyXmlModuleDescriptorParser] post 1.3 ivy file: using exact as default matcher 14:32:07.261 [DEBUG] [org.gradle.api.internal.artifacts.ivyservice.ivyresolve.CachingModuleComponentRepository] Using cached module metadata for module 'org.hamcrest:hamcrest-core:1.3' in 'BintrayJCenter' 14:32:07.279 [DEBUG] [org.gradle.api.internal.artifacts.ivyservice.ivyresolve.RepositoryChainComponentMetaDataResolver] Using org.hamcrest:hamcrest-core:1.3 from Maven repository 'BintrayJCenter' 14:32:07.301 [DEBUG] [org.gradle.api.internal.artifacts.ivyservice.resolveengine.graph.DependencyGraphBuilder] Visiting dependency Scripto:lib:unspecified(_debugUnitTestCompile) -> org.hamcrest:hamcrest-library:1.3(t estCompile) 14:32:07.320 [DEBUG] [org.gradle.api.internal.artifacts.ivyservice.resolveengine.graph.DependencyGraphBuilder] Selecting new module version org.hamcrest:hamcrest-library:1.3 14:32:07.342 [DEBUG] [org.gradle.api.internal.artifacts.ivyservice.ivyresolve.RepositoryChainComponentMetaDataResolver] Attempting to resolve component for org.hamcrest:hamcrest-library:1.3 using repositories [Bintra yJCenter, MavenRepo, maven, maven2] 14:32:07.375 [DEBUG] [org.gradle.api.internal.artifacts.ivyservice.ivyresolve.parser.IvyXmlModuleDescriptorParser] post 1.3 ivy file: using exact as default matcher 14:32:07.400 [DEBUG] [org.gradle.api.internal.artifacts.ivyservice.ivyresolve.CachingModuleComponentRepository] Using cached module metadata for module 'org.hamcrest:hamcrest-library:1.3' in 'BintrayJCenter' 14:32:07.424 [DEBUG] [org.gradle.api.internal.artifacts.ivyservice.ivyresolve.RepositoryChainComponentMetaDataResolver] Using org.hamcrest:hamcrest-library:1.3 from Maven repository 'BintrayJCenter' 14:32:07.445 [DEBUG] [org.gradle.api.internal.artifacts.ivyservice.resolveengine.graph.DependencyGraphBuilder] Visiting dependency Scripto:lib:unspecified(_debugUnitTestCompile) -> org.hamcrest:hamcrest-integration:1 .3(testCompile) 14:32:07.464 [DEBUG] [org.gradle.api.internal.artifacts.ivyservice.resolveengine.graph.DependencyGraphBuilder] Selecting new module version org.hamcrest:hamcrest-integration:1.3 14:32:07.484 [DEBUG] [org.gradle.api.internal.artifacts.ivyservice.ivyresolve.RepositoryChainComponentMetaDataResolver] Attempting to resolve component for org.hamcrest:hamcrest-integration:1.3 using repositories [Bi ntrayJCenter, MavenRepo, maven, maven2] 14:32:07.508 [DEBUG] [org.gradle.api.internal.artifacts.ivyservice.ivyresolve.parser.IvyXmlModuleDescriptorParser] post 1.3 ivy file: using exact as default matcher 14:32:07.535 [DEBUG] [org.gradle.api.internal.artifacts.ivyservice.ivyresolve.CachingModuleComponentRepository] Using cached module metadata for module 'org.hamcrest:hamcrest-integration:1.3' in 'BintrayJCenter' 14:32:07.556 [DEBUG] [org.gradle.api.internal.artifacts.ivyservice.ivyresolve.RepositoryChainComponentMetaDataResolver] Using org.hamcrest:hamcrest-integration:1.3 from Maven repository 'BintrayJCenter' 14:32:07.578 [DEBUG] [org.gradle.api.internal.artifacts.ivyservice.resolveengine.graph.DependencyGraphBuilder] Visiting dependency Scripto:lib:unspecified(_debugUnitTestCompile) -> org.mockito:mockito-core:1.10.19(te stCompile) 14:32:07.604 [DEBUG] [org.gradle.api.internal.artifacts.ivyservice.resolveengine.graph.DependencyGraphBuilder] Selecting new module version org.mockito:mockito-core:1.10.19 14:32:07.627 [DEBUG] [org.gradle.api.internal.artifacts.ivyservice.ivyresolve.RepositoryChainComponentMetaDataResolver] Attempting to resolve component for org.mockito:mockito-core:1.10.19 using repositories [Bintray JCenter, MavenRepo, maven, maven2] 14:32:07.656 [DEBUG] [org.gradle.api.internal.artifacts.ivyservice.ivyresolve.parser.IvyXmlModuleDescriptorParser] post 1.3 ivy file: using exact as default matcher 14:32:07.684 [DEBUG] [org.gradle.api.internal.artifacts.ivyservice.ivyresolve.CachingModuleComponentRepository] Using cached module metadata for module 'org.mockito:mockito-core:1.10.19' in 'BintrayJCenter' 14:32:07.709 [DEBUG] [org.gradle.api.internal.artifacts.ivyservice.ivyresolve.RepositoryChainComponentMetaDataResolver] Using org.mockito:mockito-core:1.10.19 from Maven repository 'BintrayJCenter' 14:32:07.731 [DEBUG] [org.gradle.api.internal.artifacts.ivyservice.resolveengine.graph.DependencyGraphBuilder] Visiting dependency Scripto:lib:unspecified(_debugUnitTestCompile) -> org.robolectric:robolectric:3.0(tes tCompile) 14:32:07.750 [DEBUG] [org.gradle.api.internal.artifacts.ivyservice.resolveengine.graph.DependencyGraphBuilder] Selecting new module version org.robolectric:robolectric:3.0 14:32:07.771 [DEBUG] [org.gradle.api.internal.artifacts.ivyservice.ivyresolve.RepositoryChainComponentMetaDataResolver] Attempting to resolve component for org.robolectric:robolectric:3.0 using repositories [BintrayJ Center, MavenRepo, maven, maven2] 14:32:07.797 [DEBUG] [org.gradle.api.internal.artifacts.ivyservice.ivyresolve.parser.IvyXmlModuleDescriptorParser] post 1.3 ivy file: using exact as default matcher 14:32:07.828 [DEBUG] [org.gradle.api.internal.artifacts.ivyservice.ivyresolve.CachingModuleComponentRepository] Using cached module metadata for module 'org.robolectric:robolectric:3.0' in 'BintrayJCenter' 14:32:07.850 [DEBUG] [org.gradle.api.internal.artifacts.ivyservice.ivyresolve.RepositoryChainComponentMetaDataResolver] Using org.robolectric:robolectric:3.0 from Maven repository 'BintrayJCenter' 14:32:07.868 [DEBUG] [org.gradle.api.internal.artifacts.ivyservice.resolveengine.graph.DependencyGraphBuilder] Visiting configuration com.google.code.gson:gson:2.7(default). 14:32:07.885 [DEBUG] [org.gradle.api.internal.artifacts.ivyservice.resolveengine.graph.DependencyGraphBuilder] Visiting configuration junit:junit:4.12(default). 14:32:07.900 [DEBUG] [org.gradle.api.internal.artifacts.ivyservice.resolveengine.graph.DependencyGraphBuilder] Visiting dependency junit:junit:4.12(default) -> org.hamcrest:hamcrest-core:1.3(compile,runtime) 14:32:07.919 [DEBUG] [org.gradle.api.internal.artifacts.ivyservice.resolveengine.graph.DependencyGraphBuilder] Visiting configuration org.hamcrest:hamcrest-core:1.3(default). 14:32:07.941 [DEBUG] [org.gradle.api.internal.artifacts.ivyservice.resolveengine.graph.DependencyGraphBuilder] Visiting configuration org.hamcrest:hamcrest-library:1.3(default). 14:32:07.961 [DEBUG] [org.gradle.api.internal.artifacts.ivyservice.resolveengine.graph.DependencyGraphBuilder] Visiting dependency org.hamcrest:hamcrest-library:1.3(default) -> org.hamcrest:hamcrest-core:1.3(compile, runtime) 14:32:07.980 [DEBUG] [org.gradle.api.internal.artifacts.ivyservice.resolveengine.graph.DependencyGraphBuilder] Visiting configuration org.hamcrest:hamcrest-integration:1.3(default). 14:32:08.002 [DEBUG] [org.gradle.api.internal.artifacts.ivyservice.resolveengine.graph.DependencyGraphBuilder] Visiting dependency org.hamcrest:hamcrest-integration:1.3(default) -> org.hamcrest:hamcrest-library:1.3(c ompile,runtime) 14:32:08.025 [DEBUG] [org.gradle.api.internal.artifacts.ivyservice.resolveengine.graph.DependencyGraphBuilder] Visiting configuration org.mockito:mockito-core:1.10.19(default). 14:32:08.046 [DEBUG] [org.gradle.api.internal.artifacts.ivyservice.resolveengine.graph.DependencyGraphBuilder] Visiting dependency org.mockito:mockito-core:1.10.19(default) -> org.hamcrest:hamcrest-core:1.1(runtime) 14:32:08.064 [DEBUG] [org.gradle.api.internal.artifacts.ivyservice.resolveengine.graph.DependencyGraphBuilder] Found new conflicting module version org.hamcrest:hamcrest-core:1.1 14:32:08.083 [DEBUG] [org.gradle.api.internal.artifacts.ivyservice.resolveengine.graph.DependencyGraphBuilder] Visiting dependency org.mockito:mockito-core:1.10.19(default) -> org.objenesis:objenesis:2.1(runtime) 14:32:08.103 [DEBUG] [org.gradle.api.internal.artifacts.ivyservice.resolveengine.graph.DependencyGraphBuilder] Selecting new module version org.objenesis:objenesis:2.1 14:32:08.123 [DEBUG] [org.gradle.api.internal.artifacts.ivyservice.ivyresolve.RepositoryChainComponentMetaDataResolver] Attempting to resolve component for org.objenesis:objenesis:2.1 using repositories [BintrayJCent er, MavenRepo, maven, maven2] 14:32:08.149 [DEBUG] [org.gradle.api.internal.artifacts.ivyservice.ivyresolve.parser.IvyXmlModuleDescriptorParser] post 1.3 ivy file: using exact as default matcher 14:32:08.178 [DEBUG] [org.gradle.api.internal.artifacts.ivyservice.ivyresolve.CachingModuleComponentRepository] Using cached module metadata for module 'org.objenesis:objenesis:2.1' in 'BintrayJCenter' 14:32:08.201 [DEBUG] [org.gradle.api.internal.artifacts.ivyservice.ivyresolve.RepositoryChainComponentMetaDataResolver] Using org.objenesis:objenesis:2.1 from Maven repository 'BintrayJCenter' 14:32:08.225 [DEBUG] [org.gradle.api.internal.artifacts.ivyservice.resolveengine.graph.DependencyGraphBuilder] Visiting configuration org.robolectric:robolectric:3.0(default). 14:32:08.245 [DEBUG] [org.gradle.api.internal.artifacts.ivyservice.resolveengine.graph.DependencyGraphBuilder] Visiting dependency org.robolectric:robolectric:3.0(default) -> junit:junit:4.8.2(compile,runtime) 14:32:08.265 [DEBUG] [org.gradle.api.internal.artifacts.ivyservice.resolveengine.graph.DependencyGraphBuilder] Found new conflicting module version junit:junit:4.8.2 14:32:08.289 [DEBUG] [org.gradle.api.internal.artifacts.ivyservice.resolveengine.graph.DependencyGraphBuilder] Visiting dependency org.robolectric:robolectric:3.0(default) -> org.robolectric:robolectric-annotations:3 .0(compile,runtime) 14:32:08.303 [DEBUG] [org.gradle.api.internal.artifacts.ivyservice.resolveengine.graph.DependencyGraphBuilder] Selecting new module version org.robolectric:robolectric-annotations:3.0 14:32:08.324 [DEBUG] [org.gradle.api.internal.artifacts.ivyservice.ivyresolve.RepositoryChainComponentMetaDataResolver] Attempting to resolve component for org.robolectric:robolectric-annotations:3.0 using repositori es [BintrayJCenter, MavenRepo, maven, maven2] 14:32:08.354 [DEBUG] [org.gradle.api.internal.artifacts.ivyservice.ivyresolve.parser.IvyXmlModuleDescriptorParser] post 1.3 ivy file: using exact as default matcher 14:32:08.380 [DEBUG] [org.gradle.api.internal.artifacts.ivyservice.ivyresolve.CachingModuleComponentRepository] Using cached module metadata for module 'org.robolectric:robolectric-annotations:3.0' in 'BintrayJCenter ' 14:32:08.399 [DEBUG] [org.gradle.api.internal.artifacts.ivyservice.ivyresolve.RepositoryChainComponentMetaDataResolver] Using org.robolectric:robolectric-annotations:3.0 from Maven repository 'BintrayJCenter' 14:32:08.417 [DEBUG] [org.gradle.api.internal.artifacts.ivyservice.resolveengine.graph.DependencyGraphBuilder] Visiting dependency org.robolectric:robolectric:3.0(default) -> org.robolectric:robolectric-resources:3.0 (compile,runtime) 14:32:08.440 [DEBUG] [org.gradle.api.internal.artifacts.ivyservice.resolveengine.graph.DependencyGraphBuilder] Selecting new module version org.robolectric:robolectric-resources:3.0 14:32:08.462 [DEBUG] [org.gradle.api.internal.artifacts.ivyservice.ivyresolve.RepositoryChainComponentMetaDataResolver] Attempting to resolve component for org.robolectric:robolectric-resources:3.0 using repositories [BintrayJCenter, MavenRepo, maven, maven2] 14:32:08.485 [DEBUG] [org.gradle.api.internal.artifacts.ivyservice.ivyresolve.parser.IvyXmlModuleDescriptorParser] post 1.3 ivy file: using exact as default matcher 14:32:08.513 [DEBUG] [org.gradle.api.internal.artifacts.ivyservice.ivyresolve.CachingModuleComponentRepository] Using cached module metadata for module 'org.robolectric:robolectric-resources:3.0' in 'BintrayJCenter' 14:32:08.533 [DEBUG] [org.gradle.api.internal.artifacts.ivyservice.ivyresolve.RepositoryChainComponentMetaDataResolver] Using org.robolectric:robolectric-resources:3.0 from Maven repository 'BintrayJCenter' 14:32:08.554 [DEBUG] [org.gradle.api.internal.artifacts.ivyservice.resolveengine.graph.DependencyGraphBuilder] Visiting dependency org.robolectric:robolectric:3.0(default) -> org.robolectric:robolectric-utils:3.0(com pile,runtime) 14:32:08.571 [DEBUG] [org.gradle.api.internal.artifacts.ivyservice.resolveengine.graph.DependencyGraphBuilder] Selecting new module version org.robolectric:robolectric-utils:3.0 14:32:08.586 [DEBUG] [org.gradle.api.internal.artifacts.ivyservice.ivyresolve.RepositoryChainComponentMetaDataResolver] Attempting to resolve component for org.robolectric:robolectric-utils:3.0 using repositories [Bi ntrayJCenter, MavenRepo, maven, maven2] 14:32:08.611 [DEBUG] [org.gradle.api.internal.artifacts.ivyservice.ivyresolve.parser.IvyXmlModuleDescriptorParser] post 1.3 ivy file: using exact as default matcher 14:32:08.630 [DEBUG] [org.gradle.api.internal.artifacts.ivyservice.ivyresolve.CachingModuleComponentRepository] Using cached module metadata for module 'org.robolectric:robolectric-utils:3.0' in 'BintrayJCenter' 14:32:08.652 [DEBUG] [org.gradle.api.internal.artifacts.ivyservice.ivyresolve.RepositoryChainComponentMetaDataResolver] Using org.robolectric:robolectric-utils:3.0 from Maven repository 'BintrayJCenter' 14:32:08.674 [DEBUG] [org.gradle.api.internal.artifacts.ivyservice.resolveengine.graph.DependencyGraphBuilder] Visiting dependency org.robolectric:robolectric:3.0(default) -> org.robolectric:shadows-core:3.0(compile, runtime) 14:32:08.691 [DEBUG] [org.gradle.api.internal.artifacts.ivyservice.resolveengine.graph.DependencyGraphBuilder] Selecting new module version org.robolectric:shadows-core:3.0 14:32:08.710 [DEBUG] [org.gradle.api.internal.artifacts.ivyservice.ivyresolve.RepositoryChainComponentMetaDataResolver] Attempting to resolve component for org.robolectric:shadows-core:3.0 using repositories [Bintray JCenter, MavenRepo, maven, maven2] 14:32:08.737 [DEBUG] [org.gradle.api.internal.artifacts.ivyservice.ivyresolve.parser.IvyXmlModuleDescriptorParser] post 1.3 ivy file: using exact as default matcher 14:32:08.765 [DEBUG] [org.gradle.api.internal.artifacts.ivyservice.ivyresolve.CachingModuleComponentRepository] Using cached module metadata for module 'org.robolectric:shadows-core:3.0' in 'BintrayJCenter' 14:32:08.785 [DEBUG] [org.gradle.api.internal.artifacts.ivyservice.ivyresolve.RepositoryChainComponentMetaDataResolver] Using org.robolectric:shadows-core:3.0 from Maven repository 'BintrayJCenter' 14:32:08.807 [DEBUG] [org.gradle.api.internal.artifacts.ivyservice.resolveengine.graph.DependencyGraphBuilder] Visiting dependency org.robolectric:robolectric:3.0(default) -> org.bouncycastle:bcprov-jdk16:1.46(compil e,runtime) 14:32:08.827 [DEBUG] [org.gradle.api.internal.artifacts.ivyservice.resolveengine.graph.DependencyGraphBuilder] Selecting new module version org.bouncycastle:bcprov-jdk16:1.46 14:32:08.843 [DEBUG] [org.gradle.api.internal.artifacts.ivyservice.ivyresolve.RepositoryChainComponentMetaDataResolver] Attempting to resolve component for org.bouncycastle:bcprov-jdk16:1.46 using repositories [Bintr ayJCenter, MavenRepo, maven, maven2] 14:32:08.868 [DEBUG] [org.gradle.api.internal.artifacts.ivyservice.ivyresolve.parser.IvyXmlModuleDescriptorParser] post 1.3 ivy file: using exact as default matcher 14:32:08.893 [DEBUG] [org.gradle.api.internal.artifacts.ivyservice.ivyresolve.CachingModuleComponentRepository] Using cached module metadata for module 'org.bouncycastle:bcprov-jdk16:1.46' in 'BintrayJCenter' 14:32:08.918 [DEBUG] [org.gradle.api.internal.artifacts.ivyservice.ivyresolve.RepositoryChainComponentMetaDataResolver] Using org.bouncycastle:bcprov-jdk16:1.46 from Maven repository 'BintrayJCenter' 14:32:08.936 [DEBUG] [org.gradle.api.internal.artifacts.ivyservice.resolveengine.graph.DependencyGraphBuilder] Visiting dependency org.robolectric:robolectric:3.0(default) -> org.ow2.asm:asm:5.0.1(compile,runtime) 14:32:08.958 [DEBUG] [org.gradle.api.internal.artifacts.ivyservice.resolveengine.graph.DependencyGraphBuilder] Selecting new module version org.ow2.asm:asm:5.0.1 14:32:08.980 [DEBUG] [org.gradle.api.internal.artifacts.ivyservice.ivyresolve.RepositoryChainComponentMetaDataResolver] Attempting to resolve component for org.ow2.asm:asm:5.0.1 using repositories [BintrayJCenter, Ma venRepo, maven, maven2] 14:32:09.004 [DEBUG] [org.gradle.api.internal.artifacts.ivyservice.ivyresolve.parser.IvyXmlModuleDescriptorParser] post 1.3 ivy file: using exact as default matcher 14:32:09.030 [DEBUG] [org.gradle.api.internal.artifacts.ivyservice.ivyresolve.CachingModuleComponentRepository] Using cached module metadata for module 'org.ow2.asm:asm:5.0.1' in 'BintrayJCenter' 14:32:09.051 [DEBUG] [org.gradle.api.internal.artifacts.ivyservice.ivyresolve.RepositoryChainComponentMetaDataResolver] Using org.ow2.asm:asm:5.0.1 from Maven repository 'BintrayJCenter' 14:32:09.072 [DEBUG] [org.gradle.api.internal.artifacts.ivyservice.resolveengine.graph.DependencyGraphBuilder] Visiting dependency org.robolectric:robolectric:3.0(default) -> org.ow2.asm:asm-commons:5.0.1(compile,run time) 14:32:09.093 [DEBUG] [org.gradle.api.internal.artifacts.ivyservice.resolveengine.graph.DependencyGraphBuilder] Selecting new module version org.ow2.asm:asm-commons:5.0.1 14:32:09.114 [DEBUG] [org.gradle.api.internal.artifacts.ivyservice.ivyresolve.RepositoryChainComponentMetaDataResolver] Attempting to resolve component for org.ow2.asm:asm-commons:5.0.1 using repositories [BintrayJCe nter, MavenRepo, maven, maven2] 14:32:09.142 [DEBUG] [org.gradle.api.internal.artifacts.ivyservice.ivyresolve.parser.IvyXmlModuleDescriptorParser] post 1.3 ivy file: using exact as default matcher 14:32:09.171 [DEBUG] [org.gradle.api.internal.artifacts.ivyservice.ivyresolve.CachingModuleComponentRepository] Using cached module metadata for module 'org.ow2.asm:asm-commons:5.0.1' in 'BintrayJCenter' 14:32:09.186 [DEBUG] [org.gradle.api.internal.artifacts.ivyservice.ivyresolve.RepositoryChainComponentMetaDataResolver] Using org.ow2.asm:asm-commons:5.0.1 from Maven repository 'BintrayJCenter' 14:32:09.209 [DEBUG] [org.gradle.api.internal.artifacts.ivyservice.resolveengine.graph.DependencyGraphBuilder] Visiting dependency org.robolectric:robolectric:3.0(default) -> org.ow2.asm:asm-util:5.0.1(compile,runtim e) 14:32:09.238 [DEBUG] [org.gradle.api.internal.artifacts.ivyservice.resolveengine.graph.DependencyGraphBuilder] Selecting new module version org.ow2.asm:asm-util:5.0.1 14:32:09.260 [DEBUG] [org.gradle.api.internal.artifacts.ivyservice.ivyresolve.RepositoryChainComponentMetaDataResolver] Attempting to resolve component for org.ow2.asm:asm-util:5.0.1 using repositories [BintrayJCente r, MavenRepo, maven, maven2] 14:32:09.286 [DEBUG] [org.gradle.api.internal.artifacts.ivyservice.ivyresolve.parser.IvyXmlModuleDescriptorParser] post 1.3 ivy file: using exact as default matcher 14:32:09.310 [DEBUG] [org.gradle.api.internal.artifacts.ivyservice.ivyresolve.CachingModuleComponentRepository] Using cached module metadata for module 'org.ow2.asm:asm-util:5.0.1' in 'BintrayJCenter' 14:32:09.332 [DEBUG] [org.gradle.api.internal.artifacts.ivyservice.ivyresolve.RepositoryChainComponentMetaDataResolver] Using org.ow2.asm:asm-util:5.0.1 from Maven repository 'BintrayJCenter' 14:32:09.350 [DEBUG] [org.gradle.api.internal.artifacts.ivyservice.resolveengine.graph.DependencyGraphBuilder] Visiting dependency org.robolectric:robolectric:3.0(default) -> org.ow2.asm:asm-analysis:5.0.1(compile,ru ntime) 14:32:09.368 [DEBUG] [org.gradle.api.internal.artifacts.ivyservice.resolveengine.graph.DependencyGraphBuilder] Selecting new module version org.ow2.asm:asm-analysis:5.0.1 14:32:09.387 [DEBUG] [org.gradle.api.internal.artifacts.ivyservice.ivyresolve.RepositoryChainComponentMetaDataResolver] Attempting to resolve component for org.ow2.asm:asm-analysis:5.0.1 using repositories [BintrayJC enter, MavenRepo, maven, maven2] 14:32:09.410 [DEBUG] [org.gradle.api.internal.artifacts.ivyservice.ivyresolve.parser.IvyXmlModuleDescriptorParser] post 1.3 ivy file: using exact as default matcher 14:32:09.438 [DEBUG] [org.gradle.api.internal.artifacts.ivyservice.ivyresolve.CachingModuleComponentRepository] Using cached module metadata for module 'org.ow2.asm:asm-analysis:5.0.1' in 'BintrayJCenter' 14:32:09.467 [DEBUG] [org.gradle.api.internal.artifacts.ivyservice.ivyresolve.RepositoryChainComponentMetaDataResolver] Using org.ow2.asm:asm-analysis:5.0.1 from Maven repository 'BintrayJCenter' 14:32:09.505 [DEBUG] [org.gradle.api.internal.artifacts.ivyservice.resolveengine.graph.DependencyGraphBuilder] Visiting dependency org.robolectric:robolectric:3.0(default) -> com.ximpleware:vtd-xml:2.11(compile,runti me) 14:32:09.523 [DEBUG] [org.gradle.api.internal.artifacts.ivyservice.resolveengine.graph.DependencyGraphBuilder] Selecting new module version com.ximpleware:vtd-xml:2.11 14:32:09.543 [DEBUG] [org.gradle.api.internal.artifacts.ivyservice.ivyresolve.RepositoryChainComponentMetaDataResolver] Attempting to resolve component for com.ximpleware:vtd-xml:2.11 using repositories [BintrayJCent er, MavenRepo, maven, maven2] 14:32:09.571 [DEBUG] [org.gradle.api.internal.artifacts.ivyservice.ivyresolve.parser.IvyXmlModuleDescriptorParser] post 1.3 ivy file: using exact as default matcher 14:32:09.594 [DEBUG] [org.gradle.api.internal.artifacts.ivyservice.ivyresolve.CachingModuleComponentRepository] Using cached module metadata for module 'com.ximpleware:vtd-xml:2.11' in 'BintrayJCenter' 14:32:09.614 [DEBUG] [org.gradle.api.internal.artifacts.ivyservice.ivyresolve.RepositoryChainComponentMetaDataResolver] Using com.ximpleware:vtd-xml:2.11 from Maven repository 'BintrayJCenter' 14:32:09.635 [DEBUG] [org.gradle.api.internal.artifacts.ivyservice.resolveengine.graph.DependencyGraphBuilder] Visiting dependency org.robolectric:robolectric:3.0(default) -> org.apache.maven:maven-ant-tasks:2.1.3(co mpile,runtime) 14:32:09.656 [DEBUG] [org.gradle.api.internal.artifacts.ivyservice.resolveengine.graph.DependencyGraphBuilder] Selecting new module version org.apache.maven:maven-ant-tasks:2.1.3 14:32:09.679 [DEBUG] [org.gradle.api.internal.artifacts.ivyservice.ivyresolve.RepositoryChainComponentMetaDataResolver] Attempting to resolve component for org.apache.maven:maven-ant-tasks:2.1.3 using repositories [B intrayJCenter, MavenRepo, maven, maven2] 14:32:09.708 [DEBUG] [org.gradle.api.internal.artifacts.ivyservice.ivyresolve.parser.IvyXmlModuleDescriptorParser] post 1.3 ivy file: using exact as default matcher 14:32:09.740 [DEBUG] [org.gradle.api.internal.artifacts.ivyservice.ivyresolve.CachingModuleComponentRepository] Using cached module metadata for module 'org.apache.maven:maven-ant-tasks:2.1.3' in 'BintrayJCenter' 14:32:09.766 [DEBUG] [org.gradle.api.internal.artifacts.ivyservice.ivyresolve.RepositoryChainComponentMetaDataResolver] Using org.apache.maven:maven-ant-tasks:2.1.3 from Maven repository 'BintrayJCenter' 14:32:09.790 [DEBUG] [org.gradle.api.internal.artifacts.ivyservice.resolveengine.graph.DependencyGraphBuilder] Visiting dependency org.robolectric:robolectric:3.0(default) -> org.apache.ant:ant:1.8.0(compile,runtime) 14:32:09.808 [DEBUG] [org.gradle.api.internal.artifacts.ivyservice.resolveengine.graph.DependencyGraphBuilder] Selecting new module version org.apache.ant:ant:1.8.0 14:32:09.826 [DEBUG] [org.gradle.api.internal.artifacts.ivyservice.ivyresolve.RepositoryChainComponentMetaDataResolver] Attempting to resolve component for org.apache.ant:ant:1.8.0 using repositories [BintrayJCenter, MavenRepo, maven, maven2] 14:32:09.854 [DEBUG] [org.gradle.api.internal.artifacts.ivyservice.ivyresolve.parser.IvyXmlModuleDescriptorParser] post 1.3 ivy file: using exact as default matcher 14:32:09.876 [DEBUG] [org.gradle.api.internal.artifacts.ivyservice.ivyresolve.CachingModuleComponentRepository] Using cached module metadata for module 'org.apache.ant:ant:1.8.0' in 'BintrayJCenter' 14:32:09.903 [DEBUG] [org.gradle.api.internal.artifacts.ivyservice.ivyresolve.RepositoryChainComponentMetaDataResolver] Using org.apache.ant:ant:1.8.0 from Maven repository 'BintrayJCenter' 14:32:09.929 [DEBUG] [org.gradle.api.internal.artifacts.ivyservice.resolveengine.graph.DependencyGraphBuilder] Visiting configuration org.hamcrest:hamcrest-core:1.3(compile). 14:32:09.952 [DEBUG] [org.gradle.api.internal.artifacts.ivyservice.resolveengine.graph.DependencyGraphBuilder] version for org.hamcrest:hamcrest-core:1.3(compile) is not selected. ignoring. 14:32:09.972 [DEBUG] [org.gradle.api.internal.artifacts.ivyservice.resolveengine.graph.DependencyGraphBuilder] Visiting configuration org.hamcrest:hamcrest-core:1.3(master). 14:32:09.993 [DEBUG] [org.gradle.api.internal.artifacts.ivyservice.resolveengine.graph.DependencyGraphBuilder] version for org.hamcrest:hamcrest-core:1.3(master) is not selected. ignoring. 14:32:10.014 [DEBUG] [org.gradle.api.internal.artifacts.ivyservice.resolveengine.graph.DependencyGraphBuilder] Visiting configuration org.hamcrest:hamcrest-core:1.3(runtime). 14:32:10.031 [DEBUG] [org.gradle.api.internal.artifacts.ivyservice.resolveengine.graph.DependencyGraphBuilder] version for org.hamcrest:hamcrest-core:1.3(runtime) is not selected. ignoring. 14:32:10.050 [DEBUG] [org.gradle.api.internal.artifacts.ivyservice.resolveengine.graph.DependencyGraphBuilder] Visiting configuration org.hamcrest:hamcrest-library:1.3(compile). 14:32:10.080 [DEBUG] [org.gradle.api.internal.artifacts.ivyservice.resolveengine.graph.DependencyGraphBuilder] Visiting dependency org.hamcrest:hamcrest-library:1.3(compile) -> org.hamcrest:hamcrest-core:1.3(compile, runtime) 14:32:10.109 [DEBUG] [org.gradle.api.internal.artifacts.ivyservice.resolveengine.graph.DependencyGraphBuilder] Visiting configuration org.hamcrest:hamcrest-library:1.3(master). 14:32:10.125 [DEBUG] [org.gradle.api.internal.artifacts.ivyservice.resolveengine.graph.DependencyGraphBuilder] Visiting configuration org.hamcrest:hamcrest-library:1.3(runtime). 14:32:10.145 [DEBUG] [org.gradle.api.internal.artifacts.ivyservice.resolveengine.graph.DependencyGraphBuilder] Visiting dependency org.hamcrest:hamcrest-library:1.3(runtime) -> org.hamcrest:hamcrest-core:1.3(compile, runtime) 14:32:10.167 [DEBUG] [org.gradle.api.internal.artifacts.ivyservice.resolveengine.graph.DependencyGraphBuilder] Visiting configuration org.objenesis:objenesis:2.1(compile). 14:32:10.184 [DEBUG] [org.gradle.api.internal.artifacts.ivyservice.resolveengine.graph.DependencyGraphBuilder] Visiting configuration org.objenesis:objenesis:2.1(runtime). 14:32:10.204 [DEBUG] [org.gradle.api.internal.artifacts.ivyservice.resolveengine.graph.DependencyGraphBuilder] Visiting configuration org.objenesis:objenesis:2.1(master). 14:32:10.220 [DEBUG] [org.gradle.api.internal.artifacts.ivyservice.resolveengine.graph.DependencyGraphBuilder] Visiting configuration org.robolectric:robolectric-annotations:3.0(compile). 14:32:10.242 [DEBUG] [org.gradle.api.internal.artifacts.ivyservice.resolveengine.graph.DependencyGraphBuilder] Visiting configuration org.robolectric:robolectric-annotations:3.0(master). 14:32:10.263 [DEBUG] [org.gradle.api.internal.artifacts.ivyservice.resolveengine.graph.DependencyGraphBuilder] Visiting configuration org.robolectric:robolectric-annotations:3.0(runtime). 14:32:10.287 [DEBUG] [org.gradle.api.internal.artifacts.ivyservice.resolveengine.graph.DependencyGraphBuilder] Visiting configuration org.robolectric:robolectric-resources:3.0(compile). 14:32:10.303 [DEBUG] [org.gradle.api.internal.artifacts.ivyservice.resolveengine.graph.DependencyGraphBuilder] Visiting dependency org.robolectric:robolectric-resources:3.0(compile) -> org.robolectric:robolectric-uti ls:3.0(compile,runtime) 14:32:10.325 [DEBUG] [org.gradle.api.internal.artifacts.ivyservice.resolveengine.graph.DependencyGraphBuilder] Visiting dependency org.robolectric:robolectric-resources:3.0(compile) -> org.robolectric:robolectric-ann otations:3.0(compile,runtime) 14:32:10.350 [DEBUG] [org.gradle.api.internal.artifacts.ivyservice.resolveengine.graph.DependencyGraphBuilder] Visiting dependency org.robolectric:robolectric-resources:3.0(compile) -> com.ximpleware:vtd-xml:2.11(com pile,runtime) 14:32:10.367 [DEBUG] [org.gradle.api.internal.artifacts.ivyservice.resolveengine.graph.DependencyGraphBuilder] Visiting configuration org.robolectric:robolectric-resources:3.0(master). 14:32:10.391 [DEBUG] [org.gradle.api.internal.artifacts.ivyservice.resolveengine.graph.DependencyGraphBuilder] Visiting configuration org.robolectric:robolectric-resources:3.0(runtime). 14:32:10.413 [DEBUG] [org.gradle.api.internal.artifacts.ivyservice.resolveengine.graph.DependencyGraphBuilder] Visiting dependency org.robolectric:robolectric-resources:3.0(runtime) -> org.robolectric:robolectric-uti ls:3.0(compile,runtime) 14:32:10.429 [DEBUG] [org.gradle.api.internal.artifacts.ivyservice.resolveengine.graph.DependencyGraphBuilder] Visiting dependency org.robolectric:robolectric-resources:3.0(runtime) -> org.robolectric:robolectric-ann otations:3.0(compile,runtime) 14:32:10.452 [DEBUG] [org.gradle.api.internal.artifacts.ivyservice.resolveengine.graph.DependencyGraphBuilder] Visiting dependency org.robolectric:robolectric-resources:3.0(runtime) -> com.ximpleware:vtd-xml:2.11(com pile,runtime) 14:32:10.479 [DEBUG] [org.gradle.api.internal.artifacts.ivyservice.resolveengine.graph.DependencyGraphBuilder] Visiting configuration org.robolectric:robolectric-utils:3.0(compile). 14:32:10.504 [DEBUG] [org.gradle.api.internal.artifacts.ivyservice.resolveengine.graph.DependencyGraphBuilder] Visiting dependency org.robolectric:robolectric-utils:3.0(compile) -> org.robolectric:robolectric-annotat ions:3.0(compile,runtime) 14:32:10.527 [DEBUG] [org.gradle.api.internal.artifacts.ivyservice.resolveengine.graph.DependencyGraphBuilder] Visiting dependency org.robolectric:robolectric-utils:3.0(compile) -> com.google.android.apps.common.test ing.accessibility.framework:accessibility-test-framework:1.0(compile,runtime) 14:32:10.552 [DEBUG] [org.gradle.api.internal.artifacts.ivyservice.resolveengine.graph.DependencyGraphBuilder] Selecting new module version com.google.android.apps.common.testing.accessibility.framework:accessibility -test-framework:1.0 14:32:10.575 [DEBUG] [org.gradle.api.internal.artifacts.ivyservice.ivyresolve.RepositoryChainComponentMetaDataResolver] Attempting to resolve component for com.google.android.apps.common.testing.accessibility.framewo rk:accessibility-test-framework:1.0 using repositories [BintrayJCenter, MavenRepo, maven, maven2] 14:32:10.609 [DEBUG] [org.gradle.api.internal.artifacts.ivyservice.ivyresolve.parser.IvyXmlModuleDescriptorParser] post 1.3 ivy file: using exact as default matcher 14:32:10.632 [DEBUG] [org.gradle.api.internal.artifacts.ivyservice.ivyresolve.CachingModuleComponentRepository] Using cached module metadata for module 'com.google.android.apps.common.testing.accessibility.framework: accessibility-test-framework:1.0' in 'BintrayJCenter' 14:32:10.651 [DEBUG] [org.gradle.api.internal.artifacts.ivyservice.ivyresolve.RepositoryChainComponentMetaDataResolver] Using com.google.android.apps.common.testing.accessibility.framework:accessibility-test-framewor k:1.0 from Maven repository 'BintrayJCenter' 14:32:10.672 [DEBUG] [org.gradle.api.internal.artifacts.ivyservice.resolveengine.graph.DependencyGraphBuilder] Visiting configuration org.robolectric:robolectric-utils:3.0(master). 14:32:10.690 [DEBUG] [org.gradle.api.internal.artifacts.ivyservice.resolveengine.graph.DependencyGraphBuilder] Visiting configuration org.robolectric:robolectric-utils:3.0(runtime). 14:32:10.709 [DEBUG] [org.gradle.api.internal.artifacts.ivyservice.resolveengine.graph.DependencyGraphBuilder] Visiting dependency org.robolectric:robolectric-utils:3.0(runtime) -> org.robolectric:robolectric-annotat ions:3.0(compile,runtime) 14:32:10.729 [DEBUG] [org.gradle.api.internal.artifacts.ivyservice.resolveengine.graph.DependencyGraphBuilder] Visiting dependency org.robolectric:robolectric-utils:3.0(runtime) -> com.google.android.apps.common.test ing.accessibility.framework:accessibility-test-framework:1.0(compile,runtime) 14:32:10.744 [DEBUG] [org.gradle.api.internal.artifacts.ivyservice.resolveengine.graph.DependencyGraphBuilder] Visiting configuration org.robolectric:shadows-core:3.0(compile). 14:32:10.763 [DEBUG] [org.gradle.api.internal.artifacts.ivyservice.resolveengine.graph.DependencyGraphBuilder] Visiting dependency org.robolectric:shadows-core:3.0(compile) -> org.robolectric:robolectric-annotations: 3.0(compile,runtime) 14:32:10.787 [DEBUG] [org.gradle.api.internal.artifacts.ivyservice.resolveengine.graph.DependencyGraphBuilder] Visiting dependency org.robolectric:shadows-core:3.0(compile) -> org.robolectric:robolectric-utils:3.0(co mpile,runtime) 14:32:10.811 [DEBUG] [org.gradle.api.internal.artifacts.ivyservice.resolveengine.graph.DependencyGraphBuilder] Visiting dependency org.robolectric:shadows-core:3.0(compile) -> org.robolectric:robolectric-resources:3. 0(compile,runtime) 14:32:10.835 [DEBUG] [org.gradle.api.internal.artifacts.ivyservice.resolveengine.graph.DependencyGraphBuilder] Visiting dependency org.robolectric:shadows-core:3.0(compile) -> com.ibm.icu:icu4j:53.1(compile,runtime) 14:32:10.856 [DEBUG] [org.gradle.api.internal.artifacts.ivyservice.resolveengine.graph.DependencyGraphBuilder] Selecting new module version com.ibm.icu:icu4j:53.1 14:32:10.873 [DEBUG] [org.gradle.api.internal.artifacts.ivyservice.ivyresolve.RepositoryChainComponentMetaDataResolver] Attempting to resolve component for com.ibm.icu:icu4j:53.1 using repositories [BintrayJCenter, M avenRepo, maven, maven2] 14:32:10.898 [DEBUG] [org.gradle.api.internal.artifacts.ivyservice.ivyresolve.parser.IvyXmlModuleDescriptorParser] post 1.3 ivy file: using exact as default matcher 14:32:10.924 [DEBUG] [org.gradle.api.internal.artifacts.ivyservice.ivyresolve.CachingModuleComponentRepository] Using cached module metadata for module 'com.ibm.icu:icu4j:53.1' in 'BintrayJCenter' 14:32:10.948 [DEBUG] [org.gradle.api.internal.artifacts.ivyservice.ivyresolve.RepositoryChainComponentMetaDataResolver] Using com.ibm.icu:icu4j:53.1 from Maven repository 'BintrayJCenter' 14:32:10.973 [DEBUG] [org.gradle.api.internal.artifacts.ivyservice.resolveengine.graph.DependencyGraphBuilder] Visiting dependency org.robolectric:shadows-core:3.0(compile) -> com.almworks.sqlite4java:sqlite4java:0.2 82(compile,runtime) 14:32:10.993 [DEBUG] [org.gradle.api.internal.artifacts.ivyservice.resolveengine.graph.DependencyGraphBuilder] Selecting new module version com.almworks.sqlite4java:sqlite4java:0.282 14:32:11.013 [DEBUG] [org.gradle.api.internal.artifacts.ivyservice.ivyresolve.RepositoryChainComponentMetaDataResolver] Attempting to resolve component for com.almworks.sqlite4java:sqlite4java:0.282 using repositorie s [BintrayJCenter, MavenRepo, maven, maven2] 14:32:11.040 [DEBUG] [org.gradle.api.internal.artifacts.ivyservice.ivyresolve.parser.IvyXmlModuleDescriptorParser] post 1.3 ivy file: using exact as default matcher 14:32:11.064 [DEBUG] [org.gradle.api.internal.artifacts.ivyservice.ivyresolve.CachingModuleComponentRepository] Using cached module metadata for module 'com.almworks.sqlite4java:sqlite4java:0.282' in 'BintrayJCenter' 14:32:11.086 [DEBUG] [org.gradle.api.internal.artifacts.ivyservice.ivyresolve.RepositoryChainComponentMetaDataResolver] Using com.almworks.sqlite4java:sqlite4java:0.282 from Maven repository 'BintrayJCenter' 14:32:11.104 [DEBUG] [org.gradle.api.internal.artifacts.ivyservice.resolveengine.graph.DependencyGraphBuilder] Visiting configuration org.robolectric:shadows-core:3.0(master). 14:32:11.127 [DEBUG] [org.gradle.api.internal.artifacts.ivyservice.resolveengine.graph.DependencyGraphBuilder] Visiting configuration org.robolectric:shadows-core:3.0(runtime). 14:32:11.148 [DEBUG] [org.gradle.api.internal.artifacts.ivyservice.resolveengine.graph.DependencyGraphBuilder] Visiting dependency org.robolectric:shadows-core:3.0(runtime) -> org.robolectric:robolectric-annotations: 3.0(compile,runtime) 14:32:11.172 [DEBUG] [org.gradle.api.internal.artifacts.ivyservice.resolveengine.graph.DependencyGraphBuilder] Visiting dependency org.robolectric:shadows-core:3.0(runtime) -> org.robolectric:robolectric-utils:3.0(co mpile,runtime) 14:32:11.193 [DEBUG] [org.gradle.api.internal.artifacts.ivyservice.resolveengine.graph.DependencyGraphBuilder] Visiting dependency org.robolectric:shadows-core:3.0(runtime) -> org.robolectric:robolectric-resources:3. 0(compile,runtime) 14:32:11.215 [DEBUG] [org.gradle.api.internal.artifacts.ivyservice.resolveengine.graph.DependencyGraphBuilder] Visiting dependency org.robolectric:shadows-core:3.0(runtime) -> com.ibm.icu:icu4j:53.1(compile,runtime) 14:32:11.233 [DEBUG] [org.gradle.api.internal.artifacts.ivyservice.resolveengine.graph.DependencyGraphBuilder] Visiting dependency org.robolectric:shadows-core:3.0(runtime) -> com.almworks.sqlite4java:sqlite4java:0.2 82(compile,runtime) 14:32:11.249 [DEBUG] [org.gradle.api.internal.artifacts.ivyservice.resolveengine.graph.DependencyGraphBuilder] Visiting configuration org.bouncycastle:bcprov-jdk16:1.46(compile). 14:32:11.272 [DEBUG] [org.gradle.api.internal.artifacts.ivyservice.resolveengine.graph.DependencyGraphBuilder] Visiting configuration org.bouncycastle:bcprov-jdk16:1.46(master). 14:32:11.295 [DEBUG] [org.gradle.api.internal.artifacts.ivyservice.resolveengine.graph.DependencyGraphBuilder] Visiting configuration org.bouncycastle:bcprov-jdk16:1.46(runtime). 14:32:11.313 [DEBUG] [org.gradle.api.internal.artifacts.ivyservice.resolveengine.graph.DependencyGraphBuilder] Visiting configuration org.ow2.asm:asm:5.0.1(compile). 14:32:11.334 [DEBUG] [org.gradle.api.internal.artifacts.ivyservice.resolveengine.graph.DependencyGraphBuilder] Visiting configuration org.ow2.asm:asm:5.0.1(master). 14:32:11.354 [DEBUG] [org.gradle.api.internal.artifacts.ivyservice.resolveengine.graph.DependencyGraphBuilder] Visiting configuration org.ow2.asm:asm:5.0.1(runtime). 14:32:11.371 [DEBUG] [org.gradle.api.internal.artifacts.ivyservice.resolveengine.graph.DependencyGraphBuilder] Visiting configuration org.ow2.asm:asm-commons:5.0.1(compile). 14:32:11.394 [DEBUG] [org.gradle.api.internal.artifacts.ivyservice.resolveengine.graph.DependencyGraphBuilder] Visiting dependency org.ow2.asm:asm-commons:5.0.1(compile) -> org.ow2.asm:asm-tree:5.0.1(compile,runtime) 14:32:11.414 [DEBUG] [org.gradle.api.internal.artifacts.ivyservice.resolveengine.graph.DependencyGraphBuilder] Selecting new module version org.ow2.asm:asm-tree:5.0.1 14:32:11.432 [DEBUG] [org.gradle.api.internal.artifacts.ivyservice.ivyresolve.RepositoryChainComponentMetaDataResolver] Attempting to resolve component for org.ow2.asm:asm-tree:5.0.1 using repositories [BintrayJCente r, MavenRepo, maven, maven2] 14:32:11.464 [DEBUG] [org.gradle.api.internal.artifacts.ivyservice.ivyresolve.parser.IvyXmlModuleDescriptorParser] post 1.3 ivy file: using exact as default matcher 14:32:11.488 [DEBUG] [org.gradle.api.internal.artifacts.ivyservice.ivyresolve.CachingModuleComponentRepository] Using cached module metadata for module 'org.ow2.asm:asm-tree:5.0.1' in 'BintrayJCenter' 14:32:11.512 [DEBUG] [org.gradle.api.internal.artifacts.ivyservice.ivyresolve.RepositoryChainComponentMetaDataResolver] Using org.ow2.asm:asm-tree:5.0.1 from Maven repository 'BintrayJCenter' 14:32:11.533 [DEBUG] [org.gradle.api.internal.artifacts.ivyservice.resolveengine.graph.DependencyGraphBuilder] Visiting configuration org.ow2.asm:asm-commons:5.0.1(master). 14:32:11.555 [DEBUG] [org.gradle.api.internal.artifacts.ivyservice.resolveengine.graph.DependencyGraphBuilder] Visiting configuration org.ow2.asm:asm-commons:5.0.1(runtime). 14:32:11.578 [DEBUG] [org.gradle.api.internal.artifacts.ivyservice.resolveengine.graph.DependencyGraphBuilder] Visiting dependency org.ow2.asm:asm-commons:5.0.1(runtime) -> org.ow2.asm:asm-tree:5.0.1(compile,runtime) 14:32:11.605 [DEBUG] [org.gradle.api.internal.artifacts.ivyservice.resolveengine.graph.DependencyGraphBuilder] Visiting configuration org.ow2.asm:asm-util:5.0.1(compile). 14:32:11.624 [DEBUG] [org.gradle.api.internal.artifacts.ivyservice.resolveengine.graph.DependencyGraphBuilder] Visiting dependency org.ow2.asm:asm-util:5.0.1(compile) -> org.ow2.asm:asm-tree:5.0.1(compile,runtime) 14:32:11.641 [DEBUG] [org.gradle.api.internal.artifacts.ivyservice.resolveengine.graph.DependencyGraphBuilder] Visiting configuration org.ow2.asm:asm-util:5.0.1(master). 14:32:11.657 [DEBUG] [org.gradle.api.internal.artifacts.ivyservice.resolveengine.graph.DependencyGraphBuilder] Visiting configuration org.ow2.asm:asm-util:5.0.1(runtime). 14:32:11.673 [DEBUG] [org.gradle.api.internal.artifacts.ivyservice.resolveengine.graph.DependencyGraphBuilder] Visiting dependency org.ow2.asm:asm-util:5.0.1(runtime) -> org.ow2.asm:asm-tree:5.0.1(compile,runtime) 14:32:11.689 [DEBUG] [org.gradle.api.internal.artifacts.ivyservice.resolveengine.graph.DependencyGraphBuilder] Visiting configuration org.ow2.asm:asm-analysis:5.0.1(compile). 14:32:11.706 [DEBUG] [org.gradle.api.internal.artifacts.ivyservice.resolveengine.graph.DependencyGraphBuilder] Visiting dependency org.ow2.asm:asm-analysis:5.0.1(compile) -> org.ow2.asm:asm-tree:5.0.1(compile,runtime ) 14:32:11.724 [DEBUG] [org.gradle.api.internal.artifacts.ivyservice.resolveengine.graph.DependencyGraphBuilder] Visiting configuration org.ow2.asm:asm-analysis:5.0.1(master). 14:32:11.745 [DEBUG] [org.gradle.api.internal.artifacts.ivyservice.resolveengine.graph.DependencyGraphBuilder] Visiting configuration org.ow2.asm:asm-analysis:5.0.1(runtime). 14:32:11.762 [DEBUG] [org.gradle.api.internal.artifacts.ivyservice.resolveengine.graph.DependencyGraphBuilder] Visiting dependency org.ow2.asm:asm-analysis:5.0.1(runtime) -> org.ow2.asm:asm-tree:5.0.1(compile,runtime ) 14:32:11.784 [DEBUG] [org.gradle.api.internal.artifacts.ivyservice.resolveengine.graph.DependencyGraphBuilder] Visiting configuration com.ximpleware:vtd-xml:2.11(compile). 14:32:11.805 [DEBUG] [org.gradle.api.internal.artifacts.ivyservice.resolveengine.graph.DependencyGraphBuilder] Visiting configuration com.ximpleware:vtd-xml:2.11(master). 14:32:11.827 [DEBUG] [org.gradle.api.internal.artifacts.ivyservice.resolveengine.graph.DependencyGraphBuilder] Visiting configuration com.ximpleware:vtd-xml:2.11(runtime). 14:32:11.843 [DEBUG] [org.gradle.api.internal.artifacts.ivyservice.resolveengine.graph.DependencyGraphBuilder] Visiting configuration org.apache.maven:maven-ant-tasks:2.1.3(compile). 14:32:11.867 [DEBUG] [org.gradle.api.internal.artifacts.ivyservice.resolveengine.graph.DependencyGraphBuilder] org.apache.ant:ant is excluded from org.apache.maven:maven-ant-tasks:2.1.3(compile). 14:32:11.889 [DEBUG] [org.gradle.api.internal.artifacts.ivyservice.resolveengine.graph.DependencyGraphBuilder] classworlds:classworlds is excluded from org.apache.maven:maven-ant-tasks:2.1.3(compile). 14:32:11.915 [DEBUG] [org.gradle.api.internal.artifacts.ivyservice.resolveengine.graph.DependencyGraphBuilder] org.codehaus.plexus:plexus-container-default is excluded from org.apache.maven:maven-ant-tasks:2.1.3(comp ile). 14:32:11.933 [DEBUG] [org.gradle.api.internal.artifacts.ivyservice.resolveengine.graph.DependencyGraphBuilder] org.codehaus.plexus:plexus-utils is excluded from org.apache.maven:maven-ant-tasks:2.1.3(compile). 14:32:11.954 [DEBUG] [org.gradle.api.internal.artifacts.ivyservice.resolveengine.graph.DependencyGraphBuilder] org.codehaus.plexus:plexus-interpolation is excluded from org.apache.maven:maven-ant-tasks:2.1.3(compile) . 14:32:11.972 [DEBUG] [org.gradle.api.internal.artifacts.ivyservice.resolveengine.graph.DependencyGraphBuilder] org.apache.maven:maven-artifact is excluded from org.apache.maven:maven-ant-tasks:2.1.3(compile). 14:32:11.993 [DEBUG] [org.gradle.api.internal.artifacts.ivyservice.resolveengine.graph.DependencyGraphBuilder] org.apache.maven:maven-artifact-manager is excluded from org.apache.maven:maven-ant-tasks:2.1.3(compile). 14:32:12.013 [DEBUG] [org.gradle.api.internal.artifacts.ivyservice.resolveengine.graph.DependencyGraphBuilder] org.apache.maven:maven-model is excluded from org.apache.maven:maven-ant-tasks:2.1.3(compile). 14:32:12.032 [DEBUG] [org.gradle.api.internal.artifacts.ivyservice.resolveengine.graph.DependencyGraphBuilder] org.apache.maven:maven-project is excluded from org.apache.maven:maven-ant-tasks:2.1.3(compile). 14:32:12.053 [DEBUG] [org.gradle.api.internal.artifacts.ivyservice.resolveengine.graph.DependencyGraphBuilder] org.apache.maven:maven-error-diagnostics is excluded from org.apache.maven:maven-ant-tasks:2.1.3(compile) . 14:32:12.079 [DEBUG] [org.gradle.api.internal.artifacts.ivyservice.resolveengine.graph.DependencyGraphBuilder] org.apache.maven:maven-settings is excluded from org.apache.maven:maven-ant-tasks:2.1.3(compile). 14:32:12.105 [DEBUG] [org.gradle.api.internal.artifacts.ivyservice.resolveengine.graph.DependencyGraphBuilder] org.apache.maven.wagon:wagon-file is excluded from org.apache.maven:maven-ant-tasks:2.1.3(compile). 14:32:12.123 [DEBUG] [org.gradle.api.internal.artifacts.ivyservice.resolveengine.graph.DependencyGraphBuilder] org.apache.maven.wagon:wagon-http-lightweight is excluded from org.apache.maven:maven-ant-tasks:2.1.3(com pile). 14:32:12.143 [DEBUG] [org.gradle.api.internal.artifacts.ivyservice.resolveengine.graph.DependencyGraphBuilder] org.apache.maven.wagon:wagon-provider-api is excluded from org.apache.maven:maven-ant-tasks:2.1.3(compile ). 14:32:12.164 [DEBUG] [org.gradle.api.internal.artifacts.ivyservice.resolveengine.graph.DependencyGraphBuilder] Visiting configuration org.apache.maven:maven-ant-tasks:2.1.3(master). 14:32:12.281 [DEBUG] [org.gradle.api.internal.artifacts.ivyservice.resolveengine.graph.DependencyGraphBuilder] Visiting configuration org.apache.maven:maven-ant-tasks:2.1.3(runtime). 14:32:12.299 [DEBUG] [org.gradle.api.internal.artifacts.ivyservice.resolveengine.graph.DependencyGraphBuilder] org.apache.ant:ant is excluded from org.apache.maven:maven-ant-tasks:2.1.3(runtime). 14:32:12.321 [DEBUG] [org.gradle.api.internal.artifacts.ivyservice.resolveengine.graph.DependencyGraphBuilder] classworlds:classworlds is excluded from org.apache.maven:maven-ant-tasks:2.1.3(runtime). 14:32:12.346 [DEBUG] [org.gradle.api.internal.artifacts.ivyservice.resolveengine.graph.DependencyGraphBuilder] org.codehaus.plexus:plexus-container-default is excluded from org.apache.maven:maven-ant-tasks:2.1.3(runt ime). 14:32:12.368 [DEBUG] [org.gradle.api.internal.artifacts.ivyservice.resolveengine.graph.DependencyGraphBuilder] org.codehaus.plexus:plexus-utils is excluded from org.apache.maven:maven-ant-tasks:2.1.3(runtime). 14:32:12.382 [DEBUG] [org.gradle.api.internal.artifacts.ivyservice.resolveengine.graph.DependencyGraphBuilder] org.codehaus.plexus:plexus-interpolation is excluded from org.apache.maven:maven-ant-tasks:2.1.3(runtime) . 14:32:12.404 [DEBUG] [org.gradle.api.internal.artifacts.ivyservice.resolveengine.graph.DependencyGraphBuilder] org.apache.maven:maven-artifact is excluded from org.apache.maven:maven-ant-tasks:2.1.3(runtime). 14:32:12.425 [DEBUG] [org.gradle.api.internal.artifacts.ivyservice.resolveengine.graph.DependencyGraphBuilder] org.apache.maven:maven-artifact-manager is excluded from org.apache.maven:maven-ant-tasks:2.1.3(runtime). 14:32:12.446 [DEBUG] [org.gradle.api.internal.artifacts.ivyservice.resolveengine.graph.DependencyGraphBuilder] org.apache.maven:maven-model is excluded from org.apache.maven:maven-ant-tasks:2.1.3(runtime). 14:32:12.465 [DEBUG] [org.gradle.api.internal.artifacts.ivyservice.resolveengine.graph.DependencyGraphBuilder] org.apache.maven:maven-project is excluded from org.apache.maven:maven-ant-tasks:2.1.3(runtime). 14:32:12.482 [DEBUG] [org.gradle.api.internal.artifacts.ivyservice.resolveengine.graph.DependencyGraphBuilder] org.apache.maven:maven-error-diagnostics is excluded from org.apache.maven:maven-ant-tasks:2.1.3(runtime) . 14:32:12.500 [DEBUG] [org.gradle.api.internal.artifacts.ivyservice.resolveengine.graph.DependencyGraphBuilder] org.apache.maven:maven-settings is excluded from org.apache.maven:maven-ant-tasks:2.1.3(runtime). 14:32:12.514 [DEBUG] [org.gradle.api.internal.artifacts.ivyservice.resolveengine.graph.DependencyGraphBuilder] org.apache.maven.wagon:wagon-file is excluded from org.apache.maven:maven-ant-tasks:2.1.3(runtime). 14:32:12.531 [DEBUG] [org.gradle.api.internal.artifacts.ivyservice.resolveengine.graph.DependencyGraphBuilder] org.apache.maven.wagon:wagon-http-lightweight is excluded from org.apache.maven:maven-ant-tasks:2.1.3(run time). 14:32:12.546 [DEBUG] [org.gradle.api.internal.artifacts.ivyservice.resolveengine.graph.DependencyGraphBuilder] org.apache.maven.wagon:wagon-provider-api is excluded from org.apache.maven:maven-ant-tasks:2.1.3(runtime ). 14:32:12.570 [DEBUG] [org.gradle.api.internal.artifacts.ivyservice.resolveengine.graph.DependencyGraphBuilder] Visiting configuration org.apache.ant:ant:1.8.0(compile). 14:32:12.593 [DEBUG] [org.gradle.api.internal.artifacts.ivyservice.resolveengine.graph.DependencyGraphBuilder] Visiting dependency org.apache.ant:ant:1.8.0(compile) -> org.apache.ant:ant-launcher:1.8.0(compile,runtim e) 14:32:12.617 [DEBUG] [org.gradle.api.internal.artifacts.ivyservice.resolveengine.graph.DependencyGraphBuilder] Selecting new module version org.apache.ant:ant-launcher:1.8.0 14:32:12.639 [DEBUG] [org.gradle.api.internal.artifacts.ivyservice.ivyresolve.RepositoryChainComponentMetaDataResolver] Attempting to resolve component for org.apache.ant:ant-launcher:1.8.0 using repositories [Bintra yJCenter, MavenRepo, maven, maven2] 14:32:12.666 [DEBUG] [org.gradle.api.internal.artifacts.ivyservice.ivyresolve.parser.IvyXmlModuleDescriptorParser] post 1.3 ivy file: using exact as default matcher 14:32:12.692 [DEBUG] [org.gradle.api.internal.artifacts.ivyservice.ivyresolve.CachingModuleComponentRepository] Using cached module metadata for module 'org.apache.ant:ant-launcher:1.8.0' in 'BintrayJCenter' 14:32:12.717 [DEBUG] [org.gradle.api.internal.artifacts.ivyservice.ivyresolve.RepositoryChainComponentMetaDataResolver] Using org.apache.ant:ant-launcher:1.8.0 from Maven repository 'BintrayJCenter' 14:32:12.735 [DEBUG] [org.gradle.api.internal.artifacts.ivyservice.resolveengine.graph.DependencyGraphBuilder] Visiting configuration org.apache.ant:ant:1.8.0(master). 14:32:12.753 [DEBUG] [org.gradle.api.internal.artifacts.ivyservice.resolveengine.graph.DependencyGraphBuilder] Visiting configuration org.apache.ant:ant:1.8.0(runtime). 14:32:12.771 [DEBUG] [org.gradle.api.internal.artifacts.ivyservice.resolveengine.graph.DependencyGraphBuilder] Visiting dependency org.apache.ant:ant:1.8.0(runtime) -> org.apache.ant:ant-launcher:1.8.0(compile,runtim e) 14:32:12.791 [DEBUG] [org.gradle.api.internal.artifacts.ivyservice.resolveengine.graph.DependencyGraphBuilder] Visiting configuration org.robolectric:robolectric-annotations:3.0(compile). 14:32:12.809 [DEBUG] [org.gradle.api.internal.artifacts.ivyservice.resolveengine.graph.DependencyGraphBuilder] Changed edges for org.robolectric:robolectric-annotations:3.0(compile) selects same versions as previous traversal. ignoring 14:32:12.826 [DEBUG] [org.gradle.api.internal.artifacts.ivyservice.resolveengine.graph.DependencyGraphBuilder] Visiting configuration org.robolectric:robolectric-annotations:3.0(master). 14:32:12.846 [DEBUG] [org.gradle.api.internal.artifacts.ivyservice.resolveengine.graph.DependencyGraphBuilder] Changed edges for org.robolectric:robolectric-annotations:3.0(master) selects same versions as previous t raversal. ignoring 14:32:12.869 [DEBUG] [org.gradle.api.internal.artifacts.ivyservice.resolveengine.graph.DependencyGraphBuilder] Visiting configuration org.robolectric:robolectric-annotations:3.0(runtime). 14:32:12.885 [DEBUG] [org.gradle.api.internal.artifacts.ivyservice.resolveengine.graph.DependencyGraphBuilder] Changed edges for org.robolectric:robolectric-annotations:3.0(runtime) selects same versions as previous traversal. ignoring 14:32:12.909 [DEBUG] [org.gradle.api.internal.artifacts.ivyservice.resolveengine.graph.DependencyGraphBuilder] Visiting configuration com.google.android.apps.common.testing.accessibility.framework:accessibility-test- framework:1.0(compile). 14:32:12.932 [DEBUG] [org.gradle.api.internal.artifacts.ivyservice.resolveengine.graph.DependencyGraphBuilder] Visiting configuration com.google.android.apps.common.testing.accessibility.framework:accessibility-test- framework:1.0(master). 14:32:12.949 [DEBUG] [org.gradle.api.internal.artifacts.ivyservice.resolveengine.graph.DependencyGraphBuilder] Visiting configuration com.google.android.apps.common.testing.accessibility.framework:accessibility-test- framework:1.0(runtime). 14:32:12.970 [DEBUG] [org.gradle.api.internal.artifacts.ivyservice.resolveengine.graph.DependencyGraphBuilder] Visiting configuration org.robolectric:robolectric-utils:3.0(compile). 14:32:12.992 [DEBUG] [org.gradle.api.internal.artifacts.ivyservice.resolveengine.graph.DependencyGraphBuilder] Changed edges for org.robolectric:robolectric-utils:3.0(compile) selects same versions as previous traver sal. ignoring 14:32:13.012 [DEBUG] [org.gradle.api.internal.artifacts.ivyservice.resolveengine.graph.DependencyGraphBuilder] Visiting configuration org.robolectric:robolectric-utils:3.0(master). 14:32:13.033 [DEBUG] [org.gradle.api.internal.artifacts.ivyservice.resolveengine.graph.DependencyGraphBuilder] Changed edges for org.robolectric:robolectric-utils:3.0(master) selects same versions as previous travers al. ignoring 14:32:13.057 [DEBUG] [org.gradle.api.internal.artifacts.ivyservice.resolveengine.graph.DependencyGraphBuilder] Visiting configuration org.robolectric:robolectric-resources:3.0(compile). 14:32:13.073 [DEBUG] [org.gradle.api.internal.artifacts.ivyservice.resolveengine.graph.DependencyGraphBuilder] Changed edges for org.robolectric:robolectric-resources:3.0(compile) selects same versions as previous tr aversal. ignoring 14:32:13.095 [DEBUG] [org.gradle.api.internal.artifacts.ivyservice.resolveengine.graph.DependencyGraphBuilder] Visiting configuration org.robolectric:robolectric-resources:3.0(master). 14:32:13.117 [DEBUG] [org.gradle.api.internal.artifacts.ivyservice.resolveengine.graph.DependencyGraphBuilder] Changed edges for org.robolectric:robolectric-resources:3.0(master) selects same versions as previous tra versal. ignoring 14:32:13.139 [DEBUG] [org.gradle.api.internal.artifacts.ivyservice.resolveengine.graph.DependencyGraphBuilder] Visiting configuration com.ibm.icu:icu4j:53.1(compile). 14:32:13.159 [DEBUG] [org.gradle.api.internal.artifacts.ivyservice.resolveengine.graph.DependencyGraphBuilder] Visiting configuration com.ibm.icu:icu4j:53.1(master). 14:32:13.181 [DEBUG] [org.gradle.api.internal.artifacts.ivyservice.resolveengine.graph.DependencyGraphBuilder] Visiting configuration com.almworks.sqlite4java:sqlite4java:0.282(compile). 14:32:13.198 [DEBUG] [org.gradle.api.internal.artifacts.ivyservice.resolveengine.graph.DependencyGraphBuilder] Visiting configuration com.almworks.sqlite4java:sqlite4java:0.282(master). 14:32:13.222 [DEBUG] [org.gradle.api.internal.artifacts.ivyservice.resolveengine.graph.DependencyGraphBuilder] Visiting configuration org.robolectric:robolectric-utils:3.0(runtime). 14:32:13.243 [DEBUG] [org.gradle.api.internal.artifacts.ivyservice.resolveengine.graph.DependencyGraphBuilder] Changed edges for org.robolectric:robolectric-utils:3.0(runtime) selects same versions as previous traver sal. ignoring 14:32:13.269 [DEBUG] [org.gradle.api.internal.artifacts.ivyservice.resolveengine.graph.DependencyGraphBuilder] Visiting configuration org.robolectric:robolectric-resources:3.0(runtime). 14:32:13.288 [DEBUG] [org.gradle.api.internal.artifacts.ivyservice.resolveengine.graph.DependencyGraphBuilder] Changed edges for org.robolectric:robolectric-resources:3.0(runtime) selects same versions as previous tr aversal. ignoring 14:32:13.312 [DEBUG] [org.gradle.api.internal.artifacts.ivyservice.resolveengine.graph.DependencyGraphBuilder] Visiting configuration com.ibm.icu:icu4j:53.1(runtime). 14:32:13.332 [DEBUG] [org.gradle.api.internal.artifacts.ivyservice.resolveengine.graph.DependencyGraphBuilder] Visiting configuration com.almworks.sqlite4java:sqlite4java:0.282(runtime). 14:32:13.350 [DEBUG] [org.gradle.api.internal.artifacts.ivyservice.resolveengine.graph.DependencyGraphBuilder] Visiting configuration org.ow2.asm:asm-tree:5.0.1(compile). 14:32:13.366 [DEBUG] [org.gradle.api.internal.artifacts.ivyservice.resolveengine.graph.DependencyGraphBuilder] Visiting dependency org.ow2.asm:asm-tree:5.0.1(compile) -> org.ow2.asm:asm:5.0.1(compile,runtime) 14:32:13.389 [DEBUG] [org.gradle.api.internal.artifacts.ivyservice.resolveengine.graph.DependencyGraphBuilder] Visiting configuration org.ow2.asm:asm-tree:5.0.1(master). 14:32:13.409 [DEBUG] [org.gradle.api.internal.artifacts.ivyservice.resolveengine.graph.DependencyGraphBuilder] Visiting configuration org.ow2.asm:asm-tree:5.0.1(runtime). 14:32:13.430 [DEBUG] [org.gradle.api.internal.artifacts.ivyservice.resolveengine.graph.DependencyGraphBuilder] Visiting dependency org.ow2.asm:asm-tree:5.0.1(runtime) -> org.ow2.asm:asm:5.0.1(compile,runtime) 14:32:13.449 [DEBUG] [org.gradle.api.internal.artifacts.ivyservice.resolveengine.graph.DependencyGraphBuilder] Visiting configuration org.apache.ant:ant-launcher:1.8.0(compile). 14:32:13.473 [DEBUG] [org.gradle.api.internal.artifacts.ivyservice.resolveengine.graph.DependencyGraphBuilder] Visiting configuration org.apache.ant:ant-launcher:1.8.0(master). 14:32:13.490 [DEBUG] [org.gradle.api.internal.artifacts.ivyservice.resolveengine.graph.DependencyGraphBuilder] Visiting configuration org.apache.ant:ant-launcher:1.8.0(runtime). 14:32:13.509 [DEBUG] [org.gradle.api.internal.artifacts.ivyservice.resolveengine.graph.DependencyGraphBuilder] Visiting configuration org.ow2.asm:asm:5.0.1(compile). 14:32:13.530 [DEBUG] [org.gradle.api.internal.artifacts.ivyservice.resolveengine.graph.DependencyGraphBuilder] Changed edges for org.ow2.asm:asm:5.0.1(compile) selects same versions as previous traversal. ignoring 14:32:13.546 [DEBUG] [org.gradle.api.internal.artifacts.ivyservice.resolveengine.graph.DependencyGraphBuilder] Visiting configuration org.ow2.asm:asm:5.0.1(master). 14:32:13.567 [DEBUG] [org.gradle.api.internal.artifacts.ivyservice.resolveengine.graph.DependencyGraphBuilder] Changed edges for org.ow2.asm:asm:5.0.1(master) selects same versions as previous traversal. ignoring 14:32:13.586 [DEBUG] [org.gradle.api.internal.artifacts.ivyservice.resolveengine.graph.DependencyGraphBuilder] Visiting configuration org.ow2.asm:asm:5.0.1(runtime). 14:32:13.603 [DEBUG] [org.gradle.api.internal.artifacts.ivyservice.resolveengine.graph.DependencyGraphBuilder] Changed edges for org.ow2.asm:asm:5.0.1(runtime) selects same versions as previous traversal. ignoring 14:32:13.624 [DEBUG] [org.gradle.api.internal.artifacts.ivyservice.resolveengine.graph.conflicts.DefaultConflictHandler] Selected org.hamcrest:hamcrest-core:1.3 from conflicting modules [org.hamcrest:hamcrest-core:1. 3, org.hamcrest:hamcrest-core:1.1]. 14:32:13.646 [DEBUG] [org.gradle.api.internal.artifacts.ivyservice.resolveengine.graph.DependencyGraphBuilder] Visiting configuration org.hamcrest:hamcrest-core:1.3(default). 14:32:13.661 [DEBUG] [org.gradle.api.internal.artifacts.ivyservice.resolveengine.graph.DependencyGraphBuilder] Visiting configuration org.hamcrest:hamcrest-core:1.3(compile). 14:32:13.685 [DEBUG] [org.gradle.api.internal.artifacts.ivyservice.resolveengine.graph.DependencyGraphBuilder] Visiting configuration org.hamcrest:hamcrest-core:1.3(master). 14:32:13.705 [DEBUG] [org.gradle.api.internal.artifacts.ivyservice.resolveengine.graph.DependencyGraphBuilder] Visiting configuration org.hamcrest:hamcrest-core:1.3(runtime). 14:32:13.726 [DEBUG] [org.gradle.api.internal.artifacts.ivyservice.resolveengine.graph.conflicts.DefaultConflictHandler] Selected junit:junit:4.12 from conflicting modules [junit:junit:4.12, junit:junit:4.8.2]. 14:32:13.750 [DEBUG] [org.gradle.api.internal.artifacts.ivyservice.resolveengine.graph.DependencyGraphBuilder] Visiting configuration junit:junit:4.12(default). 14:32:13.770 [DEBUG] [org.gradle.api.internal.artifacts.ivyservice.resolveengine.graph.DependencyGraphBuilder] Visiting dependency junit:junit:4.12(default) -> org.hamcrest:hamcrest-core:1.3(compile,runtime) 14:32:13.792 [DEBUG] [org.gradle.api.internal.artifacts.ivyservice.resolveengine.graph.DependencyGraphBuilder] Visiting configuration junit:junit:4.12(compile). 14:32:13.813 [DEBUG] [org.gradle.api.internal.artifacts.ivyservice.resolveengine.graph.DependencyGraphBuilder] Visiting dependency junit:junit:4.12(compile) -> org.hamcrest:hamcrest-core:1.3(compile,runtime) 14:32:13.837 [DEBUG] [org.gradle.api.internal.artifacts.ivyservice.resolveengine.graph.DependencyGraphBuilder] Visiting configuration junit:junit:4.12(master). 14:32:13.851 [DEBUG] [org.gradle.api.internal.artifacts.ivyservice.resolveengine.graph.DependencyGraphBuilder] Visiting configuration junit:junit:4.12(runtime). 14:32:13.870 [DEBUG] [org.gradle.api.internal.artifacts.ivyservice.resolveengine.graph.DependencyGraphBuilder] Visiting dependency junit:junit:4.12(runtime) -> org.hamcrest:hamcrest-core:1.3(compile,runtime) 14:32:13.889 [DEBUG] [org.gradle.api.internal.artifacts.ivyservice.resolveengine.graph.DependencyGraphBuilder] Visiting configuration org.hamcrest:hamcrest-core:1.3(compile). 14:32:13.912 [DEBUG] [org.gradle.api.internal.artifacts.ivyservice.resolveengine.graph.DependencyGraphBuilder] Changed edges for org.hamcrest:hamcrest-core:1.3(compile) selects same versions as previous traversal. ig noring 14:32:13.934 [DEBUG] [org.gradle.api.internal.artifacts.ivyservice.resolveengine.graph.DependencyGraphBuilder] Visiting configuration org.hamcrest:hamcrest-core:1.3(master). 14:32:13.951 [DEBUG] [org.gradle.api.internal.artifacts.ivyservice.resolveengine.graph.DependencyGraphBuilder] Changed edges for org.hamcrest:hamcrest-core:1.3(master) selects same versions as previous traversal. ign oring 14:32:13.969 [DEBUG] [org.gradle.api.internal.artifacts.ivyservice.resolveengine.graph.DependencyGraphBuilder] Visiting configuration org.hamcrest:hamcrest-core:1.3(runtime). 14:32:13.991 [DEBUG] [org.gradle.api.internal.artifacts.ivyservice.resolveengine.graph.DependencyGraphBuilder] Changed edges for org.hamcrest:hamcrest-core:1.3(runtime) selects same versions as previous traversal. ig noring 14:32:14.020 [DEBUG] [org.gradle.api.internal.artifacts.ivyservice.resolveengine.oldresult.TransientConfigurationResultsBuilder] Flushing resolved configuration data in Binary store in C:\Users\Admin\AppData\Local\Te mp\gradle322565546295813176.bin. Wrote root Scripto:lib:unspecified:_debugUnitTestCompile. 14:32:14.045 [DEBUG] [org.gradle.api.internal.artifacts.ivyservice.resolveengine.DefaultArtifactDependencyResolver] Resolving configuration ':lib:_debugUnitTestApk' 14:32:14.072 [DEBUG] [org.gradle.api.internal.artifacts.ivyservice.ivyresolve.memcache.InMemoryCachedRepositoryFactory] Reusing in-memory cache for repo 'BintrayJCenter' [22da77b0d76ea8df17298218f3ec1f87]. 14:32:14.098 [DEBUG] [org.gradle.api.internal.artifacts.ivyservice.ivyresolve.memcache.InMemoryCachedRepositoryFactory] Reusing in-memory cache for repo 'MavenRepo' [4471c3b2f5ea2d40ffaa8b3948cdbacd]. 14:32:14.121 [DEBUG] [org.gradle.api.internal.artifacts.ivyservice.ivyresolve.memcache.InMemoryCachedRepositoryFactory] Reusing in-memory cache for repo 'maven' [d15538bd59e61aebad3eb4c485d5b49a]. 14:32:14.139 [DEBUG] [org.gradle.api.internal.artifacts.ivyservice.ivyresolve.memcache.InMemoryCachedRepositoryFactory] Reusing in-memory cache for repo 'maven2' [d5fcb9b240c54981ee59282cb1c54fd4]. 14:32:14.160 [DEBUG] [org.gradle.api.internal.artifacts.ivyservice.resolveengine.graph.DependencyGraphBuilder] Visiting configuration Scripto:lib:unspecified(_debugUnitTestApk). 14:32:14.183 [DEBUG] [org.gradle.api.internal.artifacts.ivyservice.resolveengine.graph.DependencyGraphBuilder] Visiting dependency Scripto:lib:unspecified(_debugUnitTestApk) -> com.google.code.gson:gson:2.7(compile) 14:32:14.201 [DEBUG] [org.gradle.api.internal.artifacts.ivyservice.resolveengine.graph.DependencyGraphBuilder] Selecting new module version com.google.code.gson:gson:2.7 14:32:14.225 [DEBUG] [org.gradle.api.internal.artifacts.ivyservice.ivyresolve.RepositoryChainComponentMetaDataResolver] Attempting to resolve component for com.google.code.gson:gson:2.7 using repositories [BintrayJCe nter, MavenRepo, maven, maven2] 14:32:14.246 [DEBUG] [org.gradle.api.internal.artifacts.ivyservice.ivyresolve.RepositoryChainComponentMetaDataResolver] Using com.google.code.gson:gson:2.7 from Maven repository 'BintrayJCenter' 14:32:14.270 [DEBUG] [org.gradle.api.internal.artifacts.ivyservice.resolveengine.graph.DependencyGraphBuilder] Visiting dependency Scripto:lib:unspecified(_debugUnitTestApk) -> junit:junit:4.12(testCompile) 14:32:14.294 [DEBUG] [org.gradle.api.internal.artifacts.ivyservice.resolveengine.graph.DependencyGraphBuilder] Selecting new module version junit:junit:4.12 14:32:14.312 [DEBUG] [org.gradle.api.internal.artifacts.ivyservice.ivyresolve.RepositoryChainComponentMetaDataResolver] Attempting to resolve component for junit:junit:4.12 using repositories [BintrayJCenter, MavenRe po, maven, maven2] 14:32:14.335 [DEBUG] [org.gradle.api.internal.artifacts.ivyservice.ivyresolve.RepositoryChainComponentMetaDataResolver] Using junit:junit:4.12 from Maven repository 'BintrayJCenter' 14:32:14.353 [DEBUG] [org.gradle.api.internal.artifacts.ivyservice.resolveengine.graph.DependencyGraphBuilder] Visiting dependency Scripto:lib:unspecified(_debugUnitTestApk) -> org.hamcrest:hamcrest-core:1.3(testComp ile) 14:32:14.370 [DEBUG] [org.gradle.api.internal.artifacts.ivyservice.resolveengine.graph.DependencyGraphBuilder] Selecting new module version org.hamcrest:hamcrest-core:1.3 14:32:14.392 [DEBUG] [org.gradle.api.internal.artifacts.ivyservice.ivyresolve.RepositoryChainComponentMetaDataResolver] Attempting to resolve component for org.hamcrest:hamcrest-core:1.3 using repositories [BintrayJC enter, MavenRepo, maven, maven2] 14:32:14.413 [DEBUG] [org.gradle.api.internal.artifacts.ivyservice.ivyresolve.RepositoryChainComponentMetaDataResolver] Using org.hamcrest:hamcrest-core:1.3 from Maven repository 'BintrayJCenter' 14:32:14.432 [DEBUG] [org.gradle.api.internal.artifacts.ivyservice.resolveengine.graph.DependencyGraphBuilder] Visiting dependency Scripto:lib:unspecified(_debugUnitTestApk) -> org.hamcrest:hamcrest-library:1.3(testC ompile) 14:32:14.453 [DEBUG] [org.gradle.api.internal.artifacts.ivyservice.resolveengine.graph.DependencyGraphBuilder] Selecting new module version org.hamcrest:hamcrest-library:1.3 14:32:14.474 [DEBUG] [org.gradle.api.internal.artifacts.ivyservice.ivyresolve.RepositoryChainComponentMetaDataResolver] Attempting to resolve component for org.hamcrest:hamcrest-library:1.3 using repositories [Bintra yJCenter, MavenRepo, maven, maven2] 14:32:14.492 [DEBUG] [org.gradle.api.internal.artifacts.ivyservice.ivyresolve.RepositoryChainComponentMetaDataResolver] Using org.hamcrest:hamcrest-library:1.3 from Maven repository 'BintrayJCenter' 14:32:14.509 [DEBUG] [org.gradle.api.internal.artifacts.ivyservice.resolveengine.graph.DependencyGraphBuilder] Visiting dependency Scripto:lib:unspecified(_debugUnitTestApk) -> org.hamcrest:hamcrest-integration:1.3(t estCompile) 14:32:14.527 [DEBUG] [org.gradle.api.internal.artifacts.ivyservice.resolveengine.graph.DependencyGraphBuilder] Selecting new module version org.hamcrest:hamcrest-integration:1.3 14:32:14.542 [DEBUG] [org.gradle.api.internal.artifacts.ivyservice.ivyresolve.RepositoryChainComponentMetaDataResolver] Attempting to resolve component for org.hamcrest:hamcrest-integration:1.3 using repositories [Bi ntrayJCenter, MavenRepo, maven, maven2] 14:32:14.560 [DEBUG] [org.gradle.api.internal.artifacts.ivyservice.ivyresolve.RepositoryChainComponentMetaDataResolver] Using org.hamcrest:hamcrest-integration:1.3 from Maven repository 'BintrayJCenter' 14:32:14.577 [DEBUG] [org.gradle.api.internal.artifacts.ivyservice.resolveengine.graph.DependencyGraphBuilder] Visiting dependency Scripto:lib:unspecified(_debugUnitTestApk) -> org.mockito:mockito-core:1.10.19(testCo mpile) 14:32:14.600 [DEBUG] [org.gradle.api.internal.artifacts.ivyservice.resolveengine.graph.DependencyGraphBuilder] Selecting new module version org.mockito:mockito-core:1.10.19 14:32:14.624 [DEBUG] [org.gradle.api.internal.artifacts.ivyservice.ivyresolve.RepositoryChainComponentMetaDataResolver] Attempting to resolve component for org.mockito:mockito-core:1.10.19 using repositories [Bintray JCenter, MavenRepo, maven, maven2] 14:32:14.643 [DEBUG] [org.gradle.api.internal.artifacts.ivyservice.ivyresolve.RepositoryChainComponentMetaDataResolver] Using org.mockito:mockito-core:1.10.19 from Maven repository 'BintrayJCenter' 14:32:14.660 [DEBUG] [org.gradle.api.internal.artifacts.ivyservice.resolveengine.graph.DependencyGraphBuilder] Visiting dependency Scripto:lib:unspecified(_debugUnitTestApk) -> org.robolectric:robolectric:3.0(testCom pile) 14:32:14.681 [DEBUG] [org.gradle.api.internal.artifacts.ivyservice.resolveengine.graph.DependencyGraphBuilder] Selecting new module version org.robolectric:robolectric:3.0 14:32:14.699 [DEBUG] [org.gradle.api.internal.artifacts.ivyservice.ivyresolve.RepositoryChainComponentMetaDataResolver] Attempting to resolve component for org.robolectric:robolectric:3.0 using repositories [BintrayJ Center, MavenRepo, maven, maven2] 14:32:14.717 [DEBUG] [org.gradle.api.internal.artifacts.ivyservice.ivyresolve.RepositoryChainComponentMetaDataResolver] Using org.robolectric:robolectric:3.0 from Maven repository 'BintrayJCenter' 14:32:14.734 [DEBUG] [org.gradle.api.internal.artifacts.ivyservice.resolveengine.graph.DependencyGraphBuilder] Visiting configuration com.google.code.gson:gson:2.7(default). 14:32:14.753 [DEBUG] [org.gradle.api.internal.artifacts.ivyservice.resolveengine.graph.DependencyGraphBuilder] Visiting configuration junit:junit:4.12(default). 14:32:14.769 [DEBUG] [org.gradle.api.internal.artifacts.ivyservice.resolveengine.graph.DependencyGraphBuilder] Visiting dependency junit:junit:4.12(default) -> org.hamcrest:hamcrest-core:1.3(compile,runtime) 14:32:14.785 [DEBUG] [org.gradle.api.internal.artifacts.ivyservice.resolveengine.graph.DependencyGraphBuilder] Visiting configuration org.hamcrest:hamcrest-core:1.3(default). 14:32:14.802 [DEBUG] [org.gradle.api.internal.artifacts.ivyservice.resolveengine.graph.DependencyGraphBuilder] Visiting configuration org.hamcrest:hamcrest-library:1.3(default). 14:32:14.824 [DEBUG] [org.gradle.api.internal.artifacts.ivyservice.resolveengine.graph.DependencyGraphBuilder] Visiting dependency org.hamcrest:hamcrest-library:1.3(default) -> org.hamcrest:hamcrest-core:1.3(compile, runtime) 14:32:14.844 [DEBUG] [org.gradle.api.internal.artifacts.ivyservice.resolveengine.graph.DependencyGraphBuilder] Visiting configuration org.hamcrest:hamcrest-integration:1.3(default). 14:32:14.859 [DEBUG] [org.gradle.api.internal.artifacts.ivyservice.resolveengine.graph.DependencyGraphBuilder] Visiting dependency org.hamcrest:hamcrest-integration:1.3(default) -> org.hamcrest:hamcrest-library:1.3(c ompile,runtime) 14:32:14.881 [DEBUG] [org.gradle.api.internal.artifacts.ivyservice.resolveengine.graph.DependencyGraphBuilder] Visiting configuration org.mockito:mockito-core:1.10.19(default). 14:32:14.902 [DEBUG] [org.gradle.api.internal.artifacts.ivyservice.resolveengine.graph.DependencyGraphBuilder] Visiting dependency org.mockito:mockito-core:1.10.19(default) -> org.hamcrest:hamcrest-core:1.1(runtime) 14:32:14.926 [DEBUG] [org.gradle.api.internal.artifacts.ivyservice.resolveengine.graph.DependencyGraphBuilder] Found new conflicting module version org.hamcrest:hamcrest-core:1.1 14:32:14.945 [DEBUG] [org.gradle.api.internal.artifacts.ivyservice.resolveengine.graph.DependencyGraphBuilder] Visiting dependency org.mockito:mockito-core:1.10.19(default) -> org.objenesis:objenesis:2.1(runtime) 14:32:14.969 [DEBUG] [org.gradle.api.internal.artifacts.ivyservice.resolveengine.graph.DependencyGraphBuilder] Selecting new module version org.objenesis:objenesis:2.1 14:32:14.986 [DEBUG] [org.gradle.api.internal.artifacts.ivyservice.ivyresolve.RepositoryChainComponentMetaDataResolver] Attempting to resolve component for org.objenesis:objenesis:2.1 using repositories [BintrayJCent er, MavenRepo, maven, maven2] 14:32:15.009 [DEBUG] [org.gradle.api.internal.artifacts.ivyservice.ivyresolve.RepositoryChainComponentMetaDataResolver] Using org.objenesis:objenesis:2.1 from Maven repository 'BintrayJCenter' 14:32:15.032 [DEBUG] [org.gradle.api.internal.artifacts.ivyservice.resolveengine.graph.DependencyGraphBuilder] Visiting configuration org.robolectric:robolectric:3.0(default). 14:32:15.050 [DEBUG] [org.gradle.api.internal.artifacts.ivyservice.resolveengine.graph.DependencyGraphBuilder] Visiting dependency org.robolectric:robolectric:3.0(default) -> junit:junit:4.8.2(compile,runtime) 14:32:15.074 [DEBUG] [org.gradle.api.internal.artifacts.ivyservice.resolveengine.graph.DependencyGraphBuilder] Found new conflicting module version junit:junit:4.8.2 14:32:15.093 [DEBUG] [org.gradle.api.internal.artifacts.ivyservice.resolveengine.graph.DependencyGraphBuilder] Visiting dependency org.robolectric:robolectric:3.0(default) -> org.robolectric:robolectric-annotations:3 .0(compile,runtime) 14:32:15.119 [DEBUG] [org.gradle.api.internal.artifacts.ivyservice.resolveengine.graph.DependencyGraphBuilder] Selecting new module version org.robolectric:robolectric-annotations:3.0 14:32:15.140 [DEBUG] [org.gradle.api.internal.artifacts.ivyservice.ivyresolve.RepositoryChainComponentMetaDataResolver] Attempting to resolve component for org.robolectric:robolectric-annotations:3.0 using repositori es [BintrayJCenter, MavenRepo, maven, maven2] 14:32:15.158 [DEBUG] [org.gradle.api.internal.artifacts.ivyservice.ivyresolve.RepositoryChainComponentMetaDataResolver] Using org.robolectric:robolectric-annotations:3.0 from Maven repository 'BintrayJCenter' 14:32:15.186 [DEBUG] [org.gradle.api.internal.artifacts.ivyservice.resolveengine.graph.DependencyGraphBuilder] Visiting dependency org.robolectric:robolectric:3.0(default) -> org.robolectric:robolectric-resources:3.0 (compile,runtime) 14:32:15.205 [DEBUG] [org.gradle.api.internal.artifacts.ivyservice.resolveengine.graph.DependencyGraphBuilder] Selecting new module version org.robolectric:robolectric-resources:3.0 14:32:15.245 [DEBUG] [org.gradle.api.internal.artifacts.ivyservice.ivyresolve.RepositoryChainComponentMetaDataResolver] Attempting to resolve component for org.robolectric:robolectric-resources:3.0 using repositories [BintrayJCenter, MavenRepo, maven, maven2] 14:32:15.264 [DEBUG] [org.gradle.api.internal.artifacts.ivyservice.ivyresolve.RepositoryChainComponentMetaDataResolver] Using org.robolectric:robolectric-resources:3.0 from Maven repository 'BintrayJCenter' 14:32:15.287 [DEBUG] [org.gradle.api.internal.artifacts.ivyservice.resolveengine.graph.DependencyGraphBuilder] Visiting dependency org.robolectric:robolectric:3.0(default) -> org.robolectric:robolectric-utils:3.0(com pile,runtime) 14:32:15.312 [DEBUG] [org.gradle.api.internal.artifacts.ivyservice.resolveengine.graph.DependencyGraphBuilder] Selecting new module version org.robolectric:robolectric-utils:3.0 14:32:15.330 [DEBUG] [org.gradle.api.internal.artifacts.ivyservice.ivyresolve.RepositoryChainComponentMetaDataResolver] Attempting to resolve component for org.robolectric:robolectric-utils:3.0 using repositories [Bi ntrayJCenter, MavenRepo, maven, maven2] 14:32:15.348 [DEBUG] [org.gradle.api.internal.artifacts.ivyservice.ivyresolve.RepositoryChainComponentMetaDataResolver] Using org.robolectric:robolectric-utils:3.0 from Maven repository 'BintrayJCenter' 14:32:15.371 [DEBUG] [org.gradle.api.internal.artifacts.ivyservice.resolveengine.graph.DependencyGraphBuilder] Visiting dependency org.robolectric:robolectric:3.0(default) -> org.robolectric:shadows-core:3.0(compile, runtime) 14:32:15.389 [DEBUG] [org.gradle.api.internal.artifacts.ivyservice.resolveengine.graph.DependencyGraphBuilder] Selecting new module version org.robolectric:shadows-core:3.0 14:32:15.413 [DEBUG] [org.gradle.api.internal.artifacts.ivyservice.ivyresolve.RepositoryChainComponentMetaDataResolver] Attempting to resolve component for org.robolectric:shadows-core:3.0 using repositories [Bintray JCenter, MavenRepo, maven, maven2] 14:32:15.431 [DEBUG] [org.gradle.api.internal.artifacts.ivyservice.ivyresolve.RepositoryChainComponentMetaDataResolver] Using org.robolectric:shadows-core:3.0 from Maven repository 'BintrayJCenter' 14:32:15.451 [DEBUG] [org.gradle.api.internal.artifacts.ivyservice.resolveengine.graph.DependencyGraphBuilder] Visiting dependency org.robolectric:robolectric:3.0(default) -> org.bouncycastle:bcprov-jdk16:1.46(compil e,runtime) 14:32:15.467 [DEBUG] [org.gradle.api.internal.artifacts.ivyservice.resolveengine.graph.DependencyGraphBuilder] Selecting new module version org.bouncycastle:bcprov-jdk16:1.46 14:32:15.487 [DEBUG] [org.gradle.api.internal.artifacts.ivyservice.ivyresolve.RepositoryChainComponentMetaDataResolver] Attempting to resolve component for org.bouncycastle:bcprov-jdk16:1.46 using repositories [Bintr ayJCenter, MavenRepo, maven, maven2] 14:32:15.507 [DEBUG] [org.gradle.api.internal.artifacts.ivyservice.ivyresolve.RepositoryChainComponentMetaDataResolver] Using org.bouncycastle:bcprov-jdk16:1.46 from Maven repository 'BintrayJCenter' 14:32:15.529 [DEBUG] [org.gradle.api.internal.artifacts.ivyservice.resolveengine.graph.DependencyGraphBuilder] Visiting dependency org.robolectric:robolectric:3.0(default) -> org.ow2.asm:asm:5.0.1(compile,runtime) 14:32:15.546 [DEBUG] [org.gradle.api.internal.artifacts.ivyservice.resolveengine.graph.DependencyGraphBuilder] Selecting new module version org.ow2.asm:asm:5.0.1 14:32:15.562 [DEBUG] [org.gradle.api.internal.artifacts.ivyservice.ivyresolve.RepositoryChainComponentMetaDataResolver] Attempting to resolve component for org.ow2.asm:asm:5.0.1 using repositories [BintrayJCenter, Ma venRepo, maven, maven2] 14:32:15.578 [DEBUG] [org.gradle.api.internal.artifacts.ivyservice.ivyresolve.RepositoryChainComponentMetaDataResolver] Using org.ow2.asm:asm:5.0.1 from Maven repository 'BintrayJCenter' 14:32:15.596 [DEBUG] [org.gradle.api.internal.artifacts.ivyservice.resolveengine.graph.DependencyGraphBuilder] Visiting dependency org.robolectric:robolectric:3.0(default) -> org.ow2.asm:asm-commons:5.0.1(compile,run time) 14:32:15.619 [DEBUG] [org.gradle.api.internal.artifacts.ivyservice.resolveengine.graph.DependencyGraphBuilder] Selecting new module version org.ow2.asm:asm-commons:5.0.1 14:32:15.634 [DEBUG] [org.gradle.api.internal.artifacts.ivyservice.ivyresolve.RepositoryChainComponentMetaDataResolver] Attempting to resolve component for org.ow2.asm:asm-commons:5.0.1 using repositories [BintrayJCe nter, MavenRepo, maven, maven2] 14:32:15.656 [DEBUG] [org.gradle.api.internal.artifacts.ivyservice.ivyresolve.RepositoryChainComponentMetaDataResolver] Using org.ow2.asm:asm-commons:5.0.1 from Maven repository 'BintrayJCenter' 14:32:15.676 [DEBUG] [org.gradle.api.internal.artifacts.ivyservice.resolveengine.graph.DependencyGraphBuilder] Visiting dependency org.robolectric:robolectric:3.0(default) -> org.ow2.asm:asm-util:5.0.1(compile,runtim e) 14:32:15.698 [DEBUG] [org.gradle.api.internal.artifacts.ivyservice.resolveengine.graph.DependencyGraphBuilder] Selecting new module version org.ow2.asm:asm-util:5.0.1 14:32:15.721 [DEBUG] [org.gradle.api.internal.artifacts.ivyservice.ivyresolve.RepositoryChainComponentMetaDataResolver] Attempting to resolve component for org.ow2.asm:asm-util:5.0.1 using repositories [BintrayJCente r, MavenRepo, maven, maven2] 14:32:15.744 [DEBUG] [org.gradle.api.internal.artifacts.ivyservice.ivyresolve.RepositoryChainComponentMetaDataResolver] Using org.ow2.asm:asm-util:5.0.1 from Maven repository 'BintrayJCenter' 14:32:15.763 [DEBUG] [org.gradle.api.internal.artifacts.ivyservice.resolveengine.graph.DependencyGraphBuilder] Visiting dependency org.robolectric:robolectric:3.0(default) -> org.ow2.asm:asm-analysis:5.0.1(compile,ru ntime) 14:32:15.785 [DEBUG] [org.gradle.api.internal.artifacts.ivyservice.resolveengine.graph.DependencyGraphBuilder] Selecting new module version org.ow2.asm:asm-analysis:5.0.1 14:32:15.808 [DEBUG] [org.gradle.api.internal.artifacts.ivyservice.ivyresolve.RepositoryChainComponentMetaDataResolver] Attempting to resolve component for org.ow2.asm:asm-analysis:5.0.1 using repositories [BintrayJC enter, MavenRepo, maven, maven2] 14:32:15.840 [DEBUG] [org.gradle.api.internal.artifacts.ivyservice.ivyresolve.RepositoryChainComponentMetaDataResolver] Using org.ow2.asm:asm-analysis:5.0.1 from Maven repository 'BintrayJCenter' 14:32:15.861 [DEBUG] [org.gradle.api.internal.artifacts.ivyservice.resolveengine.graph.DependencyGraphBuilder] Visiting dependency org.robolectric:robolectric:3.0(default) -> com.ximpleware:vtd-xml:2.11(compile,runti me) 14:32:15.883 [DEBUG] [org.gradle.api.internal.artifacts.ivyservice.resolveengine.graph.DependencyGraphBuilder] Selecting new module version com.ximpleware:vtd-xml:2.11 14:32:15.906 [DEBUG] [org.gradle.api.internal.artifacts.ivyservice.ivyresolve.RepositoryChainComponentMetaDataResolver] Attempting to resolve component for com.ximpleware:vtd-xml:2.11 using repositories [BintrayJCent er, MavenRepo, maven, maven2] 14:32:15.932 [DEBUG] [org.gradle.api.internal.artifacts.ivyservice.ivyresolve.RepositoryChainComponentMetaDataResolver] Using com.ximpleware:vtd-xml:2.11 from Maven repository 'BintrayJCenter' 14:32:15.949 [DEBUG] [org.gradle.api.internal.artifacts.ivyservice.resolveengine.graph.DependencyGraphBuilder] Visiting dependency org.robolectric:robolectric:3.0(default) -> org.apache.maven:maven-ant-tasks:2.1.3(co mpile,runtime) 14:32:15.973 [DEBUG] [org.gradle.api.internal.artifacts.ivyservice.resolveengine.graph.DependencyGraphBuilder] Selecting new module version org.apache.maven:maven-ant-tasks:2.1.3 14:32:15.996 [DEBUG] [org.gradle.api.internal.artifacts.ivyservice.ivyresolve.RepositoryChainComponentMetaDataResolver] Attempting to resolve component for org.apache.maven:maven-ant-tasks:2.1.3 using repositories [B intrayJCenter, MavenRepo, maven, maven2] 14:32:16.023 [DEBUG] [org.gradle.api.internal.artifacts.ivyservice.ivyresolve.RepositoryChainComponentMetaDataResolver] Using org.apache.maven:maven-ant-tasks:2.1.3 from Maven repository 'BintrayJCenter' 14:32:16.044 [DEBUG] [org.gradle.api.internal.artifacts.ivyservice.resolveengine.graph.DependencyGraphBuilder] Visiting dependency org.robolectric:robolectric:3.0(default) -> org.apache.ant:ant:1.8.0(compile,runtime) 14:32:16.065 [DEBUG] [org.gradle.api.internal.artifacts.ivyservice.resolveengine.graph.DependencyGraphBuilder] Selecting new module version org.apache.ant:ant:1.8.0 14:32:16.083 [DEBUG] [org.gradle.api.internal.artifacts.ivyservice.ivyresolve.RepositoryChainComponentMetaDataResolver] Attempting to resolve component for org.apache.ant:ant:1.8.0 using repositories [BintrayJCenter, MavenRepo, maven, maven2] 14:32:16.102 [DEBUG] [org.gradle.api.internal.artifacts.ivyservice.ivyresolve.RepositoryChainComponentMetaDataResolver] Using org.apache.ant:ant:1.8.0 from Maven repository 'BintrayJCenter' 14:32:16.121 [DEBUG] [org.gradle.api.internal.artifacts.ivyservice.resolveengine.graph.DependencyGraphBuilder] Visiting configuration org.hamcrest:hamcrest-core:1.3(compile). 14:32:16.140 [DEBUG] [org.gradle.api.internal.artifacts.ivyservice.resolveengine.graph.DependencyGraphBuilder] version for org.hamcrest:hamcrest-core:1.3(compile) is not selected. ignoring. 14:32:16.160 [DEBUG] [org.gradle.api.internal.artifacts.ivyservice.resolveengine.graph.DependencyGraphBuilder] Visiting configuration org.hamcrest:hamcrest-core:1.3(master). 14:32:16.182 [DEBUG] [org.gradle.api.internal.artifacts.ivyservice.resolveengine.graph.DependencyGraphBuilder] version for org.hamcrest:hamcrest-core:1.3(master) is not selected. ignoring. 14:32:16.200 [DEBUG] [org.gradle.api.internal.artifacts.ivyservice.resolveengine.graph.DependencyGraphBuilder] Visiting configuration org.hamcrest:hamcrest-core:1.3(runtime). 14:32:16.225 [DEBUG] [org.gradle.api.internal.artifacts.ivyservice.resolveengine.graph.DependencyGraphBuilder] version for org.hamcrest:hamcrest-core:1.3(runtime) is not selected. ignoring. 14:32:16.247 [DEBUG] [org.gradle.api.internal.artifacts.ivyservice.resolveengine.graph.DependencyGraphBuilder] Visiting configuration org.hamcrest:hamcrest-library:1.3(compile). 14:32:16.266 [DEBUG] [org.gradle.api.internal.artifacts.ivyservice.resolveengine.graph.DependencyGraphBuilder] Visiting dependency org.hamcrest:hamcrest-library:1.3(compile) -> org.hamcrest:hamcrest-core:1.3(compile, runtime) 14:32:16.290 [DEBUG] [org.gradle.api.internal.artifacts.ivyservice.resolveengine.graph.DependencyGraphBuilder] Visiting configuration org.hamcrest:hamcrest-library:1.3(master). 14:32:16.313 [DEBUG] [org.gradle.api.internal.artifacts.ivyservice.resolveengine.graph.DependencyGraphBuilder] Visiting configuration org.hamcrest:hamcrest-library:1.3(runtime). 14:32:16.333 [DEBUG] [org.gradle.api.internal.artifacts.ivyservice.resolveengine.graph.DependencyGraphBuilder] Visiting dependency org.hamcrest:hamcrest-library:1.3(runtime) -> org.hamcrest:hamcrest-core:1.3(compile, runtime) 14:32:16.353 [DEBUG] [org.gradle.api.internal.artifacts.ivyservice.resolveengine.graph.DependencyGraphBuilder] Visiting configuration org.objenesis:objenesis:2.1(compile). 14:32:16.376 [DEBUG] [org.gradle.api.internal.artifacts.ivyservice.resolveengine.graph.DependencyGraphBuilder] Visiting configuration org.objenesis:objenesis:2.1(runtime). 14:32:16.395 [DEBUG] [org.gradle.api.internal.artifacts.ivyservice.resolveengine.graph.DependencyGraphBuilder] Visiting configuration org.objenesis:objenesis:2.1(master). 14:32:16.415 [DEBUG] [org.gradle.api.internal.artifacts.ivyservice.resolveengine.graph.DependencyGraphBuilder] Visiting configuration org.robolectric:robolectric-annotations:3.0(compile). 14:32:16.435 [DEBUG] [org.gradle.api.internal.artifacts.ivyservice.resolveengine.graph.DependencyGraphBuilder] Visiting configuration org.robolectric:robolectric-annotations:3.0(master). 14:32:16.457 [DEBUG] [org.gradle.api.internal.artifacts.ivyservice.resolveengine.graph.DependencyGraphBuilder] Visiting configuration org.robolectric:robolectric-annotations:3.0(runtime). 14:32:16.475 [DEBUG] [org.gradle.api.internal.artifacts.ivyservice.resolveengine.graph.DependencyGraphBuilder] Visiting configuration org.robolectric:robolectric-resources:3.0(compile). 14:32:16.493 [DEBUG] [org.gradle.api.internal.artifacts.ivyservice.resolveengine.graph.DependencyGraphBuilder] Visiting dependency org.robolectric:robolectric-resources:3.0(compile) -> org.robolectric:robolectric-uti ls:3.0(compile,runtime) 14:32:16.512 [DEBUG] [org.gradle.api.internal.artifacts.ivyservice.resolveengine.graph.DependencyGraphBuilder] Visiting dependency org.robolectric:robolectric-resources:3.0(compile) -> org.robolectric:robolectric-ann otations:3.0(compile,runtime) 14:32:16.532 [DEBUG] [org.gradle.api.internal.artifacts.ivyservice.resolveengine.graph.DependencyGraphBuilder] Visiting dependency org.robolectric:robolectric-resources:3.0(compile) -> com.ximpleware:vtd-xml:2.11(com pile,runtime) 14:32:16.555 [DEBUG] [org.gradle.api.internal.artifacts.ivyservice.resolveengine.graph.DependencyGraphBuilder] Visiting configuration org.robolectric:robolectric-resources:3.0(master). 14:32:16.573 [DEBUG] [org.gradle.api.internal.artifacts.ivyservice.resolveengine.graph.DependencyGraphBuilder] Visiting configuration org.robolectric:robolectric-resources:3.0(runtime). 14:32:16.592 [DEBUG] [org.gradle.api.internal.artifacts.ivyservice.resolveengine.graph.DependencyGraphBuilder] Visiting dependency org.robolectric:robolectric-resources:3.0(runtime) -> org.robolectric:robolectric-uti ls:3.0(compile,runtime) 14:32:16.609 [DEBUG] [org.gradle.api.internal.artifacts.ivyservice.resolveengine.graph.DependencyGraphBuilder] Visiting dependency org.robolectric:robolectric-resources:3.0(runtime) -> org.robolectric:robolectric-ann otations:3.0(compile,runtime) 14:32:16.629 [DEBUG] [org.gradle.api.internal.artifacts.ivyservice.resolveengine.graph.DependencyGraphBuilder] Visiting dependency org.robolectric:robolectric-resources:3.0(runtime) -> com.ximpleware:vtd-xml:2.11(com pile,runtime) 14:32:16.647 [DEBUG] [org.gradle.api.internal.artifacts.ivyservice.resolveengine.graph.DependencyGraphBuilder] Visiting configuration org.robolectric:robolectric-utils:3.0(compile). 14:32:16.665 [DEBUG] [org.gradle.api.internal.artifacts.ivyservice.resolveengine.graph.DependencyGraphBuilder] Visiting dependency org.robolectric:robolectric-utils:3.0(compile) -> org.robolectric:robolectric-annotat ions:3.0(compile,runtime) 14:32:16.685 [DEBUG] [org.gradle.api.internal.artifacts.ivyservice.resolveengine.graph.DependencyGraphBuilder] Visiting dependency org.robolectric:robolectric-utils:3.0(compile) -> com.google.android.apps.common.test ing.accessibility.framework:accessibility-test-framework:1.0(compile,runtime) 14:32:16.703 [DEBUG] [org.gradle.api.internal.artifacts.ivyservice.resolveengine.graph.DependencyGraphBuilder] Selecting new module version com.google.android.apps.common.testing.accessibility.framework:accessibility -test-framework:1.0 14:32:16.723 [DEBUG] [org.gradle.api.internal.artifacts.ivyservice.ivyresolve.RepositoryChainComponentMetaDataResolver] Attempting to resolve component for com.google.android.apps.common.testing.accessibility.framewo rk:accessibility-test-framework:1.0 using repositories [BintrayJCenter, MavenRepo, maven, maven2] 14:32:16.743 [DEBUG] [org.gradle.api.internal.artifacts.ivyservice.ivyresolve.RepositoryChainComponentMetaDataResolver] Using com.google.android.apps.common.testing.accessibility.framework:accessibility-test-framewor k:1.0 from Maven repository 'BintrayJCenter' 14:32:16.765 [DEBUG] [org.gradle.api.internal.artifacts.ivyservice.resolveengine.graph.DependencyGraphBuilder] Visiting configuration org.robolectric:robolectric-utils:3.0(master). 14:32:16.783 [DEBUG] [org.gradle.api.internal.artifacts.ivyservice.resolveengine.graph.DependencyGraphBuilder] Visiting configuration org.robolectric:robolectric-utils:3.0(runtime). 14:32:16.801 [DEBUG] [org.gradle.api.internal.artifacts.ivyservice.resolveengine.graph.DependencyGraphBuilder] Visiting dependency org.robolectric:robolectric-utils:3.0(runtime) -> org.robolectric:robolectric-annotat ions:3.0(compile,runtime) 14:32:16.818 [DEBUG] [org.gradle.api.internal.artifacts.ivyservice.resolveengine.graph.DependencyGraphBuilder] Visiting dependency org.robolectric:robolectric-utils:3.0(runtime) -> com.google.android.apps.common.test ing.accessibility.framework:accessibility-test-framework:1.0(compile,runtime) 14:32:16.844 [DEBUG] [org.gradle.api.internal.artifacts.ivyservice.resolveengine.graph.DependencyGraphBuilder] Visiting configuration org.robolectric:shadows-core:3.0(compile). 14:32:16.866 [DEBUG] [org.gradle.api.internal.artifacts.ivyservice.resolveengine.graph.DependencyGraphBuilder] Visiting dependency org.robolectric:shadows-core:3.0(compile) -> org.robolectric:robolectric-annotations: 3.0(compile,runtime) 14:32:16.884 [DEBUG] [org.gradle.api.internal.artifacts.ivyservice.resolveengine.graph.DependencyGraphBuilder] Visiting dependency org.robolectric:shadows-core:3.0(compile) -> org.robolectric:robolectric-utils:3.0(co mpile,runtime) 14:32:16.905 [DEBUG] [org.gradle.api.internal.artifacts.ivyservice.resolveengine.graph.DependencyGraphBuilder] Visiting dependency org.robolectric:shadows-core:3.0(compile) -> org.robolectric:robolectric-resources:3. 0(compile,runtime) 14:32:16.923 [DEBUG] [org.gradle.api.internal.artifacts.ivyservice.resolveengine.graph.DependencyGraphBuilder] Visiting dependency org.robolectric:shadows-core:3.0(compile) -> com.ibm.icu:icu4j:53.1(compile,runtime) 14:32:16.942 [DEBUG] [org.gradle.api.internal.artifacts.ivyservice.resolveengine.graph.DependencyGraphBuilder] Selecting new module version com.ibm.icu:icu4j:53.1 14:32:16.961 [DEBUG] [org.gradle.api.internal.artifacts.ivyservice.ivyresolve.RepositoryChainComponentMetaDataResolver] Attempting to resolve component for com.ibm.icu:icu4j:53.1 using repositories [BintrayJCenter, M avenRepo, maven, maven2] 14:32:16.978 [DEBUG] [org.gradle.api.internal.artifacts.ivyservice.ivyresolve.RepositoryChainComponentMetaDataResolver] Using com.ibm.icu:icu4j:53.1 from Maven repository 'BintrayJCenter' 14:32:16.999 [DEBUG] [org.gradle.api.internal.artifacts.ivyservice.resolveengine.graph.DependencyGraphBuilder] Visiting dependency org.robolectric:shadows-core:3.0(compile) -> com.almworks.sqlite4java:sqlite4java:0.2 82(compile,runtime) 14:32:17.017 [DEBUG] [org.gradle.api.internal.artifacts.ivyservice.resolveengine.graph.DependencyGraphBuilder] Selecting new module version com.almworks.sqlite4java:sqlite4java:0.282 14:32:17.035 [DEBUG] [org.gradle.api.internal.artifacts.ivyservice.ivyresolve.RepositoryChainComponentMetaDataResolver] Attempting to resolve component for com.almworks.sqlite4java:sqlite4java:0.282 using repositorie s [BintrayJCenter, MavenRepo, maven, maven2] 14:32:17.053 [DEBUG] [org.gradle.api.internal.artifacts.ivyservice.ivyresolve.RepositoryChainComponentMetaDataResolver] Using com.almworks.sqlite4java:sqlite4java:0.282 from Maven repository 'BintrayJCenter' 14:32:17.074 [DEBUG] [org.gradle.api.internal.artifacts.ivyservice.resolveengine.graph.DependencyGraphBuilder] Visiting configuration org.robolectric:shadows-core:3.0(master). 14:32:17.094 [DEBUG] [org.gradle.api.internal.artifacts.ivyservice.resolveengine.graph.DependencyGraphBuilder] Visiting configuration org.robolectric:shadows-core:3.0(runtime). 14:32:17.115 [DEBUG] [org.gradle.api.internal.artifacts.ivyservice.resolveengine.graph.DependencyGraphBuilder] Visiting dependency org.robolectric:shadows-core:3.0(runtime) -> org.robolectric:robolectric-annotations: 3.0(compile,runtime) 14:32:17.131 [DEBUG] [org.gradle.api.internal.artifacts.ivyservice.resolveengine.graph.DependencyGraphBuilder] Visiting dependency org.robolectric:shadows-core:3.0(runtime) -> org.robolectric:robolectric-utils:3.0(co mpile,runtime) 14:32:17.153 [DEBUG] [org.gradle.api.internal.artifacts.ivyservice.resolveengine.graph.DependencyGraphBuilder] Visiting dependency org.robolectric:shadows-core:3.0(runtime) -> org.robolectric:robolectric-resources:3. 0(compile,runtime) 14:32:17.169 [DEBUG] [org.gradle.api.internal.artifacts.ivyservice.resolveengine.graph.DependencyGraphBuilder] Visiting dependency org.robolectric:shadows-core:3.0(runtime) -> com.ibm.icu:icu4j:53.1(compile,runtime) 14:32:17.188 [DEBUG] [org.gradle.api.internal.artifacts.ivyservice.resolveengine.graph.DependencyGraphBuilder] Visiting dependency org.robolectric:shadows-core:3.0(runtime) -> com.almworks.sqlite4java:sqlite4java:0.2 82(compile,runtime) 14:32:17.212 [DEBUG] [org.gradle.api.internal.artifacts.ivyservice.resolveengine.graph.DependencyGraphBuilder] Visiting configuration org.bouncycastle:bcprov-jdk16:1.46(compile). 14:32:17.231 [DEBUG] [org.gradle.api.internal.artifacts.ivyservice.resolveengine.graph.DependencyGraphBuilder] Visiting configuration org.bouncycastle:bcprov-jdk16:1.46(master). 14:32:17.250 [DEBUG] [org.gradle.api.internal.artifacts.ivyservice.resolveengine.graph.DependencyGraphBuilder] Visiting configuration org.bouncycastle:bcprov-jdk16:1.46(runtime). 14:32:17.268 [DEBUG] [org.gradle.api.internal.artifacts.ivyservice.resolveengine.graph.DependencyGraphBuilder] Visiting configuration org.ow2.asm:asm:5.0.1(compile). 14:32:17.290 [DEBUG] [org.gradle.api.internal.artifacts.ivyservice.resolveengine.graph.DependencyGraphBuilder] Visiting configuration org.ow2.asm:asm:5.0.1(master). 14:32:17.314 [DEBUG] [org.gradle.api.internal.artifacts.ivyservice.resolveengine.graph.DependencyGraphBuilder] Visiting configuration org.ow2.asm:asm:5.0.1(runtime). 14:32:17.337 [DEBUG] [org.gradle.api.internal.artifacts.ivyservice.resolveengine.graph.DependencyGraphBuilder] Visiting configuration org.ow2.asm:asm-commons:5.0.1(compile). 14:32:17.359 [DEBUG] [org.gradle.api.internal.artifacts.ivyservice.resolveengine.graph.DependencyGraphBuilder] Visiting dependency org.ow2.asm:asm-commons:5.0.1(compile) -> org.ow2.asm:asm-tree:5.0.1(compile,runtime) 14:32:17.381 [DEBUG] [org.gradle.api.internal.artifacts.ivyservice.resolveengine.graph.DependencyGraphBuilder] Selecting new module version org.ow2.asm:asm-tree:5.0.1 14:32:17.399 [DEBUG] [org.gradle.api.internal.artifacts.ivyservice.ivyresolve.RepositoryChainComponentMetaDataResolver] Attempting to resolve component for org.ow2.asm:asm-tree:5.0.1 using repositories [BintrayJCente r, MavenRepo, maven, maven2] 14:32:17.422 [DEBUG] [org.gradle.api.internal.artifacts.ivyservice.ivyresolve.RepositoryChainComponentMetaDataResolver] Using org.ow2.asm:asm-tree:5.0.1 from Maven repository 'BintrayJCenter' 14:32:17.443 [DEBUG] [org.gradle.api.internal.artifacts.ivyservice.resolveengine.graph.DependencyGraphBuilder] Visiting configuration org.ow2.asm:asm-commons:5.0.1(master). 14:32:17.462 [DEBUG] [org.gradle.api.internal.artifacts.ivyservice.resolveengine.graph.DependencyGraphBuilder] Visiting configuration org.ow2.asm:asm-commons:5.0.1(runtime). 14:32:17.482 [DEBUG] [org.gradle.api.internal.artifacts.ivyservice.resolveengine.graph.DependencyGraphBuilder] Visiting dependency org.ow2.asm:asm-commons:5.0.1(runtime) -> org.ow2.asm:asm-tree:5.0.1(compile,runtime) 14:32:17.500 [DEBUG] [org.gradle.api.internal.artifacts.ivyservice.resolveengine.graph.DependencyGraphBuilder] Visiting configuration org.ow2.asm:asm-util:5.0.1(compile). 14:32:17.521 [DEBUG] [org.gradle.api.internal.artifacts.ivyservice.resolveengine.graph.DependencyGraphBuilder] Visiting dependency org.ow2.asm:asm-util:5.0.1(compile) -> org.ow2.asm:asm-tree:5.0.1(compile,runtime) 14:32:17.541 [DEBUG] [org.gradle.api.internal.artifacts.ivyservice.resolveengine.graph.DependencyGraphBuilder] Visiting configuration org.ow2.asm:asm-util:5.0.1(master). 14:32:17.583 [DEBUG] [org.gradle.api.internal.artifacts.ivyservice.resolveengine.graph.DependencyGraphBuilder] Visiting dependency org.ow2.asm:asm-util:5.0.1(runtime) -> org.ow2.asm:asm-tree:5.0.1(compile,runtime) 14:33:02.509 [ERROR] [org.gradle.BuildExceptionReporter] ... 52 more 14:33:02.526 [ERROR] [org.gradle.BuildExceptionReporter] 14:33:02.544 [LIFECYCLE] [org.gradle.BuildResultLogger] 14:33:02.562 [LIFECYCLE] [org.gradle.BuildResultLogger] BUILD FAILED 14:33:02.580 [LIFECYCLE] [org.gradle.BuildResultLogger] 14:33:02.598 [LIFECYCLE] [org.gradle.BuildResultLogger] Total time: 1 mins 53.785 secs 14:33:02.681 [DEBUG] [org.gradle.cache.internal.DefaultFileLockManager] Releasing lock on cp_settings class cache for settings file 'E:\Mahach\AndroidDeveloment\Wokspaces\github\Scripto\settings.gradle' (C:\Users\Adm in\.gradle\caches\2.10\scripts\settings_8mh2wdhkvgy1pcre30q7cguhv\cp_settings). 14:33:02.688 [DEBUG] [org.gradle.cache.internal.DefaultFileLockManager] Releasing lock on settings class cache for settings file 'E:\Mahach\AndroidDeveloment\Wokspaces\github\Scripto\settings.gradle' (C:\Users\Admin\ .gradle\caches\2.10\scripts\settings_8mh2wdhkvgy1pcre30q7cguhv\settings). 14:33:02.695 [DEBUG] [org.gradle.cache.internal.DefaultFileLockManager] Releasing lock on cp_proj class cache for build file 'E:\Mahach\AndroidDeveloment\Wokspaces\github\Scripto\build.gradle' (C:\Users\Admin\.gradle \caches\2.10\scripts\build_2nktvkj5walcjc0tahztvpz8e\cp_proj). 14:33:02.703 [DEBUG] [org.gradle.cache.internal.DefaultFileLockManager] Releasing lock on proj class cache for build file 'E:\Mahach\AndroidDeveloment\Wokspaces\github\Scripto\build.gradle' (C:\Users\Admin\.gradle\ca ches\2.10\scripts\build_2nktvkj5walcjc0tahztvpz8e\proj). 14:33:02.711 [DEBUG] [org.gradle.cache.internal.DefaultFileLockManager] Releasing lock on cp_proj class cache for build file 'E:\Mahach\AndroidDeveloment\Wokspaces\github\Scripto\app\build.gradle' (C:\Users\Admin\.gr adle\caches\2.10\scripts\build_3q67wq1zmz22rxgw6xjta0uqi\cp_proj). 14:33:02.718 [DEBUG] [org.gradle.cache.internal.DefaultFileLockManager] Releasing lock on proj class cache for build file 'E:\Mahach\AndroidDeveloment\Wokspaces\github\Scripto\app\build.gradle' (C:\Users\Admin\.gradl e\caches\2.10\scripts\build_3q67wq1zmz22rxgw6xjta0uqi\proj). 14:33:02.725 [DEBUG] [org.gradle.cache.internal.DefaultFileLockManager] Releasing lock on cp_proj class cache for build file 'E:\Mahach\AndroidDeveloment\Wokspaces\github\Scripto\lib\build.gradle' (C:\Users\Admin\.gr adle\caches\2.10\scripts\build_d0uuewuob0v77uv3o3peswl81\cp_proj). 14:33:02.734 [DEBUG] [org.gradle.cache.internal.DefaultFileLockManager] Releasing lock on proj class cache for build file 'E:\Mahach\AndroidDeveloment\Wokspaces\github\Scripto\lib\build.gradle' (C:\Users\Admin\.gradl e\caches\2.10\scripts\build_d0uuewuob0v77uv3o3peswl81\proj). 14:33:02.745 [DEBUG] [org.gradle.cache.internal.DefaultCacheAccess] Cache artifact cache (C:\Users\Admin\.gradle\caches\modules-2) was closed 4 times. 14:33:02.753 [DEBUG] [org.gradle.api.internal.artifacts.ivyservice.ivyresolve.memcache.InMemoryCachedRepositoryFactory] In-memory dependency metadata cache closed. Repos cached: 57, cache instances: 4, modules served from cache: 112, artifacts: 33 14:33:03.097 [DEBUG] [org.gradle.api.internal.artifacts.ivyservice.resolveengine.store.CachedStoreFactory] Resolution result cache closed. Cache reads: 0, disk reads: 0 (avg: 0.0 secs, total: 0.0 secs) 14:33:03.108 [DEBUG] [org.gradle.api.internal.artifacts.ivyservice.resolveengine.store.CachedStoreFactory] Resolution result cache closed. Cache reads: 0, disk reads: 14 (avg: 0.024 secs, total: 0.344 secs) 14:33:03.121 [DEBUG] [org.gradle.api.internal.artifacts.ivyservice.resolveengine.store.ResolutionResultsStoreFactory] Deleted 2 resolution results binary files in 0.362 secs 14:33:03.130 [DEBUG] [org.gradle.cache.internal.DefaultCacheAccess] Cache Plugin Resolution Cache (C:\Users\Admin\.gradle\caches\2.10\plugin-resolution) was closed 0 times. 14:33:03.139 [DEBUG] [org.gradle.api.internal.tasks.compile.daemon.CompilerDaemonManager] Stopping 0 compiler daemon(s). 14:33:03.151 [INFO] [org.gradle.api.internal.tasks.compile.daemon.CompilerDaemonManager] Stopped 0 compiler daemon(s).
Optional Paste Settings
Category:
None
Cryptocurrency
Cybersecurity
Fixit
Food
Gaming
Haiku
Help
History
Housing
Jokes
Legal
Money
Movies
Music
Pets
Photo
Science
Software
Source Code
Spirit
Sports
Travel
TV
Writing
Tags:
Syntax Highlighting:
None
Bash
C
C#
C++
CSS
HTML
JSON
Java
JavaScript
Lua
Markdown (PRO members only)
Objective C
PHP
Perl
Python
Ruby
Swift
4CS
6502 ACME Cross Assembler
6502 Kick Assembler
6502 TASM/64TASS
ABAP
AIMMS
ALGOL 68
APT Sources
ARM
ASM (NASM)
ASP
ActionScript
ActionScript 3
Ada
Apache Log
AppleScript
Arduino
Asymptote
AutoIt
Autohotkey
Avisynth
Awk
BASCOM AVR
BNF
BOO
Bash
Basic4GL
Batch
BibTeX
Blitz Basic
Blitz3D
BlitzMax
BrainFuck
C
C (WinAPI)
C Intermediate Language
C for Macs
C#
C++
C++ (WinAPI)
C++ (with Qt extensions)
C: Loadrunner
CAD DCL
CAD Lisp
CFDG
CMake
COBOL
CSS
Ceylon
ChaiScript
Chapel
Clojure
Clone C
Clone C++
CoffeeScript
ColdFusion
Cuesheet
D
DCL
DCPU-16
DCS
DIV
DOT
Dart
Delphi
Delphi Prism (Oxygene)
Diff
E
ECMAScript
EPC
Easytrieve
Eiffel
Email
Erlang
Euphoria
F#
FO Language
Falcon
Filemaker
Formula One
Fortran
FreeBasic
FreeSWITCH
GAMBAS
GDB
GDScript
Game Maker
Genero
Genie
GetText
Go
Godot GLSL
Groovy
GwBasic
HQ9 Plus
HTML
HTML 5
Haskell
Haxe
HicEst
IDL
INI file
INTERCAL
IO
ISPF Panel Definition
Icon
Inno Script
J
JCL
JSON
Java
Java 5
JavaScript
Julia
KSP (Kontakt Script)
KiXtart
Kotlin
LDIF
LLVM
LOL Code
LScript
Latex
Liberty BASIC
Linden Scripting
Lisp
Loco Basic
Logtalk
Lotus Formulas
Lotus Script
Lua
M68000 Assembler
MIX Assembler
MK-61/52
MPASM
MXML
MagikSF
Make
MapBasic
Markdown (PRO members only)
MatLab
Mercury
MetaPost
Modula 2
Modula 3
Motorola 68000 HiSoft Dev
MySQL
Nagios
NetRexx
Nginx
Nim
NullSoft Installer
OCaml
OCaml Brief
Oberon 2
Objeck Programming Langua
Objective C
Octave
Open Object Rexx
OpenBSD PACKET FILTER
OpenGL Shading
Openoffice BASIC
Oracle 11
Oracle 8
Oz
PARI/GP
PCRE
PHP
PHP Brief
PL/I
PL/SQL
POV-Ray
ParaSail
Pascal
Pawn
Per
Perl
Perl 6
Phix
Pic 16
Pike
Pixel Bender
PostScript
PostgreSQL
PowerBuilder
PowerShell
ProFTPd
Progress
Prolog
Properties
ProvideX
Puppet
PureBasic
PyCon
Python
Python for S60
QBasic
QML
R
RBScript
REBOL
REG
RPM Spec
Racket
Rails
Rexx
Robots
Roff Manpage
Ruby
Ruby Gnuplot
Rust
SAS
SCL
SPARK
SPARQL
SQF
SQL
SSH Config
Scala
Scheme
Scilab
SdlBasic
Smalltalk
Smarty
StandardML
StoneScript
SuperCollider
Swift
SystemVerilog
T-SQL
TCL
TeXgraph
Tera Term
TypeScript
TypoScript
UPC
Unicon
UnrealScript
Urbi
VB.NET
VBScript
VHDL
VIM
Vala
Vedit
VeriLog
Visual Pro Log
VisualBasic
VisualFoxPro
WHOIS
WhiteSpace
Winbatch
XBasic
XML
XPP
Xojo
Xorg Config
YAML
YARA
Z80 Assembler
ZXBasic
autoconf
jQuery
mIRC
newLISP
q/kdb+
thinBasic
Paste Expiration:
Never
Burn after read
10 Minutes
1 Hour
1 Day
1 Week
2 Weeks
1 Month
6 Months
1 Year
Paste Exposure:
Public
Unlisted
Private
Folder:
(members only)
Password
NEW
Enabled
Disabled
Burn after read
NEW
Paste Name / Title:
Create New Paste
Hello
Guest
Sign Up
or
Login
Sign in with Facebook
Sign in with Twitter
Sign in with Google
You are currently not logged in, this means you can not edit or delete anything you paste.
Sign Up
or
Login
Public Pastes
Guide To SUCCESSFUL Trading
CSS | 1 hour ago | 0.36 KB
EARN 5000$ IN 24 HOURS
CSS | 1 hour ago | 0.36 KB
Free Money Method
Python | 1 hour ago | 0.39 KB
Free Crypto MethodGuide
Properties | 1 hour ago | 0.39 KB
Free Crypto Method [LEAK]
CSS | 1 hour ago | 0.36 KB
Crypto Exploit
CSS | 1 hour ago | 0.36 KB
Free Crypto MethodGuide
Properties | 1 hour ago | 0.39 KB
Crypto Exploit
C++ | 1 hour ago | 0.39 KB
We use cookies for various purposes including analytics. By continuing to use Pastebin, you agree to our use of cookies as described in the
Cookies Policy
.
OK, I Understand
Not a member of Pastebin yet?
Sign Up
, it unlocks many cool features!