Guest User

Untitled

a guest
Sep 27th, 2015
39
Never
Not a member of Pastebin yet? Sign Up, it unlocks many cool features!
  1. + ./gradlew setupDecompWorkspace build
  2. ****************************
  3. Powered By MCP:
  4. http://modcoderpack.com/
  5. Searge, ProfMobius, Fesh0r,
  6. R4wk, ZeuX, IngisKahn, bspkrs
  7. MCP Data version : 9.10
  8. ****************************
  9. :deobfCompileDummyTask
  10. :deobfProvidedDummyTask
  11. :getVersionJson
  12. :extractUserdev UP-TO-DATE
  13. :extractMcpData SKIPPED
  14. :extractMcpMappings SKIPPED
  15. :genSrgs SKIPPED
  16. :downloadClient SKIPPED
  17. :downloadServer SKIPPED
  18. :splitServerJar SKIPPED
  19. :mergeJars SKIPPED
  20. :deobfMcSRG SKIPPED
  21. :getFernFlower SKIPPED
  22. :decompileMc SKIPPED
  23. :fixMcSources SKIPPED
  24. :applySourcePatches SKIPPED
  25. :remapMcSources SKIPPED
  26. :recompileMc FAILED
  27.  
  28. FAILURE: Build failed with an exception.
  29.  
  30. * What went wrong:
  31. Execution failed for task ':recompileMc'.
  32. > Unable to find a javac compiler;
  33. com.sun.tools.javac.Main is not on the classpath.
  34. Perhaps JAVA_HOME does not point to the JDK.
  35. It is currently set to "/usr/lib/jvm/java-7-openjdk-amd64/jre"
  36.  
  37. * Try:
  38. Run with --stacktrace option to get the stack trace. Run with --info or --debug option to get more log output.
  39.  
  40. BUILD FAILED
  41.  
  42. Total time: 33.209 secs
  43. Build step 'Execute shell' marked build as failure
  44. Archiving artifacts
  45. Finished: FAILURE
RAW Paste Data