SHARE
TWEET

Untitled

a guest Jun 19th, 2019 142 Never
Not a member of Pastebin yet? Sign Up, it unlocks many cool features!
  1. Preparing...
  2. Cloning yuzu-git build files...
  3. Checking yuzu-git dependencies...
  4. Building yuzu-git...
  5. ==> Making package: yuzu-git r11859.c28694d90-1 (Wed 19 Jun 2019 11:55:55 PM EDT)
  6. ==> Checking runtime dependencies...
  7. ==> Checking buildtime dependencies...
  8. ==> Retrieving sources...
  9.   -> Updating yuzu git repo...
  10. Fetching origin
  11.   -> Updating ext-boost git repo...
  12. Fetching origin
  13.   -> Updating Catch git repo...
  14. Fetching origin
  15.   -> Updating dynarmic git repo...
  16. Fetching origin
  17.   -> Updating xbyak git repo...
  18. Fetching origin
  19.   -> Updating fmt git repo...
  20. Fetching origin
  21.   -> Updating inih git repo...
  22. Fetching origin
  23.   -> Updating unicorn git repo...
  24. Fetching origin
  25.   -> Updating lz4 git repo...
  26. Fetching origin
  27.   -> Updating opus git repo...
  28. Fetching origin
  29.   -> Updating mbedtls git repo...
  30. Fetching origin
  31.   -> Updating cubeb git repo...
  32. Fetching origin
  33.   -> Updating sirit git repo...
  34. Fetching origin
  35.   -> Updating SPIRV-Headers git repo...
  36. Fetching origin
  37.   -> Updating sanitizers-cmake git repo...
  38. Fetching origin
  39. ==> Validating source files with md5sums...
  40.     yuzu ... Skipped
  41.     ext-boost ... Skipped
  42.     Catch ... Skipped
  43.     dynarmic ... Skipped
  44.     xbyak ... Skipped
  45.     fmt ... Skipped
  46.     inih ... Skipped
  47.     unicorn ... Skipped
  48.     lz4 ... Skipped
  49.     opus ... Skipped
  50.     mbedtls ... Skipped
  51.     cubeb ... Skipped
  52.     sirit ... Skipped
  53.     SPIRV-Headers ... Skipped
  54.     sanitizers-cmake ... Skipped
  55. ==> Removing existing $srcdir/ directory...
  56. ==> Extracting sources...
  57.   -> Creating working copy of yuzu git repo...
  58. Cloning into 'yuzu'...
  59. done.
  60.   -> Creating working copy of ext-boost git repo...
  61. Cloning into 'ext-boost'...
  62. done.
  63.   -> Creating working copy of Catch git repo...
  64. Cloning into 'Catch'...
  65. done.
  66.   -> Creating working copy of dynarmic git repo...
  67. Cloning into 'dynarmic'...
  68. done.
  69.   -> Creating working copy of xbyak git repo...
  70. Cloning into 'xbyak'...
  71. done.
  72.   -> Creating working copy of fmt git repo...
  73. Cloning into 'fmt'...
  74. done.
  75.   -> Creating working copy of inih git repo...
  76. Cloning into 'inih'...
  77. done.
  78.   -> Creating working copy of unicorn git repo...
  79. Cloning into 'unicorn'...
  80. done.
  81.   -> Creating working copy of lz4 git repo...
  82. Cloning into 'lz4'...
  83. done.
  84.   -> Creating working copy of opus git repo...
  85. Cloning into 'opus'...
  86. done.
  87.   -> Creating working copy of mbedtls git repo...
  88. Cloning into 'mbedtls'...
  89. done.
  90.   -> Creating working copy of cubeb git repo...
  91. Cloning into 'cubeb'...
  92. done.
  93.   -> Creating working copy of sirit git repo...
  94. Cloning into 'sirit'...
  95. done.
  96.   -> Creating working copy of SPIRV-Headers git repo...
  97. Cloning into 'SPIRV-Headers'...
  98. done.
  99.   -> Creating working copy of sanitizers-cmake git repo...
  100. Cloning into 'sanitizers-cmake'...
  101. done.
  102. ==> Starting prepare()...
  103. Submodule 'Vulkan-Headers' (https://github.com/KhronosGroup/Vulkan-Headers.git) registered for path 'externals/Vulkan-Headers'
  104. Submodule 'boost' (https://github.com/yuzu-emu/ext-boost.git) registered for path 'externals/boost'
  105. Submodule 'catch' (https://github.com/philsquared/Catch.git) registered for path 'externals/catch'
  106. Submodule 'cubeb' (https://github.com/kinetiknz/cubeb.git) registered for path 'externals/cubeb'
  107. Submodule 'discord-rpc' (https://github.com/discordapp/discord-rpc.git) registered for path 'externals/discord-rpc'
  108. Submodule 'dynarmic' (https://github.com/MerryMage/dynarmic.git) registered for path 'externals/dynarmic'
  109. Submodule 'fmt' (https://github.com/fmtlib/fmt.git) registered for path 'externals/fmt'
  110. Submodule 'inih' (https://github.com/svn2github/inih) registered for path 'externals/inih/inih'
  111. Submodule 'libressl' (https://github.com/citra-emu/ext-libressl-portable.git) registered for path 'externals/libressl'
  112. Submodule 'lz4' (https://github.com/lz4/lz4.git) registered for path 'externals/lz4'
  113. Submodule 'mbedtls' (https://github.com/DarkLordZach/mbedtls) registered for path 'externals/mbedtls'
  114. Submodule 'opus' (https://github.com/ogniK5377/opus.git) registered for path 'externals/opus'
  115. Submodule 'sirit' (https://github.com/ReinUsesLisp/sirit) registered for path 'externals/sirit'
  116. Submodule 'soundtouch' (https://github.com/citra-emu/ext-soundtouch.git) registered for path 'externals/soundtouch'
  117. Submodule 'unicorn' (https://github.com/yuzu-emu/unicorn) registered for path 'externals/unicorn'
  118. Submodule 'externals/zstd' (https://github.com/facebook/zstd) registered for path 'externals/zstd'
  119. Cloning into '/var/tmp/pamac-build-brandon/yuzu-git/src/yuzu/externals/Vulkan-Headers'...
  120. Cloning into '/var/tmp/pamac-build-brandon/yuzu-git/src/yuzu/externals/boost'...
  121. done.
  122. Cloning into '/var/tmp/pamac-build-brandon/yuzu-git/src/yuzu/externals/catch'...
  123. done.
  124. Cloning into '/var/tmp/pamac-build-brandon/yuzu-git/src/yuzu/externals/cubeb'...
  125. done.
  126. Cloning into '/var/tmp/pamac-build-brandon/yuzu-git/src/yuzu/externals/discord-rpc'...
  127. Cloning into '/var/tmp/pamac-build-brandon/yuzu-git/src/yuzu/externals/dynarmic'...
  128. done.
  129. Cloning into '/var/tmp/pamac-build-brandon/yuzu-git/src/yuzu/externals/fmt'...
  130. done.
  131. Cloning into '/var/tmp/pamac-build-brandon/yuzu-git/src/yuzu/externals/inih/inih'...
  132. done.
  133. Cloning into '/var/tmp/pamac-build-brandon/yuzu-git/src/yuzu/externals/libressl'...
  134. Cloning into '/var/tmp/pamac-build-brandon/yuzu-git/src/yuzu/externals/lz4'...
  135. Cloning into '/var/tmp/pamac-build-brandon/yuzu-git/src/yuzu/externals/mbedtls'...
  136. done.
  137. Cloning into '/var/tmp/pamac-build-brandon/yuzu-git/src/yuzu/externals/opus'...
  138. done.
  139. Cloning into '/var/tmp/pamac-build-brandon/yuzu-git/src/yuzu/externals/sirit'...
  140. done.
  141. Cloning into '/var/tmp/pamac-build-brandon/yuzu-git/src/yuzu/externals/soundtouch'...
  142. Cloning into '/var/tmp/pamac-build-brandon/yuzu-git/src/yuzu/externals/unicorn'...
  143. done.
  144. Cloning into '/var/tmp/pamac-build-brandon/yuzu-git/src/yuzu/externals/zstd'...
  145. Submodule path 'externals/Vulkan-Headers': checked out 'd05c8df88da98ec1ab3bc600d7f5783b4060895b'
  146. Submodule path 'externals/boost': checked out '0b920df1c90f4eb84e2f2b10bee8804b0f6472b2'
  147. Submodule path 'externals/catch': checked out '15cf3caaceb21172ea42a24e595a2eb58c3ec960'
  148. Submodule path 'externals/cubeb': checked out '6f2420de8f155b10330cf973900ac7bdbfee589d'
  149. Submodule path 'externals/discord-rpc': checked out 'e32d001809c4aad56cef2a5321b54442d830174f'
  150. Submodule path 'externals/dynarmic': checked out '2683a9a3e316b5c3f387bbe6787732b9ff44b8db'
  151. Submodule path 'externals/fmt': checked out '9e554999ce02cf86fcdfe74fe740c4fe3f5a56d5'
  152. Submodule path 'externals/inih/inih': checked out '603729dec89aaca42d7bd08f08bc333165b7d5d1'
  153. Submodule path 'externals/libressl': checked out '7d01cb01cb1a926ecb4c9c98b107ef3c26f59dfb'
  154. Submodule path 'externals/lz4': checked out '4db65c1d99280a757823914efaa96d2e87f41844'
  155. Submodule path 'externals/mbedtls': checked out 'a280e602f3a4ae001d3a83cbc3e6e04c99c22277'
  156. Submodule path 'externals/opus': checked out '562f8ba555c4181e1b57e82e496e4a959b9c0193'
  157. Submodule path 'externals/sirit': checked out 'f7c4b07a7e14edb1dcd93bc9879c823423705c2e'
  158. Submodule path 'externals/soundtouch': checked out '060181eaf273180d3a7e87349895bd0cb6ccbf4a'
  159. Submodule path 'externals/unicorn': checked out '73f45735354396766a4bfb26d0b96b06e5cf31b2'
  160. Submodule path 'externals/zstd': checked out '470344d33e1d52a2ada75d278466da8d4ee2faf6'
  161. Cloning into '/var/tmp/pamac-build-brandon/yuzu-git/src/yuzu/externals/cubeb/cmake/sanitizers-cmake'...
  162. done.
  163. Submodule path 'cmake/sanitizers-cmake': checked out 'aab6948fa863bc1cbe5d0850bc46b9ef02ed4c1a'
  164. Submodule 'externals/SPIRV-Headers' (https://github.com/KhronosGroup/SPIRV-Headers) registered for path 'externals/SPIRV-Headers'
  165. Cloning into '/var/tmp/pamac-build-brandon/yuzu-git/src/yuzu/externals/sirit/externals/SPIRV-Headers'...
  166. Submodule path 'externals/SPIRV-Headers': checked out '2c512180ca03b5d4f56283efc85745775b45fdc4'
  167. ==> Starting pkgver()...
  168. ==> Removing existing $pkgdir/ directory...
  169. ==> Starting build()...
  170. -- The C compiler identification is GNU 9.1.0
  171. -- The CXX compiler identification is GNU 9.1.0
  172. -- Check for working C compiler: /usr/bin/cc
  173. -- Check for working C compiler: /usr/bin/cc -- works
  174. -- Detecting C compiler ABI info
  175. -- Detecting C compiler ABI info - done
  176. -- Detecting C compile features
  177. -- Detecting C compile features - done
  178. -- Check for working CXX compiler: /usr/bin/c++
  179. -- Check for working CXX compiler: /usr/bin/c++ -- works
  180. -- Detecting CXX compiler ABI info
  181. -- Detecting CXX compiler ABI info - done
  182. -- Detecting CXX compile features
  183. -- Detecting CXX compile features - done
  184. Submodule 'googletest' (https://github.com/google/googletest) registered for path 'externals/cubeb/googletest'
  185. Cloning into '/var/tmp/pamac-build-brandon/yuzu-git/src/yuzu/externals/cubeb/googletest'...
  186. Submodule path 'externals/cubeb/googletest': checked out '800f5422ac9d9e0ad59cd860a2ef3a679588acb4'
  187. -- Copying pre-commit hook
  188. -- Target architecture: x86_64
  189. -- Looking for pthread.h
  190. -- Looking for pthread.h - found
  191. -- Performing Test CMAKE_HAVE_LIBC_PTHREAD
  192. -- Performing Test CMAKE_HAVE_LIBC_PTHREAD - Failed
  193. -- Check if compiler accepts -pthread
  194. -- Check if compiler accepts -pthread - yes
  195. -- Found Threads: TRUE  
  196. <FindSDL2.cmake>
  197. </FindSDL2.cmake>
  198. -- Found SDL2: /usr/lib/libSDL2main.a;/usr/lib/libSDL2.so;-pthread  
  199. -- unicorn not found, falling back to externals
  200. -- Found PythonInterp: /usr/bin/python2.7 (found suitable version "2.7.16", minimum required is "2.7")
  201. CMake Warning at CMakeLists.txt:299 (message):
  202.   Clang format not found! Disabling the clang format target
  203.  
  204.  
  205. -- Version: 5.3.0
  206. -- Build type: Release
  207. -- CXX_STANDARD: 17
  208. -- Performing Test has_std_17_flag
  209. -- Performing Test has_std_17_flag - Success
  210. -- Performing Test has_std_1z_flag
  211. -- Performing Test has_std_1z_flag - Success
  212. -- Performing Test SUPPORTS_VARIADIC_TEMPLATES
  213. -- Performing Test SUPPORTS_VARIADIC_TEMPLATES - Success
  214. -- Performing Test SUPPORTS_INITIALIZER_LIST
  215. -- Performing Test SUPPORTS_INITIALIZER_LIST - Success
  216. -- Performing Test SUPPORTS_ENUM_BASE
  217. -- Performing Test SUPPORTS_ENUM_BASE - Success
  218. -- Performing Test SUPPORTS_TYPE_TRAITS
  219. -- Performing Test SUPPORTS_TYPE_TRAITS - Success
  220. -- Performing Test SUPPORTS_USER_DEFINED_LITERALS
  221. -- Performing Test SUPPORTS_USER_DEFINED_LITERALS - Success
  222. -- Looking for open
  223. -- Looking for open - found
  224. CMake Warning (dev) at externals/dynarmic/CMakeLists.txt:14 (option):
  225.   Policy CMP0077 is not set: option() honors normal variables.  Run "cmake
  226.   --help-policy CMP0077" for policy details.  Use the cmake_policy command to
  227.   set the policy and suppress this warning.
  228.  
  229.   For compatibility with older versions of CMake, option is clearing the
  230.   normal variable 'DYNARMIC_TESTS'.
  231. This warning is for project developers.  Use -Wno-dev to suppress it.
  232.  
  233. -- Target architecture: x86_64
  234. -- Performing Test CFLAG_Wall
  235. -- Performing Test CFLAG_Wall - Success
  236. -- Performing Test CFLAG_Wextra
  237. -- Performing Test CFLAG_Wextra - Success
  238. -- Performing Test CFLAG_Wundef
  239. -- Performing Test CFLAG_Wundef - Success
  240. -- Performing Test CFLAG_Wcast_qual
  241. -- Performing Test CFLAG_Wcast_qual - Success
  242. -- Performing Test CFLAG_Wcast_align
  243. -- Performing Test CFLAG_Wcast_align - Success
  244. -- Performing Test CFLAG_Wshadow
  245. -- Performing Test CFLAG_Wshadow - Success
  246. -- Performing Test CFLAG_Wswitch_enum
  247. -- Performing Test CFLAG_Wswitch_enum - Success
  248. -- Performing Test CFLAG_Wdeclaration_after_statement
  249. -- Performing Test CFLAG_Wdeclaration_after_statement - Success
  250. -- Performing Test CFLAG_Wstrict_prototypes
  251. -- Performing Test CFLAG_Wstrict_prototypes - Success
  252. -- Performing Test CFLAG_Wpointer_arith
  253. -- Performing Test CFLAG_Wpointer_arith - Success
  254. -- Performing Test CFLAG_W4
  255. -- Performing Test CFLAG_W4 - Failed
  256. -- Found Perl: /usr/bin/perl (found version "5.30.0")
  257. -- Performing Test CXX_FLAG_STD_CPLUSPLUS11
  258. -- Performing Test CXX_FLAG_STD_CPLUSPLUS11 - Success
  259. -- Performing Test C_FLAG_STD_C99
  260. -- Performing Test C_FLAG_STD_C99 - Success
  261. -- Performing Test C_FLAG_WALL
  262. -- Performing Test C_FLAG_WALL - Success
  263. -- Performing Test CXX_FLAG_WALL
  264. -- Performing Test CXX_FLAG_WALL - Success
  265. -- Performing Test C_FLAG_WEXTRA
  266. -- Performing Test C_FLAG_WEXTRA - Success
  267. -- Performing Test CXX_FLAG_WEXTRA
  268. -- Performing Test CXX_FLAG_WEXTRA - Success
  269. -- Performing Test C_FLAG_WUNDEF
  270. -- Performing Test C_FLAG_WUNDEF - Success
  271. -- Performing Test CXX_FLAG_WUNDEF
  272. -- Performing Test CXX_FLAG_WUNDEF - Success
  273. -- Performing Test C_FLAG_WSHADOW
  274. -- Performing Test C_FLAG_WSHADOW - Success
  275. -- Performing Test CXX_FLAG_WSHADOW
  276. -- Performing Test CXX_FLAG_WSHADOW - Success
  277. -- Performing Test C_FLAG_WCAST_ALIGN
  278. -- Performing Test C_FLAG_WCAST_ALIGN - Success
  279. -- Performing Test CXX_FLAG_WCAST_ALIGN
  280. -- Performing Test CXX_FLAG_WCAST_ALIGN - Success
  281. -- Performing Test C_FLAG_WCAST_QUAL
  282. -- Performing Test C_FLAG_WCAST_QUAL - Success
  283. -- Performing Test CXX_FLAG_WCAST_QUAL
  284. -- Performing Test CXX_FLAG_WCAST_QUAL - Success
  285. -- Performing Test C_FLAG_WSTRICT_PROTOTYPES
  286. -- Performing Test C_FLAG_WSTRICT_PROTOTYPES - Success
  287. -- CMAKE_INSTALL_PREFIX: /usr
  288. -- CMAKE_INSTALL_LIBDIR: lib64
  289. -- ZSTD_LEGACY_SUPPORT not defined!
  290. -- ZSTD_MULTITHREAD_SUPPORT is enabled
  291. -- ZSTD VERSION 1.3.8
  292. -- Performing Test SOUNDTOUCH_HAS_MMMX
  293. -- Performing Test SOUNDTOUCH_HAS_MMMX - Success
  294. -- Performing Test SOUNDTOUCH_HAS_MSSE
  295. -- Performing Test SOUNDTOUCH_HAS_MSSE - Success
  296. -- Performing Test standard_math_library_linked_to_automatically
  297. -- Performing Test standard_math_library_linked_to_automatically - Failed
  298. -- Performing Test standard_math_library_linked_to_as_m
  299. -- Performing Test standard_math_library_linked_to_as_m - Success
  300. -- Performing Test COMPILER_HAS_HIDDEN_VISIBILITY
  301. -- Performing Test COMPILER_HAS_HIDDEN_VISIBILITY - Success
  302. -- Performing Test COMPILER_HAS_HIDDEN_INLINE_VISIBILITY
  303. -- Performing Test COMPILER_HAS_HIDDEN_INLINE_VISIBILITY - Success
  304. -- Performing Test COMPILER_HAS_DEPRECATED_ATTR
  305. -- Performing Test COMPILER_HAS_DEPRECATED_ATTR - Success
  306. -- Looking for include file AudioUnit/AudioUnit.h
  307. -- Looking for include file AudioUnit/AudioUnit.h - not found
  308. -- Looking for include file pulse/pulseaudio.h
  309. -- Looking for include file pulse/pulseaudio.h - found
  310. -- Looking for include file alsa/asoundlib.h
  311. -- Looking for include file alsa/asoundlib.h - found
  312. -- Looking for include file jack/jack.h
  313. -- Looking for include file jack/jack.h - found
  314. -- Looking for include file audioclient.h
  315. -- Looking for include file audioclient.h - not found
  316. -- Looking for include files windows.h, mmsystem.h
  317. -- Looking for include files windows.h, mmsystem.h - not found
  318. -- Looking for include file SLES/OpenSLES.h
  319. -- Looking for include file SLES/OpenSLES.h - not found
  320. -- Looking for include file android/log.h
  321. -- Looking for include file android/log.h - not found
  322. -- Looking for include file sndio.h
  323. -- Looking for include file sndio.h - not found
  324. -- Looking for include file kai.h
  325. -- Looking for include file kai.h - not found
  326. -- Could NOT find Doxygen (missing: DOXYGEN_EXECUTABLE)
  327. -- Looking for asprintf
  328. -- Looking for asprintf - found
  329. -- Looking for reallocarray
  330. -- Looking for reallocarray - found
  331. -- Looking for strcasecmp
  332. -- Looking for strcasecmp - found
  333. -- Looking for strlcat
  334. -- Looking for strlcat - not found
  335. -- Looking for strlcpy
  336. -- Looking for strlcpy - not found
  337. -- Looking for strndup
  338. -- Looking for strndup - found
  339. -- Looking for strnlen
  340. -- Looking for strnlen - found
  341. -- Looking for strsep
  342. -- Looking for strsep - found
  343. -- Looking for timegm
  344. -- Looking for timegm - found
  345. -- Looking for arc4random_buf
  346. -- Looking for arc4random_buf - not found
  347. -- Looking for arc4random_uniform
  348. -- Looking for arc4random_uniform - not found
  349. -- Looking for explicit_bzero
  350. -- Looking for explicit_bzero - found
  351. -- Looking for getauxval
  352. -- Looking for getauxval - found
  353. -- Looking for getentropy
  354. -- Looking for getentropy - found
  355. -- Looking for getpagesize
  356. -- Looking for getpagesize - found
  357. -- Looking for timingsafe_bcmp
  358. -- Looking for timingsafe_bcmp - not found
  359. -- Looking for timingsafe_memcmp
  360. -- Looking for timingsafe_memcmp - not found
  361. -- Looking for memmem
  362. -- Looking for memmem - found
  363. -- Looking for include file err.h
  364. -- Looking for include file err.h - found
  365. -- Looking for clock_gettime
  366. -- Looking for clock_gettime - found
  367. -- Looking for sys/types.h
  368. -- Looking for sys/types.h - found
  369. -- Looking for stdint.h
  370. -- Looking for stdint.h - found
  371. -- Looking for stddef.h
  372. -- Looking for stddef.h - found
  373. -- Check size of time_t
  374. -- Check size of time_t - done
  375. -- Configuring done
  376. -- Generating done
  377. -- Build files have been written to: /var/tmp/pamac-build-brandon/yuzu-git/src/yuzu/build
  378. Scanning dependencies of target inih
  379. Scanning dependencies of target unicorn-build
  380. Scanning dependencies of target glad
  381. Scanning dependencies of target fmt
  382. [  1%] Building C object externals/inih/CMakeFiles/inih.dir/inih/ini.c.o
  383. [  1%] Generating ../externals/unicorn/libunicorn.a
  384. [  1%] Building CXX object externals/fmt/CMakeFiles/fmt.dir/src/format.cc.o
  385. [  1%] Building C object externals/glad/CMakeFiles/glad.dir/src/glad.c.o
  386. make[3]: warning: jobserver unavailable: using -j1.  Add '+' to parent make rule.
  387. [  1%] Building CXX object externals/inih/CMakeFiles/inih.dir/inih/cpp/INIReader.cpp.o
  388. [  1%] Linking CXX static library libinih.a
  389. [  1%] Built target inih
  390. Scanning dependencies of target SoundTouch
  391. [  1%] Building CXX object externals/soundtouch/CMakeFiles/SoundTouch.dir/src/AAFilter.cpp.o
  392. [  1%] Building CXX object externals/soundtouch/CMakeFiles/SoundTouch.dir/src/BPMDetect.cpp.o
  393. [  1%] Linking C static library libglad.a
  394. [  1%] Built target glad
  395. Scanning dependencies of target opus
  396. [  1%] Building C object externals/opus/CMakeFiles/opus.dir/celt/bands.c.o
  397. [  1%] Building CXX object externals/soundtouch/CMakeFiles/SoundTouch.dir/src/cpu_detect_x86.cpp.o
  398. Source path       /var/tmp/pamac-build-brandon/yuzu-git/src/yuzu/externals/unicorn/qemu
  399. C compiler        cc
  400. Host C compiler   cc
  401. Objective-C compiler cc
  402. ARFLAGS           rv
  403. CFLAGS            -g -march=x86-64 -mtune=generic -O2 -pipe -fno-plt -g
  404. QEMU_CFLAGS       -fPIE -DPIE -m64 -D_GNU_SOURCE -D_FILE_OFFSET_BITS=64 -D_LARGEFILE_SOURCE -Wstrict-prototypes -Wredundant-decls -Wall -Wundef -Wwrite-strings -Wmissing-prototypes -fno-strict-aliasing -fno-common -DUNICORN_HAS_ARM64 -DUNICORN_HAS_ARM64EB -fPIC -fvisibility=hidden  -Wendif-labels -Wmissing-include-dirs -Wempty-body -Wnested-externs -Wformat-security -Wformat-y2k -Winit-self -Wignored-qualifiers -Wold-style-declaration -Wold-style-definition -Wtype-limits -fstack-protector-strong
  405. LDFLAGS           -Wl,--warn-common -Wl,-z,relro -Wl,-z,now -pie -m64 -g -Wl,-O1,--sort-common,--as-needed,-z,relro,-z,now
  406. make              make
  407. python            /usr/bin/python2.7 -B
  408. host CPU          x86_64
  409. host big endian   no
  410. target list       aarch64-softmmu  aarch64eb-softmmu
  411. tcg debug enabled no
  412. strip binaries    yes
  413. static build      no
  414. mingw32 support   no
  415. PIE               yes
  416.   GEN   aarch64-softmmu/config-devices.mak
  417.   GEN   aarch64eb-softmmu/config-devices.mak
  418.   GEN   config-host.h
  419.   GEN   qapi-types.h
  420.   GEN   qapi-visit.h
  421.   GEN   config-all-devices.mak
  422.   CC    ../uc.o
  423.   CC    ../list.o
  424.   CC    glib_compat.o
  425.   GEN   qapi-types.c
  426. [  1%] Building CXX object externals/soundtouch/CMakeFiles/SoundTouch.dir/src/FIFOSampleBuffer.cpp.o
  427.   GEN   qapi-visit.c
  428.   CC    accel.o
  429.   CC    vl.o
  430.   CC    qemu-timer.o
  431.   CC    qemu-log.o
  432. glib_compat.c: In function ‘g_hash_table_insert’:
  433. glib_compat.c:799:29: warning: ‘first_tombstone’ may be used uninitialized in this function [-Wmaybe-uninitialized]
  434.   799 |   node = &hash_table->nodes [node_index];
  435.       |                             ^
  436. glib_compat.c:569:9: note: ‘first_tombstone’ was declared here
  437.   569 |   guint first_tombstone;
  438.       |         ^~~~~~~~~~~~~~~
  439.   CC    tcg-runtime.o
  440.   CC    hw/core/qdev.o
  441.   CC    hw/core/machine.o
  442.   CC    qom/object.o
  443. [  1%] Building CXX object externals/soundtouch/CMakeFiles/SoundTouch.dir/src/FIRFilter.cpp.o
  444.   CC    qom/container.o
  445.   CC    qom/qom-qobject.o
  446.   CC    qom/cpu.o
  447. [  1%] Building C object externals/opus/CMakeFiles/opus.dir/celt/celt.c.o
  448.   CC    qapi-types.o
  449.   CC    qapi-visit.o
  450.   CC    qapi/qapi-visit-core.o
  451. [  1%] Building C object externals/opus/CMakeFiles/opus.dir/celt/celt_decoder.c.o
  452.   CC    qapi/qapi-dealloc-visitor.o
  453.   CC    qapi/qmp-input-visitor.o
  454.   CC    qapi/qmp-output-visitor.o
  455.   CC    qapi/string-input-visitor.o
  456. [  1%] Building CXX object externals/soundtouch/CMakeFiles/SoundTouch.dir/src/InterpolateCubic.cpp.o
  457.   CC    qobject/qint.o
  458.   CC    qobject/qstring.o
  459.   CC    qobject/qdict.o
  460.   CC    qobject/qlist.o
  461.   CC    qobject/qfloat.o
  462.   CC    qobject/qbool.o
  463.   CC    qobject/qerror.o
  464.   CC    util/cutils.o
  465.   CC    util/qemu-timer-common.o
  466.   CC    util/oslib-posix.o
  467.   CC    util/qemu-thread-posix.o
  468.   CC    util/module.o
  469.   CC    util/bitmap.o
  470.   CC    util/bitops.o
  471. [  1%] Building C object externals/opus/CMakeFiles/opus.dir/celt/celt_encoder.c.o
  472.   CC    util/error.o
  473.   CC    util/aes.o
  474.   CC    util/crc32c.o
  475.   CC    util/host-utils.o
  476.   CC    util/getauxval.o
  477. [  1%] Building CXX object externals/soundtouch/CMakeFiles/SoundTouch.dir/src/InterpolateLinear.cpp.o
  478.   GEN   aarch64eb-softmmu/config-target.h
  479.   GEN   aarch64-softmmu/config-target.h
  480.   CC    aarch64eb-softmmu/exec.o
  481.   CC    aarch64eb-softmmu/translate-all.o
  482.   CC    aarch64eb-softmmu/cpu-exec.o
  483.   CC    aarch64-softmmu/exec.o
  484. [  1%] Building CXX object externals/soundtouch/CMakeFiles/SoundTouch.dir/src/InterpolateShannon.cpp.o
  485.   CC    aarch64eb-softmmu/tcg/tcg.o
  486.   CC    aarch64eb-softmmu/tcg/optimize.o
  487. [  1%] Building CXX object externals/soundtouch/CMakeFiles/SoundTouch.dir/src/mmx_optimized.cpp.o
  488.   CC    aarch64-softmmu/translate-all.o
  489.   CC    aarch64eb-softmmu/fpu/softfloat.o
  490.   CC    aarch64-softmmu/cpu-exec.o
  491.   CC    aarch64-softmmu/tcg/tcg.o
  492. [  1%] Building CXX object externals/soundtouch/CMakeFiles/SoundTouch.dir/src/PeakFinder.cpp.o
  493.   CC    aarch64-softmmu/tcg/optimize.o
  494. [  1%] Building CXX object externals/soundtouch/CMakeFiles/SoundTouch.dir/src/RateTransposer.cpp.o
  495. [  1%] Building C object externals/opus/CMakeFiles/opus.dir/celt/celt_lpc.c.o
  496. [  1%] Building C object externals/opus/CMakeFiles/opus.dir/celt/cwrs.c.o
  497. [  2%] Building CXX object externals/soundtouch/CMakeFiles/SoundTouch.dir/src/SoundTouch.cpp.o
  498. [  2%] Building C object externals/opus/CMakeFiles/opus.dir/celt/entcode.c.o
  499.   CC    aarch64-softmmu/fpu/softfloat.o
  500. [  2%] Building C object externals/opus/CMakeFiles/opus.dir/celt/entdec.c.o
  501. [  2%] Building C object externals/opus/CMakeFiles/opus.dir/celt/entenc.c.o
  502. [  2%] Building CXX object externals/soundtouch/CMakeFiles/SoundTouch.dir/src/sse_optimized.cpp.o
  503. [  2%] Building C object externals/opus/CMakeFiles/opus.dir/celt/kiss_fft.c.o
  504.   CC    aarch64eb-softmmu/cpus.o
  505.   CC    aarch64eb-softmmu/ioport.o
  506. [  2%] Building CXX object externals/soundtouch/CMakeFiles/SoundTouch.dir/src/TDStretch.cpp.o
  507.   CC    aarch64eb-softmmu/memory.o
  508.   CC    aarch64eb-softmmu/cputlb.o
  509. [  2%] Building C object externals/opus/CMakeFiles/opus.dir/celt/laplace.c.o
  510. [  2%] Building C object externals/opus/CMakeFiles/opus.dir/celt/mathops.c.o
  511. [  2%] Building C object externals/opus/CMakeFiles/opus.dir/celt/mdct.c.o
  512. [  2%] Building C object externals/opus/CMakeFiles/opus.dir/celt/modes.c.o
  513. [  2%] Building C object externals/opus/CMakeFiles/opus.dir/celt/pitch.c.o
  514.   CC    aarch64eb-softmmu/memory_mapping.o
  515. [  2%] Linking CXX static library libSoundTouch.a
  516.   CC    aarch64-softmmu/cpus.o
  517. [  3%] Building C object externals/opus/CMakeFiles/opus.dir/celt/quant_bands.c.o
  518. [  3%] Built target SoundTouch
  519.   CC    aarch64-softmmu/ioport.o
  520. Scanning dependencies of target sirit
  521. [  3%] Building CXX object externals/sirit/src/CMakeFiles/sirit.dir/sirit.cpp.o
  522.   CC    aarch64-softmmu/memory.o
  523. [  3%] Building C object externals/opus/CMakeFiles/opus.dir/celt/rate.c.o
  524.   CC    aarch64eb-softmmu/hw/arm/tosa.o
  525.   CC    aarch64eb-softmmu/hw/arm/virt.o
  526.   CC    aarch64eb-softmmu/target-arm/translate.o
  527.   CC    aarch64eb-softmmu/target-arm/op_helper.o
  528. [  3%] Building C object externals/opus/CMakeFiles/opus.dir/celt/vq.c.o
  529. /var/tmp/pamac-build-brandon/yuzu-git/src/yuzu/externals/unicorn/qemu/target-arm/translate.c:2695:1: warning: multi-line comment [-Wcomment]
  530.  2695 | //#define VFP_SREG(insn, bigbit, smallbit) \
  531.       | ^
  532.   CC    aarch64-softmmu/cputlb.o
  533. [  3%] Building C object externals/opus/CMakeFiles/opus.dir/silk/A2NLSF.c.o
  534.   CC    aarch64eb-softmmu/target-arm/helper.o
  535. [  3%] Building CXX object externals/sirit/src/CMakeFiles/sirit.dir/op.cpp.o
  536. [  3%] Building C object externals/opus/CMakeFiles/opus.dir/silk/CNG.c.o
  537. [  3%] Building CXX object externals/fmt/CMakeFiles/fmt.dir/src/posix.cc.o
  538. [  3%] Building C object externals/opus/CMakeFiles/opus.dir/silk/HP_variable_cutoff.c.o
  539. [  3%] Building C object externals/opus/CMakeFiles/opus.dir/silk/LPC_analysis_filter.c.o
  540. [  3%] Building C object externals/opus/CMakeFiles/opus.dir/silk/LPC_fit.c.o
  541. [  3%] Building C object externals/opus/CMakeFiles/opus.dir/silk/LPC_inv_pred_gain.c.o
  542.   CC    aarch64eb-softmmu/target-arm/cpu.o
  543. [  3%] Building C object externals/opus/CMakeFiles/opus.dir/silk/LP_variable_cutoff.c.o
  544.   CC    aarch64-softmmu/memory_mapping.o
  545. [  3%] Building C object externals/opus/CMakeFiles/opus.dir/silk/NLSF2A.c.o
  546.   CC    aarch64-softmmu/hw/arm/tosa.o
  547. [  3%] Building CXX object externals/sirit/src/CMakeFiles/sirit.dir/stream.cpp.o
  548.   CC    aarch64-softmmu/hw/arm/virt.o
  549.   CC    aarch64-softmmu/target-arm/translate.o
  550. [  3%] Building C object externals/opus/CMakeFiles/opus.dir/silk/NLSF_VQ.c.o
  551. [  3%] Linking CXX static library libfmt.a
  552. [  3%] Building C object externals/opus/CMakeFiles/opus.dir/silk/NLSF_VQ_weights_laroia.c.o
  553.   CC    aarch64-softmmu/target-arm/op_helper.o
  554. /var/tmp/pamac-build-brandon/yuzu-git/src/yuzu/externals/unicorn/qemu/target-arm/translate.c:2695:1: warning: multi-line comment [-Wcomment]
  555.  2695 | //#define VFP_SREG(insn, bigbit, smallbit) \
  556.       | ^
  557. [  3%] Building C object externals/opus/CMakeFiles/opus.dir/silk/NLSF_decode.c.o
  558. [  3%] Built target fmt
  559. [  3%] Building C object externals/opus/CMakeFiles/opus.dir/silk/NLSF_del_dec_quant.c.o
  560. [  3%] Building C object externals/opus/CMakeFiles/opus.dir/silk/NLSF_encode.c.o
  561. [  3%] Building CXX object externals/sirit/src/CMakeFiles/sirit.dir/operand.cpp.o
  562. Scanning dependencies of target libzstd_static
  563. [  3%] Building C object externals/zstd/build/cmake/lib/CMakeFiles/libzstd_static.dir/__/__/__/lib/common/entropy_common.c.o
  564. [  3%] Building CXX object externals/sirit/src/CMakeFiles/sirit.dir/literal_number.cpp.o
  565.   CC    aarch64-softmmu/target-arm/helper.o
  566. [  3%] Building C object externals/zstd/build/cmake/lib/CMakeFiles/libzstd_static.dir/__/__/__/lib/common/fse_decompress.c.o
  567. [  3%] Building C object externals/zstd/build/cmake/lib/CMakeFiles/libzstd_static.dir/__/__/__/lib/common/threading.c.o
  568. [  3%] Building CXX object externals/sirit/src/CMakeFiles/sirit.dir/literal_string.cpp.o
  569. [  3%] Building C object externals/zstd/build/cmake/lib/CMakeFiles/libzstd_static.dir/__/__/__/lib/common/pool.c.o
  570. [  3%] Building C object externals/zstd/build/cmake/lib/CMakeFiles/libzstd_static.dir/__/__/__/lib/common/zstd_common.c.o
  571. [  3%] Building C object externals/zstd/build/cmake/lib/CMakeFiles/libzstd_static.dir/__/__/__/lib/common/error_private.c.o
  572. [  3%] Building C object externals/zstd/build/cmake/lib/CMakeFiles/libzstd_static.dir/__/__/__/lib/common/xxhash.c.o
  573. [  3%] Building CXX object externals/sirit/src/CMakeFiles/sirit.dir/instructions/type.cpp.o
  574. [  4%] Building C object externals/zstd/build/cmake/lib/CMakeFiles/libzstd_static.dir/__/__/__/lib/compress/hist.c.o
  575. [  4%] Building C object externals/zstd/build/cmake/lib/CMakeFiles/libzstd_static.dir/__/__/__/lib/compress/fse_compress.c.o
  576. [  4%] Building CXX object externals/sirit/src/CMakeFiles/sirit.dir/instructions/constant.cpp.o
  577. [  4%] Building C object externals/zstd/build/cmake/lib/CMakeFiles/libzstd_static.dir/__/__/__/lib/compress/huf_compress.c.o
  578. [  4%] Building C object externals/zstd/build/cmake/lib/CMakeFiles/libzstd_static.dir/__/__/__/lib/compress/zstd_compress.c.o
  579.   CC    aarch64eb-softmmu/target-arm/neon_helper.o
  580.   CC    aarch64eb-softmmu/target-arm/iwmmxt_helper.o
  581. [  4%] Building CXX object externals/sirit/src/CMakeFiles/sirit.dir/instructions/function.cpp.o
  582. [  5%] Building CXX object externals/sirit/src/CMakeFiles/sirit.dir/instructions/flow.cpp.o
  583.   CC    aarch64eb-softmmu/target-arm/psci.o
  584.   CC    aarch64eb-softmmu/target-arm/cpu64.o
  585. /var/tmp/pamac-build-brandon/yuzu-git/src/yuzu/externals/unicorn/qemu/target-arm/cpu64.c: In function ‘aarch64_cpu_set_pc’:
  586. /var/tmp/pamac-build-brandon/yuzu-git/src/yuzu/externals/unicorn/qemu/target-arm/cpu64.c:166:18: warning: unused variable ‘env’ [-Wunused-variable]
  587.   166 |     CPUARMState *env = cs->env_ptr;
  588.       |                  ^~~
  589.   CC    aarch64eb-softmmu/target-arm/translate-a64.o
  590. [  5%] Building CXX object externals/sirit/src/CMakeFiles/sirit.dir/instructions/debug.cpp.o
  591.   CC    aarch64-softmmu/target-arm/cpu.o
  592.   CC    aarch64-softmmu/target-arm/neon_helper.o
  593. [  5%] Building C object externals/zstd/build/cmake/lib/CMakeFiles/libzstd_static.dir/__/__/__/lib/compress/zstdmt_compress.c.o
  594. [  5%] Building CXX object externals/sirit/src/CMakeFiles/sirit.dir/instructions/memory.cpp.o
  595. [  5%] Building C object externals/zstd/build/cmake/lib/CMakeFiles/libzstd_static.dir/__/__/__/lib/compress/zstd_fast.c.o
  596.   CC    aarch64-softmmu/target-arm/iwmmxt_helper.o
  597. [  5%] Building CXX object externals/sirit/src/CMakeFiles/sirit.dir/instructions/annotation.cpp.o
  598. [  5%] Building CXX object externals/sirit/src/CMakeFiles/sirit.dir/instructions/misc.cpp.o
  599.   CC    aarch64-softmmu/target-arm/psci.o
  600. [  5%] Building C object externals/zstd/build/cmake/lib/CMakeFiles/libzstd_static.dir/__/__/__/lib/compress/zstd_double_fast.c.o
  601.   CC    aarch64-softmmu/target-arm/cpu64.o
  602. /var/tmp/pamac-build-brandon/yuzu-git/src/yuzu/externals/unicorn/qemu/target-arm/cpu64.c: In function ‘aarch64_cpu_set_pc’:
  603. /var/tmp/pamac-build-brandon/yuzu-git/src/yuzu/externals/unicorn/qemu/target-arm/cpu64.c:166:18: warning: unused variable ‘env’ [-Wunused-variable]
  604.   166 |     CPUARMState *env = cs->env_ptr;
  605.       |                  ^~~
  606.   CC    aarch64-softmmu/target-arm/translate-a64.o
  607. [  5%] Building CXX object externals/sirit/src/CMakeFiles/sirit.dir/instructions/logical.cpp.o
  608. [  5%] Building CXX object externals/sirit/src/CMakeFiles/sirit.dir/instructions/conversion.cpp.o
  609. [  5%] Building C object externals/zstd/build/cmake/lib/CMakeFiles/libzstd_static.dir/__/__/__/lib/compress/zstd_lazy.c.o
  610. [  5%] Building CXX object externals/sirit/src/CMakeFiles/sirit.dir/instructions/bit.cpp.o
  611. [  5%] Building CXX object externals/sirit/src/CMakeFiles/sirit.dir/instructions/arithmetic.cpp.o
  612.   CC    aarch64eb-softmmu/target-arm/helper-a64.o
  613.   CC    aarch64eb-softmmu/target-arm/unicorn_aarch64.o
  614. [  5%] Building CXX object externals/sirit/src/CMakeFiles/sirit.dir/instructions/extension.cpp.o
  615.   CC    aarch64eb-softmmu/target-arm/crypto_helper.o
  616.   CC    aarch64-softmmu/target-arm/helper-a64.o
  617.   CC    aarch64-softmmu/target-arm/unicorn_aarch64.o
  618.   CC    aarch64-softmmu/target-arm/crypto_helper.o
  619. [  5%] Building CXX object externals/sirit/src/CMakeFiles/sirit.dir/instructions/image.cpp.o
  620. [  5%] Linking CXX static library libsirit.a
  621. [  5%] Built target sirit
  622. Scanning dependencies of target lz4_static
  623. [  5%] Building C object externals/lz4/contrib/cmake_unofficial/CMakeFiles/lz4_static.dir/__/__/lib/lz4.c.o
  624. [  5%] Building C object externals/zstd/build/cmake/lib/CMakeFiles/libzstd_static.dir/__/__/__/lib/compress/zstd_opt.c.o
  625.   GEN     libunicorn.so.1
  626.   GEN     libunicorn.a
  627. ar: creating libunicorn.a
  628.   CC      sample_arm64.o
  629.   CC      sample_arm64eb.o
  630.   LINK    sample_arm64
  631.   LINK    sample_arm64eb
  632. [  5%] Built target unicorn-build
  633. Scanning dependencies of target crypto
  634. [  5%] Building C object externals/libressl/crypto/CMakeFiles/crypto.dir/aes/aes-elf-x86_64.S.o
  635. [  5%] Building C object externals/libressl/crypto/CMakeFiles/crypto.dir/aes/bsaes-elf-x86_64.S.o
  636. [  5%] Building C object externals/libressl/crypto/CMakeFiles/crypto.dir/aes/vpaes-elf-x86_64.S.o
  637. [  5%] Building C object externals/libressl/crypto/CMakeFiles/crypto.dir/aes/aesni-elf-x86_64.S.o
  638. [  5%] Building C object externals/libressl/crypto/CMakeFiles/crypto.dir/aes/aesni-sha1-elf-x86_64.S.o
  639. [  5%] Building C object externals/libressl/crypto/CMakeFiles/crypto.dir/bn/modexp512-elf-x86_64.S.o
  640. [  6%] Building C object externals/libressl/crypto/CMakeFiles/crypto.dir/bn/mont-elf-x86_64.S.o
  641. [  6%] Building C object externals/libressl/crypto/CMakeFiles/crypto.dir/bn/mont5-elf-x86_64.S.o
  642. [  6%] Building C object externals/libressl/crypto/CMakeFiles/crypto.dir/bn/gf2m-elf-x86_64.S.o
  643. [  6%] Building C object externals/libressl/crypto/CMakeFiles/crypto.dir/camellia/cmll-elf-x86_64.S.o
  644. [  6%] Building C object externals/libressl/crypto/CMakeFiles/crypto.dir/md5/md5-elf-x86_64.S.o
  645. [  6%] Building C object externals/libressl/crypto/CMakeFiles/crypto.dir/modes/ghash-elf-x86_64.S.o
  646. [  6%] Building C object externals/libressl/crypto/CMakeFiles/crypto.dir/rc4/rc4-elf-x86_64.S.o
  647. [  6%] Building C object externals/libressl/crypto/CMakeFiles/crypto.dir/rc4/rc4-md5-elf-x86_64.S.o
  648. [  6%] Building C object externals/libressl/crypto/CMakeFiles/crypto.dir/sha/sha1-elf-x86_64.S.o
  649. [  6%] Building C object externals/libressl/crypto/CMakeFiles/crypto.dir/sha/sha256-elf-x86_64.S.o
  650. [  6%] Building C object externals/libressl/crypto/CMakeFiles/crypto.dir/sha/sha512-elf-x86_64.S.o
  651. [  6%] Building C object externals/libressl/crypto/CMakeFiles/crypto.dir/whrlpool/wp-elf-x86_64.S.o
  652. [  6%] Building C object externals/libressl/crypto/CMakeFiles/crypto.dir/cpuid-elf-x86_64.S.o
  653. [  6%] Building C object externals/libressl/crypto/CMakeFiles/crypto.dir/cpt_err.c.o
  654. [  6%] Building C object externals/libressl/crypto/CMakeFiles/crypto.dir/cryptlib.c.o
  655. [  6%] Building C object externals/libressl/crypto/CMakeFiles/crypto.dir/crypto_init.c.o
  656. [  7%] Building C object externals/libressl/crypto/CMakeFiles/crypto.dir/cversion.c.o
  657. [  7%] Building C object externals/libressl/crypto/CMakeFiles/crypto.dir/ex_data.c.o
  658. [  7%] Building C object externals/libressl/crypto/CMakeFiles/crypto.dir/malloc-wrapper.c.o
  659. [  7%] Building C object externals/lz4/contrib/cmake_unofficial/CMakeFiles/lz4_static.dir/__/__/lib/lz4hc.c.o
  660. [  7%] Building C object externals/libressl/crypto/CMakeFiles/crypto.dir/mem_clr.c.o
  661. [  7%] Building C object externals/libressl/crypto/CMakeFiles/crypto.dir/mem_dbg.c.o
  662. [  7%] Building C object externals/libressl/crypto/CMakeFiles/crypto.dir/o_init.c.o
  663. [  7%] Building C object externals/libressl/crypto/CMakeFiles/crypto.dir/o_str.c.o
  664. [  7%] Building C object externals/libressl/crypto/CMakeFiles/crypto.dir/o_time.c.o
  665. [  7%] Building C object externals/libressl/crypto/CMakeFiles/crypto.dir/aes/aes_cfb.c.o
  666. [  7%] Building C object externals/libressl/crypto/CMakeFiles/crypto.dir/aes/aes_ctr.c.o
  667. [  7%] Building C object externals/libressl/crypto/CMakeFiles/crypto.dir/aes/aes_ecb.c.o
  668. [  7%] Building C object externals/libressl/crypto/CMakeFiles/crypto.dir/aes/aes_ige.c.o
  669. [  7%] Building C object externals/libressl/crypto/CMakeFiles/crypto.dir/aes/aes_misc.c.o
  670. [  7%] Building C object externals/libressl/crypto/CMakeFiles/crypto.dir/aes/aes_ofb.c.o
  671. [  7%] Building C object externals/libressl/crypto/CMakeFiles/crypto.dir/aes/aes_wrap.c.o
  672. [  8%] Building C object externals/libressl/crypto/CMakeFiles/crypto.dir/asn1/a_bitstr.c.o
  673. [  8%] Building C object externals/libressl/crypto/CMakeFiles/crypto.dir/asn1/a_bool.c.o
  674. [  8%] Building C object externals/libressl/crypto/CMakeFiles/crypto.dir/asn1/a_bytes.c.o
  675. [  8%] Building C object externals/libressl/crypto/CMakeFiles/crypto.dir/asn1/a_d2i_fp.c.o
  676. [  8%] Building C object externals/libressl/crypto/CMakeFiles/crypto.dir/asn1/a_digest.c.o
  677. [  8%] Building C object externals/lz4/contrib/cmake_unofficial/CMakeFiles/lz4_static.dir/__/__/lib/lz4frame.c.o
  678. [  8%] Building C object externals/libressl/crypto/CMakeFiles/crypto.dir/asn1/a_dup.c.o
  679. [  8%] Building C object externals/libressl/crypto/CMakeFiles/crypto.dir/asn1/a_enum.c.o
  680. [  8%] Building C object externals/libressl/crypto/CMakeFiles/crypto.dir/asn1/a_i2d_fp.c.o
  681. [  8%] Building C object externals/libressl/crypto/CMakeFiles/crypto.dir/asn1/a_int.c.o
  682. [  8%] Building C object externals/lz4/contrib/cmake_unofficial/CMakeFiles/lz4_static.dir/__/__/lib/xxhash.c.o
  683. [  8%] Building C object externals/libressl/crypto/CMakeFiles/crypto.dir/asn1/a_mbstr.c.o
  684. [  8%] Building C object externals/libressl/crypto/CMakeFiles/crypto.dir/asn1/a_object.c.o
  685. [  8%] Linking C static library liblz4.a
  686. [  8%] Built target lz4_static
  687. [  8%] Building C object externals/zstd/build/cmake/lib/CMakeFiles/libzstd_static.dir/__/__/__/lib/compress/zstd_ldm.c.o
  688. [  8%] Building C object externals/libressl/crypto/CMakeFiles/crypto.dir/asn1/a_octet.c.o
  689. [  8%] Building C object externals/libressl/crypto/CMakeFiles/crypto.dir/asn1/a_print.c.o
  690. [  8%] Building C object externals/libressl/crypto/CMakeFiles/crypto.dir/asn1/a_set.c.o
  691. [  8%] Building C object externals/libressl/crypto/CMakeFiles/crypto.dir/asn1/a_sign.c.o
  692. [  8%] Building C object externals/zstd/build/cmake/lib/CMakeFiles/libzstd_static.dir/__/__/__/lib/decompress/huf_decompress.c.o
  693. [  8%] Building C object externals/libressl/crypto/CMakeFiles/crypto.dir/asn1/a_strex.c.o
  694. [  9%] Building C object externals/libressl/crypto/CMakeFiles/crypto.dir/asn1/a_strnid.c.o
  695. [  9%] Building C object externals/libressl/crypto/CMakeFiles/crypto.dir/asn1/a_time.c.o
  696. [  9%] Building C object externals/libressl/crypto/CMakeFiles/crypto.dir/asn1/a_time_tm.c.o
  697. [  9%] Building C object externals/libressl/crypto/CMakeFiles/crypto.dir/asn1/a_type.c.o
  698. [  9%] Building C object externals/libressl/crypto/CMakeFiles/crypto.dir/asn1/a_utf8.c.o
  699. [  9%] Building C object externals/libressl/crypto/CMakeFiles/crypto.dir/asn1/a_verify.c.o
  700. [  9%] Building C object externals/libressl/crypto/CMakeFiles/crypto.dir/asn1/ameth_lib.c.o
  701. [  9%] Building C object externals/libressl/crypto/CMakeFiles/crypto.dir/asn1/asn1_err.c.o
  702. [  9%] Building C object externals/libressl/crypto/CMakeFiles/crypto.dir/asn1/asn1_gen.c.o
  703. [  9%] Building C object externals/libressl/crypto/CMakeFiles/crypto.dir/asn1/asn1_lib.c.o
  704. [  9%] Building C object externals/libressl/crypto/CMakeFiles/crypto.dir/asn1/asn1_par.c.o
  705. [  9%] Building C object externals/libressl/crypto/CMakeFiles/crypto.dir/asn1/asn_mime.c.o
  706. [  9%] Building C object externals/libressl/crypto/CMakeFiles/crypto.dir/asn1/asn_moid.c.o
  707. [  9%] Building C object externals/libressl/crypto/CMakeFiles/crypto.dir/asn1/asn_pack.c.o
  708. [  9%] Building C object externals/libressl/crypto/CMakeFiles/crypto.dir/asn1/bio_asn1.c.o
  709. [  9%] Building C object externals/libressl/crypto/CMakeFiles/crypto.dir/asn1/bio_ndef.c.o
  710. [  9%] Building C object externals/zstd/build/cmake/lib/CMakeFiles/libzstd_static.dir/__/__/__/lib/decompress/zstd_decompress.c.o
  711. [  9%] Building C object externals/zstd/build/cmake/lib/CMakeFiles/libzstd_static.dir/__/__/__/lib/decompress/zstd_decompress_block.c.o
  712. [ 10%] Building C object externals/opus/CMakeFiles/opus.dir/silk/NLSF_stabilize.c.o
  713. [ 10%] Building C object externals/opus/CMakeFiles/opus.dir/silk/NLSF_unpack.c.o
  714. Scanning dependencies of target ssl
  715. [ 10%] Building C object externals/libressl/ssl/CMakeFiles/ssl.dir/bio_ssl.c.o
  716. [ 10%] Building C object externals/opus/CMakeFiles/opus.dir/silk/NSQ.c.o
  717. [ 10%] Building C object externals/libressl/ssl/CMakeFiles/ssl.dir/bs_ber.c.o
  718. [ 10%] Building C object externals/libressl/ssl/CMakeFiles/ssl.dir/bs_cbb.c.o
  719. [ 10%] Building C object externals/opus/CMakeFiles/opus.dir/silk/NSQ_del_dec.c.o
  720. [ 11%] Building C object externals/libressl/ssl/CMakeFiles/ssl.dir/bs_cbs.c.o
  721. [ 11%] Building C object externals/libressl/ssl/CMakeFiles/ssl.dir/d1_both.c.o
  722. [ 11%] Building C object externals/opus/CMakeFiles/opus.dir/silk/PLC.c.o
  723. [ 11%] Building C object externals/libressl/ssl/CMakeFiles/ssl.dir/d1_clnt.c.o
  724. [ 11%] Building C object externals/opus/CMakeFiles/opus.dir/silk/VAD.c.o
  725. [ 11%] Building C object externals/libressl/ssl/CMakeFiles/ssl.dir/d1_enc.c.o
  726. [ 11%] Building C object externals/libressl/ssl/CMakeFiles/ssl.dir/d1_lib.c.o
  727. [ 11%] Building C object externals/opus/CMakeFiles/opus.dir/silk/VQ_WMat_EC.c.o
  728. [ 11%] Building C object externals/opus/CMakeFiles/opus.dir/silk/ana_filt_bank_1.c.o
  729. [ 11%] Building C object externals/opus/CMakeFiles/opus.dir/silk/biquad_alt.c.o
  730. [ 11%] Building C object externals/libressl/ssl/CMakeFiles/ssl.dir/d1_meth.c.o
  731. [ 11%] Building C object externals/opus/CMakeFiles/opus.dir/silk/bwexpander.c.o
  732. [ 11%] Building C object externals/libressl/ssl/CMakeFiles/ssl.dir/d1_pkt.c.o
  733. [ 11%] Building C object externals/opus/CMakeFiles/opus.dir/silk/bwexpander_32.c.o
  734. [ 11%] Building C object externals/opus/CMakeFiles/opus.dir/silk/check_control_input.c.o
  735. [ 11%] Building C object externals/opus/CMakeFiles/opus.dir/silk/code_signs.c.o
  736. [ 11%] Building C object externals/opus/CMakeFiles/opus.dir/silk/control_SNR.c.o
  737. [ 11%] Building C object externals/opus/CMakeFiles/opus.dir/silk/control_audio_bandwidth.c.o
  738. [ 11%] Building C object externals/libressl/ssl/CMakeFiles/ssl.dir/d1_srtp.c.o
  739. [ 11%] Building C object externals/opus/CMakeFiles/opus.dir/silk/control_codec.c.o
  740. [ 11%] Building C object externals/libressl/ssl/CMakeFiles/ssl.dir/d1_srvr.c.o
  741. [ 12%] Building C object externals/opus/CMakeFiles/opus.dir/silk/dec_API.c.o
  742. [ 12%] Building C object externals/libressl/ssl/CMakeFiles/ssl.dir/pqueue.c.o
  743. [ 12%] Building C object externals/libressl/ssl/CMakeFiles/ssl.dir/s3_cbc.c.o
  744. [ 12%] Building C object externals/opus/CMakeFiles/opus.dir/silk/decode_core.c.o
  745. [ 12%] Building C object externals/libressl/ssl/CMakeFiles/ssl.dir/s3_lib.c.o
  746. [ 12%] Building C object externals/opus/CMakeFiles/opus.dir/silk/decode_frame.c.o
  747. [ 12%] Building C object externals/opus/CMakeFiles/opus.dir/silk/decode_indices.c.o
  748. [ 12%] Building C object externals/opus/CMakeFiles/opus.dir/silk/decode_parameters.c.o
  749. [ 12%] Building C object externals/opus/CMakeFiles/opus.dir/silk/decode_pitch.c.o
  750. [ 12%] Building C object externals/libressl/ssl/CMakeFiles/ssl.dir/ssl_algs.c.o
  751. [ 12%] Building C object externals/opus/CMakeFiles/opus.dir/silk/decode_pulses.c.o
  752. [ 12%] Building C object externals/libressl/ssl/CMakeFiles/ssl.dir/ssl_asn1.c.o
  753. [ 12%] Building C object externals/opus/CMakeFiles/opus.dir/silk/decoder_set_fs.c.o
  754. [ 12%] Building C object externals/opus/CMakeFiles/opus.dir/silk/enc_API.c.o
  755. [ 12%] Building C object externals/libressl/ssl/CMakeFiles/ssl.dir/ssl_both.c.o
  756. [ 12%] Building C object externals/zstd/build/cmake/lib/CMakeFiles/libzstd_static.dir/__/__/__/lib/decompress/zstd_ddict.c.o
  757. [ 12%] Building C object externals/zstd/build/cmake/lib/CMakeFiles/libzstd_static.dir/__/__/__/lib/dictBuilder/cover.c.o
  758. [ 12%] Building C object externals/libressl/ssl/CMakeFiles/ssl.dir/ssl_cert.c.o
  759. [ 12%] Building C object externals/opus/CMakeFiles/opus.dir/silk/encode_indices.c.o
  760. [ 12%] Building C object externals/opus/CMakeFiles/opus.dir/silk/encode_pulses.c.o
  761. [ 13%] Building C object externals/libressl/ssl/CMakeFiles/ssl.dir/ssl_ciph.c.o
  762. [ 13%] Building C object externals/zstd/build/cmake/lib/CMakeFiles/libzstd_static.dir/__/__/__/lib/dictBuilder/fastcover.c.o
  763. [ 13%] Building C object externals/opus/CMakeFiles/opus.dir/silk/gain_quant.c.o
  764. [ 13%] Building C object externals/opus/CMakeFiles/opus.dir/silk/init_decoder.c.o
  765. [ 13%] Building C object externals/opus/CMakeFiles/opus.dir/silk/init_encoder.c.o
  766. [ 13%] Building C object externals/opus/CMakeFiles/opus.dir/silk/inner_prod_aligned.c.o
  767. [ 14%] Building C object externals/zstd/build/cmake/lib/CMakeFiles/libzstd_static.dir/__/__/__/lib/dictBuilder/divsufsort.c.o
  768. [ 14%] Building C object externals/opus/CMakeFiles/opus.dir/silk/interpolate.c.o
  769. [ 15%] Building C object externals/opus/CMakeFiles/opus.dir/silk/lin2log.c.o
  770. [ 15%] Building C object externals/libressl/ssl/CMakeFiles/ssl.dir/ssl_clnt.c.o
  771. [ 15%] Building C object externals/opus/CMakeFiles/opus.dir/silk/log2lin.c.o
  772. [ 15%] Building C object externals/opus/CMakeFiles/opus.dir/silk/pitch_est_tables.c.o
  773. [ 15%] Building C object externals/opus/CMakeFiles/opus.dir/silk/process_NLSFs.c.o
  774. [ 15%] Building C object externals/opus/CMakeFiles/opus.dir/silk/quant_LTP_gains.c.o
  775. [ 15%] Building C object externals/opus/CMakeFiles/opus.dir/silk/resampler.c.o
  776. [ 15%] Building C object externals/opus/CMakeFiles/opus.dir/silk/resampler_down2.c.o
  777. [ 15%] Building C object externals/opus/CMakeFiles/opus.dir/silk/resampler_down2_3.c.o
  778. [ 15%] Building C object externals/opus/CMakeFiles/opus.dir/silk/resampler_private_AR2.c.o
  779. [ 15%] Building C object externals/opus/CMakeFiles/opus.dir/silk/resampler_private_IIR_FIR.c.o
  780. [ 15%] Building C object externals/opus/CMakeFiles/opus.dir/silk/resampler_private_down_FIR.c.o
  781. [ 15%] Building C object externals/libressl/ssl/CMakeFiles/ssl.dir/ssl_err.c.o
  782. [ 15%] Building C object externals/opus/CMakeFiles/opus.dir/silk/resampler_private_up2_HQ.c.o
  783. [ 15%] Building C object externals/libressl/ssl/CMakeFiles/ssl.dir/ssl_init.c.o
  784. [ 15%] Building C object externals/opus/CMakeFiles/opus.dir/silk/resampler_rom.c.o
  785. [ 15%] Building C object externals/opus/CMakeFiles/opus.dir/silk/shell_coder.c.o
  786. [ 15%] Building C object externals/libressl/ssl/CMakeFiles/ssl.dir/ssl_lib.c.o
  787. [ 15%] Building C object externals/opus/CMakeFiles/opus.dir/silk/sigm_Q15.c.o
  788. [ 17%] Building C object externals/opus/CMakeFiles/opus.dir/silk/sort.c.o
  789. [ 17%] Building C object externals/opus/CMakeFiles/opus.dir/silk/stereo_LR_to_MS.c.o
  790. [ 17%] Building C object externals/opus/CMakeFiles/opus.dir/silk/stereo_MS_to_LR.c.o
  791. [ 17%] Building C object externals/zstd/build/cmake/lib/CMakeFiles/libzstd_static.dir/__/__/__/lib/dictBuilder/zdict.c.o
  792. [ 17%] Building C object externals/opus/CMakeFiles/opus.dir/silk/stereo_decode_pred.c.o
  793. [ 17%] Building C object externals/opus/CMakeFiles/opus.dir/silk/stereo_encode_pred.c.o
  794. [ 17%] Building C object externals/libressl/ssl/CMakeFiles/ssl.dir/ssl_packet.c.o
  795. [ 17%] Building C object externals/opus/CMakeFiles/opus.dir/silk/stereo_find_predictor.c.o
  796. [ 17%] Building C object externals/opus/CMakeFiles/opus.dir/silk/stereo_quant_pred.c.o
  797. [ 17%] Building C object externals/libressl/ssl/CMakeFiles/ssl.dir/ssl_pkt.c.o
  798. [ 17%] Building C object externals/opus/CMakeFiles/opus.dir/silk/sum_sqr_shift.c.o
  799. [ 17%] Building C object externals/opus/CMakeFiles/opus.dir/silk/table_LSF_cos.c.o
  800. [ 17%] Building C object externals/opus/CMakeFiles/opus.dir/silk/tables_LTP.c.o
  801. [ 17%] Building C object externals/opus/CMakeFiles/opus.dir/silk/tables_NLSF_CB_NB_MB.c.o
  802. [ 17%] Building C object externals/zstd/build/cmake/lib/CMakeFiles/libzstd_static.dir/__/__/__/lib/deprecated/zbuff_common.c.o
  803. [ 17%] Building C object externals/opus/CMakeFiles/opus.dir/silk/tables_NLSF_CB_WB.c.o
  804. [ 17%] Building C object externals/zstd/build/cmake/lib/CMakeFiles/libzstd_static.dir/__/__/__/lib/deprecated/zbuff_compress.c.o
  805. [ 17%] Building C object externals/opus/CMakeFiles/opus.dir/silk/tables_gain.c.o
  806. [ 17%] Building C object externals/zstd/build/cmake/lib/CMakeFiles/libzstd_static.dir/__/__/__/lib/deprecated/zbuff_decompress.c.o
  807. [ 17%] Building C object externals/opus/CMakeFiles/opus.dir/silk/tables_other.c.o
  808. [ 17%] Linking C static library libzstd.a
  809. [ 17%] Building C object externals/opus/CMakeFiles/opus.dir/silk/tables_pitch_lag.c.o
  810. [ 17%] Building C object externals/libressl/ssl/CMakeFiles/ssl.dir/ssl_rsa.c.o
  811. [ 17%] Building C object externals/opus/CMakeFiles/opus.dir/silk/tables_pulses_per_block.c.o
  812. [ 17%] Built target libzstd_static
  813. [ 18%] Building C object externals/opus/CMakeFiles/opus.dir/src/analysis.c.o
  814. Scanning dependencies of target tls
  815. [ 18%] Building C object externals/libressl/tls/CMakeFiles/tls.dir/tls.c.o
  816. [ 18%] Building C object externals/libressl/ssl/CMakeFiles/ssl.dir/ssl_sess.c.o
  817. [ 19%] Building C object externals/libressl/tls/CMakeFiles/tls.dir/tls_bio_cb.c.o
  818. [ 19%] Building C object externals/libressl/tls/CMakeFiles/tls.dir/tls_client.c.o
  819. [ 19%] Building C object externals/libressl/ssl/CMakeFiles/ssl.dir/ssl_srvr.c.o
  820. [ 19%] Building C object externals/opus/CMakeFiles/opus.dir/src/mlp.c.o
  821. [ 19%] Building C object externals/libressl/tls/CMakeFiles/tls.dir/tls_config.c.o
  822. [ 19%] Building C object externals/opus/CMakeFiles/opus.dir/src/mlp_data.c.o
  823. [ 19%] Building C object externals/opus/CMakeFiles/opus.dir/src/opus.c.o
  824. [ 19%] Building C object externals/libressl/tls/CMakeFiles/tls.dir/tls_conninfo.c.o
  825. [ 19%] Building C object externals/opus/CMakeFiles/opus.dir/src/opus_decoder.c.o
  826. [ 19%] Building C object externals/libressl/tls/CMakeFiles/tls.dir/tls_keypair.c.o
  827. [ 19%] Building C object externals/libressl/ssl/CMakeFiles/ssl.dir/ssl_stat.c.o
  828. [ 19%] Building C object externals/libressl/tls/CMakeFiles/tls.dir/tls_server.c.o
  829. [ 19%] Building C object externals/libressl/ssl/CMakeFiles/ssl.dir/ssl_tlsext.c.o
  830. [ 19%] Building C object externals/opus/CMakeFiles/opus.dir/src/opus_encoder.c.o
  831. [ 19%] Building C object externals/libressl/tls/CMakeFiles/tls.dir/tls_ocsp.c.o
  832. [ 19%] Building C object externals/libressl/tls/CMakeFiles/tls.dir/tls_peer.c.o
  833. [ 19%] Building C object externals/libressl/tls/CMakeFiles/tls.dir/tls_util.c.o
  834. [ 19%] Building C object externals/libressl/ssl/CMakeFiles/ssl.dir/ssl_txt.c.o
  835. [ 19%] Building C object externals/libressl/tls/CMakeFiles/tls.dir/tls_verify.c.o
  836. [ 19%] Building C object externals/libressl/ssl/CMakeFiles/ssl.dir/ssl_versions.c.o
  837. [ 19%] Linking C static library libtls.a
  838. [ 19%] Built target tls
  839. [ 19%] Building C object externals/libressl/ssl/CMakeFiles/ssl.dir/t1_clnt.c.o
  840. Scanning dependencies of target lurlparser
  841. [ 19%] Building CXX object externals/lurlparser/CMakeFiles/lurlparser.dir/LUrlParser.cpp.o
  842. [ 20%] Building C object externals/libressl/ssl/CMakeFiles/ssl.dir/t1_enc.c.o
  843. [ 20%] Building C object externals/libressl/ssl/CMakeFiles/ssl.dir/t1_hash.c.o
  844. [ 20%] Building C object externals/opus/CMakeFiles/opus.dir/src/opus_multistream.c.o
  845. [ 20%] Building C object externals/libressl/ssl/CMakeFiles/ssl.dir/t1_lib.c.o
  846. [ 20%] Building C object externals/opus/CMakeFiles/opus.dir/src/opus_multistream_decoder.c.o
  847. [ 20%] Linking CXX static library liblurlparser.a
  848. [ 20%] Building C object externals/opus/CMakeFiles/opus.dir/src/opus_multistream_encoder.c.o
  849. [ 20%] Building C object externals/libressl/ssl/CMakeFiles/ssl.dir/t1_meth.c.o
  850. [ 20%] Built target lurlparser
  851. [ 21%] Building C object externals/libressl/crypto/CMakeFiles/crypto.dir/asn1/d2i_pr.c.o
  852. [ 21%] Building C object externals/libressl/ssl/CMakeFiles/ssl.dir/t1_srvr.c.o
  853. [ 21%] Building C object externals/libressl/crypto/CMakeFiles/crypto.dir/asn1/d2i_pu.c.o
  854. Scanning dependencies of target mbedcrypto
  855. [ 21%] Linking C static library libssl.a
  856. [ 21%] Building C object externals/libressl/crypto/CMakeFiles/crypto.dir/asn1/evp_asn1.c.o
  857. [ 21%] Building C object externals/mbedtls/library/CMakeFiles/mbedcrypto.dir/aes.c.o
  858. [ 21%] Building C object externals/libressl/crypto/CMakeFiles/crypto.dir/asn1/f_enum.c.o
  859. [ 21%] Built target ssl
  860. Scanning dependencies of target open_source_archives
  861. [ 21%] Building CXX object externals/open_source_archives/CMakeFiles/open_source_archives.dir/src/FontChineseSimplified.cpp.o
  862. [ 21%] Building C object externals/libressl/crypto/CMakeFiles/crypto.dir/asn1/f_int.c.o
  863. [ 21%] Building C object externals/libressl/crypto/CMakeFiles/crypto.dir/asn1/f_string.c.o
  864. [ 21%] Building C object externals/mbedtls/library/CMakeFiles/mbedcrypto.dir/aesni.c.o
  865. [ 21%] Building C object externals/libressl/crypto/CMakeFiles/crypto.dir/asn1/i2d_pr.c.o
  866. [ 21%] Building C object externals/opus/CMakeFiles/opus.dir/src/repacketizer.c.o
  867. [ 21%] Building C object externals/mbedtls/library/CMakeFiles/mbedcrypto.dir/arc4.c.o
  868. [ 21%] Building C object externals/libressl/crypto/CMakeFiles/crypto.dir/asn1/i2d_pu.c.o
  869. [ 21%] Building C object externals/mbedtls/library/CMakeFiles/mbedcrypto.dir/aria.c.o
  870. [ 21%] Building C object externals/mbedtls/library/CMakeFiles/mbedcrypto.dir/asn1parse.c.o
  871. [ 21%] Building C object externals/libressl/crypto/CMakeFiles/crypto.dir/asn1/n_pkey.c.o
  872. [ 21%] Building C object externals/opus/CMakeFiles/opus.dir/silk/float/LPC_analysis_filter_FLP.c.o
  873. [ 21%] Building C object externals/mbedtls/library/CMakeFiles/mbedcrypto.dir/asn1write.c.o
  874. [ 21%] Building C object externals/libressl/crypto/CMakeFiles/crypto.dir/asn1/nsseq.c.o
  875. [ 21%] Building C object externals/mbedtls/library/CMakeFiles/mbedcrypto.dir/base64.c.o
  876. [ 21%] Building C object externals/opus/CMakeFiles/opus.dir/silk/float/LPC_inv_pred_gain_FLP.c.o
  877. [ 21%] Building C object externals/libressl/crypto/CMakeFiles/crypto.dir/asn1/p5_pbe.c.o
  878. [ 21%] Building C object externals/mbedtls/library/CMakeFiles/mbedcrypto.dir/bignum.c.o
  879. [ 21%] Building C object externals/libressl/crypto/CMakeFiles/crypto.dir/asn1/p5_pbev2.c.o
  880. [ 21%] Building C object externals/opus/CMakeFiles/opus.dir/silk/float/LTP_analysis_filter_FLP.c.o
  881. [ 21%] Building CXX object externals/open_source_archives/CMakeFiles/open_source_archives.dir/src/FontChineseTraditional.cpp.o
  882. [ 21%] Building C object externals/libressl/crypto/CMakeFiles/crypto.dir/asn1/p8_pkey.c.o
  883. [ 21%] Building C object externals/opus/CMakeFiles/opus.dir/silk/float/LTP_scale_ctrl_FLP.c.o
  884. [ 21%] Building C object externals/opus/CMakeFiles/opus.dir/silk/float/apply_sine_window_FLP.c.o
  885. [ 21%] Building C object externals/libressl/crypto/CMakeFiles/crypto.dir/asn1/t_bitst.c.o
  886. [ 21%] Building C object externals/opus/CMakeFiles/opus.dir/silk/float/autocorrelation_FLP.c.o
  887. [ 21%] Building C object externals/libressl/crypto/CMakeFiles/crypto.dir/asn1/t_crl.c.o
  888. [ 22%] Building C object externals/opus/CMakeFiles/opus.dir/silk/float/burg_modified_FLP.c.o
  889. [ 22%] Building C object externals/libressl/crypto/CMakeFiles/crypto.dir/asn1/t_pkey.c.o
  890. [ 23%] Building C object externals/libressl/crypto/CMakeFiles/crypto.dir/asn1/t_req.c.o
  891. [ 23%] Building C object externals/opus/CMakeFiles/opus.dir/silk/float/bwexpander_FLP.c.o
  892. [ 23%] Building C object externals/mbedtls/library/CMakeFiles/mbedcrypto.dir/blowfish.c.o
  893. [ 23%] Building C object externals/libressl/crypto/CMakeFiles/crypto.dir/asn1/t_spki.c.o
  894. [ 23%] Building C object externals/opus/CMakeFiles/opus.dir/silk/float/corrMatrix_FLP.c.o
  895. [ 24%] Building C object externals/mbedtls/library/CMakeFiles/mbedcrypto.dir/camellia.c.o
  896. [ 24%] Building C object externals/libressl/crypto/CMakeFiles/crypto.dir/asn1/t_x509.c.o
  897. [ 24%] Building C object externals/opus/CMakeFiles/opus.dir/silk/float/encode_frame_FLP.c.o
  898. [ 24%] Building CXX object externals/open_source_archives/CMakeFiles/open_source_archives.dir/src/FontExtendedChineseSimplified.cpp.o
  899. [ 24%] Building C object externals/mbedtls/library/CMakeFiles/mbedcrypto.dir/ccm.c.o
  900. [ 24%] Building C object externals/libressl/crypto/CMakeFiles/crypto.dir/asn1/t_x509a.c.o
  901. [ 24%] Building C object externals/opus/CMakeFiles/opus.dir/silk/float/energy_FLP.c.o
  902. [ 24%] Building C object externals/libressl/crypto/CMakeFiles/crypto.dir/asn1/tasn_dec.c.o
  903. [ 24%] Building C object externals/opus/CMakeFiles/opus.dir/silk/float/find_LPC_FLP.c.o
  904. [ 24%] Building C object externals/mbedtls/library/CMakeFiles/mbedcrypto.dir/chacha20.c.o
  905. [ 24%] Building C object externals/opus/CMakeFiles/opus.dir/silk/float/find_LTP_FLP.c.o
  906. [ 24%] Building C object externals/mbedtls/library/CMakeFiles/mbedcrypto.dir/chachapoly.c.o
  907. [ 24%] Building C object externals/opus/CMakeFiles/opus.dir/silk/float/find_pitch_lags_FLP.c.o
  908. [ 24%] Building C object externals/mbedtls/library/CMakeFiles/mbedcrypto.dir/cipher.c.o
  909. [ 24%] Building C object externals/opus/CMakeFiles/opus.dir/silk/float/find_pred_coefs_FLP.c.o
  910. [ 24%] Building C object externals/libressl/crypto/CMakeFiles/crypto.dir/asn1/tasn_enc.c.o
  911. [ 24%] Building C object externals/opus/CMakeFiles/opus.dir/silk/float/inner_product_FLP.c.o
  912. [ 24%] Building C object externals/mbedtls/library/CMakeFiles/mbedcrypto.dir/cipher_wrap.c.o
  913. [ 24%] Building C object externals/opus/CMakeFiles/opus.dir/silk/float/k2a_FLP.c.o
  914. [ 24%] Building C object externals/libressl/crypto/CMakeFiles/crypto.dir/asn1/tasn_fre.c.o
  915. [ 24%] Building C object externals/opus/CMakeFiles/opus.dir/silk/float/noise_shape_analysis_FLP.c.o
  916. [ 24%] Building C object externals/mbedtls/library/CMakeFiles/mbedcrypto.dir/cmac.c.o
  917. [ 24%] Building C object externals/libressl/crypto/CMakeFiles/crypto.dir/asn1/tasn_new.c.o
  918. [ 24%] Building C object externals/mbedtls/library/CMakeFiles/mbedcrypto.dir/ctr_drbg.c.o
  919. [ 24%] Building C object externals/opus/CMakeFiles/opus.dir/silk/float/pitch_analysis_core_FLP.c.o
  920. [ 24%] Building C object externals/libressl/crypto/CMakeFiles/crypto.dir/asn1/tasn_prn.c.o
  921. [ 24%] Building C object externals/mbedtls/library/CMakeFiles/mbedcrypto.dir/des.c.o
  922. [ 24%] Building C object externals/libressl/crypto/CMakeFiles/crypto.dir/asn1/tasn_typ.c.o
  923. [ 24%] Building CXX object externals/open_source_archives/CMakeFiles/open_source_archives.dir/src/FontKorean.cpp.o
  924. [ 24%] Building C object externals/opus/CMakeFiles/opus.dir/silk/float/process_gains_FLP.c.o
  925. [ 24%] Building C object externals/mbedtls/library/CMakeFiles/mbedcrypto.dir/dhm.c.o
  926. [ 24%] Building C object externals/libressl/crypto/CMakeFiles/crypto.dir/asn1/tasn_utl.c.o
  927. [ 24%] Building C object externals/opus/CMakeFiles/opus.dir/silk/float/regularize_correlations_FLP.c.o
  928. [ 24%] Building C object externals/opus/CMakeFiles/opus.dir/silk/float/residual_energy_FLP.c.o
  929. [ 24%] Building C object externals/mbedtls/library/CMakeFiles/mbedcrypto.dir/ecdh.c.o
  930. [ 24%] Building C object externals/libressl/crypto/CMakeFiles/crypto.dir/asn1/x_algor.c.o
  931. [ 24%] Building C object externals/mbedtls/library/CMakeFiles/mbedcrypto.dir/ecdsa.c.o
  932. [ 25%] Building C object externals/opus/CMakeFiles/opus.dir/silk/float/scale_copy_vector_FLP.c.o
  933. [ 25%] Building C object externals/libressl/crypto/CMakeFiles/crypto.dir/asn1/x_attrib.c.o
  934. [ 25%] Building C object externals/mbedtls/library/CMakeFiles/mbedcrypto.dir/ecjpake.c.o
  935. [ 25%] Building C object externals/opus/CMakeFiles/opus.dir/silk/float/scale_vector_FLP.c.o
  936. [ 25%] Building C object externals/mbedtls/library/CMakeFiles/mbedcrypto.dir/ecp.c.o
  937. [ 25%] Building C object externals/libressl/crypto/CMakeFiles/crypto.dir/asn1/x_bignum.c.o
  938. [ 25%] Building C object externals/opus/CMakeFiles/opus.dir/silk/float/schur_FLP.c.o
  939. [ 25%] Building C object externals/libressl/crypto/CMakeFiles/crypto.dir/asn1/x_crl.c.o
  940. [ 25%] Building C object externals/opus/CMakeFiles/opus.dir/silk/float/sort_FLP.c.o
  941. [ 25%] Building C object externals/libressl/crypto/CMakeFiles/crypto.dir/asn1/x_exten.c.o
  942. [ 25%] Building C object externals/opus/CMakeFiles/opus.dir/silk/float/warped_autocorrelation_FLP.c.o
  943. [ 26%] Building C object externals/libressl/crypto/CMakeFiles/crypto.dir/asn1/x_info.c.o
  944. [ 26%] Building C object externals/opus/CMakeFiles/opus.dir/silk/float/wrappers_FLP.c.o
  945. [ 26%] Building C object externals/libressl/crypto/CMakeFiles/crypto.dir/asn1/x_long.c.o
  946. [ 26%] Building CXX object externals/open_source_archives/CMakeFiles/open_source_archives.dir/src/FontNintendoExtended.cpp.o
  947. [ 26%] Building C object externals/mbedtls/library/CMakeFiles/mbedcrypto.dir/ecp_curves.c.o
  948. [ 26%] Building C object externals/libressl/crypto/CMakeFiles/crypto.dir/asn1/x_name.c.o
  949. [ 26%] Linking C static library libopus.a
  950. [ 26%] Built target opus
  951. Scanning dependencies of target speex
  952. [ 26%] Building C object externals/cubeb/CMakeFiles/speex.dir/src/speex/resample.c.o
  953. [ 26%] Building C object externals/libressl/crypto/CMakeFiles/crypto.dir/asn1/x_nx509.c.o
  954. /var/tmp/pamac-build-brandon/yuzu-git/src/yuzu/externals/cubeb/src/speex/resample.c: In function ‘update_filter’:
  955. /var/tmp/pamac-build-brandon/yuzu-git/src/yuzu/externals/cubeb/src/speex/resample.c:674:20: warning: comparison of integer expressions of different signedness: ‘int’ and ‘unsigned int’ [-Wsign-compare]
  956.   674 |          for (j=0;j<st->filt_len;j++)
  957.       |                    ^
  958. /var/tmp/pamac-build-brandon/yuzu-git/src/yuzu/externals/cubeb/src/speex/resample.c: In function ‘speex_resampler_process_float’:
  959. /var/tmp/pamac-build-brandon/yuzu-git/src/yuzu/externals/cubeb/src/speex/resample.c:946:21: warning: comparison of integer expressions of different signedness: ‘int’ and ‘unsigned int’ [-Wsign-compare]
  960.   946 |            for(j=0;j<ichunk;++j)
  961.       |                     ^
  962. /var/tmp/pamac-build-brandon/yuzu-git/src/yuzu/externals/cubeb/src/speex/resample.c:949:20: warning: comparison of integer expressions of different signedness: ‘int’ and ‘unsigned int’ [-Wsign-compare]
  963.   949 |           for(j=0;j<ichunk;++j)
  964.       |                    ^
  965. /var/tmp/pamac-build-brandon/yuzu-git/src/yuzu/externals/cubeb/src/speex/resample.c: In function ‘speex_resampler_process_int’:
  966. /var/tmp/pamac-build-brandon/yuzu-git/src/yuzu/externals/cubeb/src/speex/resample.c:1002:19: warning: comparison of integer expressions of different signedness: ‘int’ and ‘unsigned int’ [-Wsign-compare]
  967.  1002 |          for(j=0;j<ichunk;++j)
  968.       |                   ^
  969. /var/tmp/pamac-build-brandon/yuzu-git/src/yuzu/externals/cubeb/src/speex/resample.c:1009:19: warning: comparison of integer expressions of different signedness: ‘int’ and ‘unsigned int’ [-Wsign-compare]
  970.  1009 |          for(j=0;j<ichunk;++j)
  971.       |                   ^
  972. /var/tmp/pamac-build-brandon/yuzu-git/src/yuzu/externals/cubeb/src/speex/resample.c:1019:16: warning: comparison of integer expressions of different signedness: ‘int’ and ‘unsigned int’ [-Wsign-compare]
  973.  1019 |      for (j=0;j<ochunk+omagic;++j)
  974.       |                ^
  975. [ 26%] Building C object externals/libressl/crypto/CMakeFiles/crypto.dir/asn1/x_pkey.c.o
  976. [ 26%] Building C object externals/mbedtls/library/CMakeFiles/mbedcrypto.dir/entropy.c.o
  977. [ 26%] Building C object externals/libressl/crypto/CMakeFiles/crypto.dir/asn1/x_pubkey.c.o
  978. [ 27%] Building C object externals/mbedtls/library/CMakeFiles/mbedcrypto.dir/entropy_poll.c.o
  979. [ 27%] Building C object externals/mbedtls/library/CMakeFiles/mbedcrypto.dir/error.c.o
  980. [ 27%] Building C object externals/libressl/crypto/CMakeFiles/crypto.dir/asn1/x_req.c.o
  981. [ 27%] Built target speex
  982. [ 27%] Building C object externals/libressl/crypto/CMakeFiles/crypto.dir/asn1/x_sig.c.o
  983. Scanning dependencies of target dynarmic
  984. [ 27%] Building CXX object externals/dynarmic/src/CMakeFiles/dynarmic.dir/common/crypto/aes.cpp.o
  985. [ 27%] Building CXX object externals/open_source_archives/CMakeFiles/open_source_archives.dir/src/FontStandard.cpp.o
  986. [ 27%] Building C object externals/libressl/crypto/CMakeFiles/crypto.dir/asn1/x_spki.c.o
  987. [ 27%] Building C object externals/libressl/crypto/CMakeFiles/crypto.dir/asn1/x_val.c.o
  988. [ 27%] Building C object externals/mbedtls/library/CMakeFiles/mbedcrypto.dir/gcm.c.o
  989. [ 27%] Building C object externals/libressl/crypto/CMakeFiles/crypto.dir/asn1/x_x509.c.o
  990. [ 27%] Building C object externals/mbedtls/library/CMakeFiles/mbedcrypto.dir/havege.c.o
  991. [ 27%] Building C object externals/libressl/crypto/CMakeFiles/crypto.dir/asn1/x_x509a.c.o
  992. [ 27%] Building C object externals/mbedtls/library/CMakeFiles/mbedcrypto.dir/hkdf.c.o
  993. [ 27%] Building CXX object externals/dynarmic/src/CMakeFiles/dynarmic.dir/common/crypto/crc32.cpp.o
  994. [ 27%] Building C object externals/mbedtls/library/CMakeFiles/mbedcrypto.dir/hmac_drbg.c.o
  995. [ 27%] Building C object externals/libressl/crypto/CMakeFiles/crypto.dir/bf/bf_cfb64.c.o
  996. [ 27%] Building C object externals/libressl/crypto/CMakeFiles/crypto.dir/bf/bf_ecb.c.o
  997. [ 27%] Building C object externals/libressl/crypto/CMakeFiles/crypto.dir/bf/bf_enc.c.o
  998. [ 27%] Building C object externals/mbedtls/library/CMakeFiles/mbedcrypto.dir/md.c.o
  999. [ 27%] Building C object externals/mbedtls/library/CMakeFiles/mbedcrypto.dir/md2.c.o
  1000. [ 27%] Building C object externals/libressl/crypto/CMakeFiles/crypto.dir/bf/bf_ofb64.c.o
  1001. [ 27%] Building CXX object externals/dynarmic/src/CMakeFiles/dynarmic.dir/common/crypto/sm4.cpp.o
  1002. [ 27%] Building C object externals/mbedtls/library/CMakeFiles/mbedcrypto.dir/md4.c.o
  1003. [ 28%] Building C object externals/libressl/crypto/CMakeFiles/crypto.dir/bf/bf_skey.c.o
  1004. [ 28%] Building C object externals/mbedtls/library/CMakeFiles/mbedcrypto.dir/md5.c.o
  1005. [ 29%] Linking CXX static library libopen_source_archives.a
  1006. [ 29%] Building C object externals/libressl/crypto/CMakeFiles/crypto.dir/bio/b_dump.c.o
  1007. [ 29%] Building C object externals/libressl/crypto/CMakeFiles/crypto.dir/bio/b_print.c.o
  1008. [ 29%] Built target open_source_archives
  1009. [ 29%] Generating scm_rev.cpp
  1010. [ 29%] Building C object externals/mbedtls/library/CMakeFiles/mbedcrypto.dir/md_wrap.c.o
  1011. [ 29%] Building C object externals/libressl/crypto/CMakeFiles/crypto.dir/bio/b_sock.c.o
  1012. [ 29%] Building CXX object externals/dynarmic/src/CMakeFiles/dynarmic.dir/common/fp/fused.cpp.o
  1013. [ 29%] Building C object externals/mbedtls/library/CMakeFiles/mbedcrypto.dir/memory_buffer_alloc.c.o
  1014. [ 29%] Building C object externals/mbedtls/library/CMakeFiles/mbedcrypto.dir/nist_kw.c.o
  1015. [ 29%] Building C object externals/mbedtls/library/CMakeFiles/mbedcrypto.dir/oid.c.o
  1016. [ 29%] Building C object externals/libressl/crypto/CMakeFiles/crypto.dir/bio/bf_buff.c.o
  1017. [ 29%] Building C object externals/mbedtls/library/CMakeFiles/mbedcrypto.dir/padlock.c.o
  1018. [ 29%] Building C object externals/mbedtls/library/CMakeFiles/mbedcrypto.dir/pem.c.o
  1019. [ 29%] Building C object externals/libressl/crypto/CMakeFiles/crypto.dir/bio/bf_nbio.c.o
  1020. [ 29%] Building C object externals/libressl/crypto/CMakeFiles/crypto.dir/bio/bf_null.c.o
  1021. [ 30%] Building C object externals/mbedtls/library/CMakeFiles/mbedcrypto.dir/pk.c.o
  1022. [ 30%] Building C object externals/libressl/crypto/CMakeFiles/crypto.dir/bio/bio_cb.c.o
  1023. [ 30%] Building C object externals/libressl/crypto/CMakeFiles/crypto.dir/bio/bio_err.c.o
  1024. [ 30%] Building C object externals/mbedtls/library/CMakeFiles/mbedcrypto.dir/pk_wrap.c.o
  1025. [ 30%] Building C object externals/libressl/crypto/CMakeFiles/crypto.dir/bio/bio_lib.c.o
  1026. In file included from /var/tmp/pamac-build-brandon/yuzu-git/src/yuzu/externals/dynarmic/src/./common/assert.h:9,
  1027.                  from /var/tmp/pamac-build-brandon/yuzu-git/src/yuzu/externals/dynarmic/src/./common/bit_util.h:14,
  1028.                  from /var/tmp/pamac-build-brandon/yuzu-git/src/yuzu/externals/dynarmic/src/./common/fp/mantissa_util.h:9,
  1029.                  from /var/tmp/pamac-build-brandon/yuzu-git/src/yuzu/externals/dynarmic/src/common/fp/fused.cpp:7:
  1030. /var/tmp/pamac-build-brandon/yuzu-git/src/yuzu/externals/fmt/include/fmt/format.h:3475:55: error: ISO C++ did not adopt string literal operator templates taking an argument pack of characters [-Wpedantic]
  1031.  3475 | FMT_CONSTEXPR internal::udl_formatter<Char, CHARS...> operator""_format() {
  1032.       |                                                       ^~~~~~~~
  1033. compilation terminated due to -Wfatal-errors.
  1034. make[2]: *** [externals/dynarmic/src/CMakeFiles/dynarmic.dir/build.make:102: externals/dynarmic/src/CMakeFiles/dynarmic.dir/common/fp/fused.cpp.o] Error 1
  1035. make[1]: *** [CMakeFiles/Makefile2:267: externals/dynarmic/src/CMakeFiles/dynarmic.dir/all] Error 2
  1036. make[1]: *** Waiting for unfinished jobs....
  1037. [ 30%] Building C object externals/mbedtls/library/CMakeFiles/mbedcrypto.dir/pkcs12.c.o
  1038. [ 30%] Building C object externals/libressl/crypto/CMakeFiles/crypto.dir/bio/bio_meth.c.o
  1039. [ 30%] Building C object externals/libressl/crypto/CMakeFiles/crypto.dir/bio/bss_bio.c.o
  1040. [ 30%] Building C object externals/libressl/crypto/CMakeFiles/crypto.dir/bio/bss_acpt.c.o
  1041. Scanning dependencies of target common
  1042. [ 30%] Building CXX object src/common/CMakeFiles/common.dir/detached_tasks.cpp.o
  1043. [ 30%] Building C object externals/mbedtls/library/CMakeFiles/mbedcrypto.dir/pkcs5.c.o
  1044. [ 30%] Building C object externals/libressl/crypto/CMakeFiles/crypto.dir/bio/bss_conn.c.o
  1045. [ 30%] Building C object externals/libressl/crypto/CMakeFiles/crypto.dir/bio/bss_dgram.c.o
  1046. [ 30%] Building C object externals/mbedtls/library/CMakeFiles/mbedcrypto.dir/pkparse.c.o
  1047. [ 30%] Building C object externals/libressl/crypto/CMakeFiles/crypto.dir/bio/bss_fd.c.o
  1048. [ 31%] Building C object externals/libressl/crypto/CMakeFiles/crypto.dir/bio/bss_file.c.o
  1049. [ 31%] Building C object externals/libressl/crypto/CMakeFiles/crypto.dir/bio/bss_mem.c.o
  1050. [ 31%] Building C object externals/libressl/crypto/CMakeFiles/crypto.dir/bio/bss_null.c.o
  1051. [ 31%] Building C object externals/mbedtls/library/CMakeFiles/mbedcrypto.dir/pkwrite.c.o
  1052. [ 31%] Building C object externals/libressl/crypto/CMakeFiles/crypto.dir/bio/bss_sock.c.o
  1053. [ 31%] Building C object externals/libressl/crypto/CMakeFiles/crypto.dir/bn/bn_add.c.o
  1054. [ 31%] Building C object externals/libressl/crypto/CMakeFiles/crypto.dir/bn/bn_asm.c.o
  1055. [ 31%] Building C object externals/mbedtls/library/CMakeFiles/mbedcrypto.dir/platform.c.o
  1056. [ 31%] Building C object externals/libressl/crypto/CMakeFiles/crypto.dir/bn/bn_blind.c.o
  1057. [ 31%] Building C object externals/mbedtls/library/CMakeFiles/mbedcrypto.dir/platform_util.c.o
  1058. [ 31%] Building C object externals/mbedtls/library/CMakeFiles/mbedcrypto.dir/poly1305.c.o
  1059. [ 31%] Building C object externals/libressl/crypto/CMakeFiles/crypto.dir/bn/bn_const.c.o
  1060. [ 31%] Building C object externals/libressl/crypto/CMakeFiles/crypto.dir/bn/bn_ctx.c.o
  1061. [ 31%] Building C object externals/mbedtls/library/CMakeFiles/mbedcrypto.dir/ripemd160.c.o
  1062. [ 31%] Building C object externals/mbedtls/library/CMakeFiles/mbedcrypto.dir/rsa.c.o
  1063. [ 31%] Building C object externals/libressl/crypto/CMakeFiles/crypto.dir/bn/bn_depr.c.o
  1064. [ 31%] Building C object externals/libressl/crypto/CMakeFiles/crypto.dir/bn/bn_div.c.o
  1065. [ 32%] Building CXX object src/common/CMakeFiles/common.dir/cityhash.cpp.o
  1066. [ 32%] Building C object externals/libressl/crypto/CMakeFiles/crypto.dir/bn/bn_err.c.o
  1067. [ 32%] Building C object externals/libressl/crypto/CMakeFiles/crypto.dir/bn/bn_exp.c.o
  1068. [ 32%] Building C object externals/mbedtls/library/CMakeFiles/mbedcrypto.dir/rsa_internal.c.o
  1069. [ 32%] Building C object externals/libressl/crypto/CMakeFiles/crypto.dir/bn/bn_exp2.c.o
  1070. [ 32%] Building C object externals/mbedtls/library/CMakeFiles/mbedcrypto.dir/sha1.c.o
  1071. [ 32%] Building C object externals/libressl/crypto/CMakeFiles/crypto.dir/bn/bn_gcd.c.o
  1072. [ 34%] Building C object externals/libressl/crypto/CMakeFiles/crypto.dir/bn/bn_gf2m.c.o
  1073. [ 34%] Building C object externals/libressl/crypto/CMakeFiles/crypto.dir/bn/bn_kron.c.o
  1074. [ 34%] Building C object externals/mbedtls/library/CMakeFiles/mbedcrypto.dir/sha256.c.o
  1075. [ 34%] Building C object externals/libressl/crypto/CMakeFiles/crypto.dir/bn/bn_lib.c.o
  1076. [ 34%] Building CXX object src/common/CMakeFiles/common.dir/file_util.cpp.o
  1077. [ 34%] Building C object externals/libressl/crypto/CMakeFiles/crypto.dir/bn/bn_mod.c.o
  1078. [ 34%] Building C object externals/mbedtls/library/CMakeFiles/mbedcrypto.dir/sha512.c.o
  1079. [ 34%] Building C object externals/libressl/crypto/CMakeFiles/crypto.dir/bn/bn_mpi.c.o
  1080. [ 34%] Building C object externals/libressl/crypto/CMakeFiles/crypto.dir/bn/bn_mont.c.o
  1081. [ 34%] Building C object externals/mbedtls/library/CMakeFiles/mbedcrypto.dir/threading.c.o
  1082. [ 35%] Building C object externals/mbedtls/library/CMakeFiles/mbedcrypto.dir/timing.c.o
  1083. [ 35%] Building C object externals/mbedtls/library/CMakeFiles/mbedcrypto.dir/version.c.o
  1084. [ 35%] Building C object externals/mbedtls/library/CMakeFiles/mbedcrypto.dir/version_features.c.o
  1085. [ 35%] Building C object externals/libressl/crypto/CMakeFiles/crypto.dir/bn/bn_mul.c.o
  1086. [ 35%] Building C object externals/mbedtls/library/CMakeFiles/mbedcrypto.dir/xtea.c.o
  1087. [ 35%] Building C object externals/libressl/crypto/CMakeFiles/crypto.dir/bn/bn_nist.c.o
  1088. [ 35%] Linking C static library libmbedcrypto.a
  1089. [ 35%] Built target mbedcrypto
  1090. [ 35%] Building C object externals/libressl/crypto/CMakeFiles/crypto.dir/bn/bn_prime.c.o
  1091. [ 35%] Building CXX object src/common/CMakeFiles/common.dir/hex_util.cpp.o
  1092. [ 35%] Building C object externals/libressl/crypto/CMakeFiles/crypto.dir/bn/bn_print.c.o
  1093. /var/tmp/pamac-build-brandon/yuzu-git/src/yuzu/src/common/file_util.cpp: In function ‘const string& FileUtil::GetUserPath(FileUtil::UserPath, const string&)’:
  1094. /var/tmp/pamac-build-brandon/yuzu-git/src/yuzu/src/common/file_util.cpp:712:16: warning: enumeration value ‘CacheDir’ not handled in switch [-Wswitch]
  1095.   712 |         switch (path) {
  1096.       |                ^
  1097. /var/tmp/pamac-build-brandon/yuzu-git/src/yuzu/src/common/file_util.cpp:712:16: warning: enumeration value ‘ConfigDir’ not handled in switch [-Wswitch]
  1098. /var/tmp/pamac-build-brandon/yuzu-git/src/yuzu/src/common/file_util.cpp:712:16: warning: enumeration value ‘KeysDir’ not handled in switch [-Wswitch]
  1099. /var/tmp/pamac-build-brandon/yuzu-git/src/yuzu/src/common/file_util.cpp:712:16: warning: enumeration value ‘LogDir’ not handled in switch [-Wswitch]
  1100. /var/tmp/pamac-build-brandon/yuzu-git/src/yuzu/src/common/file_util.cpp:712:16: warning: enumeration value ‘NANDDir’ not handled in switch [-Wswitch]
  1101. /var/tmp/pamac-build-brandon/yuzu-git/src/yuzu/src/common/file_util.cpp:712:16: warning: enumeration value ‘SDMCDir’ not handled in switch [-Wswitch]
  1102. /var/tmp/pamac-build-brandon/yuzu-git/src/yuzu/src/common/file_util.cpp:712:16: warning: enumeration value ‘LoadDir’ not handled in switch [-Wswitch]
  1103. /var/tmp/pamac-build-brandon/yuzu-git/src/yuzu/src/common/file_util.cpp:712:16: warning: enumeration value ‘DumpDir’ not handled in switch [-Wswitch]
  1104. /var/tmp/pamac-build-brandon/yuzu-git/src/yuzu/src/common/file_util.cpp:712:16: warning: enumeration value ‘ShaderDir’ not handled in switch [-Wswitch]
  1105. /var/tmp/pamac-build-brandon/yuzu-git/src/yuzu/src/common/file_util.cpp:712:16: warning: enumeration value ‘SysDataDir’ not handled in switch [-Wswitch]
  1106. [ 35%] Building C object externals/libressl/crypto/CMakeFiles/crypto.dir/bn/bn_rand.c.o
  1107. [ 35%] Building C object externals/libressl/crypto/CMakeFiles/crypto.dir/bn/bn_recp.c.o
  1108. [ 35%] Building C object externals/libressl/crypto/CMakeFiles/crypto.dir/bn/bn_shift.c.o
  1109. [ 35%] Building C object externals/libressl/crypto/CMakeFiles/crypto.dir/bn/bn_sqr.c.o
  1110. [ 35%] Building C object externals/libressl/crypto/CMakeFiles/crypto.dir/bn/bn_sqrt.c.o
  1111. [ 35%] Building C object externals/libressl/crypto/CMakeFiles/crypto.dir/bn/bn_word.c.o
  1112. [ 36%] Building C object externals/libressl/crypto/CMakeFiles/crypto.dir/bn/bn_x931p.c.o
  1113. [ 36%] Building C object externals/libressl/crypto/CMakeFiles/crypto.dir/buffer/buf_err.c.o
  1114. [ 36%] Building C object externals/libressl/crypto/CMakeFiles/crypto.dir/buffer/buf_str.c.o
  1115. [ 36%] Building C object externals/libressl/crypto/CMakeFiles/crypto.dir/buffer/buffer.c.o
  1116. [ 36%] Building C object externals/libressl/crypto/CMakeFiles/crypto.dir/camellia/cmll_cfb.c.o
  1117. [ 36%] Building C object externals/libressl/crypto/CMakeFiles/crypto.dir/camellia/cmll_ctr.c.o
  1118. [ 36%] Building C object externals/libressl/crypto/CMakeFiles/crypto.dir/camellia/cmll_ecb.c.o
  1119. [ 36%] Building C object externals/libressl/crypto/CMakeFiles/crypto.dir/camellia/cmll_ofb.c.o
  1120. [ 36%] Building C object externals/libressl/crypto/CMakeFiles/crypto.dir/camellia/cmll_misc.c.o
  1121. [ 36%] Building C object externals/libressl/crypto/CMakeFiles/crypto.dir/cast/c_cfb64.c.o
  1122. [ 36%] Building CXX object src/common/CMakeFiles/common.dir/logging/backend.cpp.o
  1123. [ 36%] Building C object externals/libressl/crypto/CMakeFiles/crypto.dir/cast/c_ecb.c.o
  1124. [ 36%] Building C object externals/libressl/crypto/CMakeFiles/crypto.dir/cast/c_enc.c.o
  1125. [ 36%] Building CXX object src/common/CMakeFiles/common.dir/logging/filter.cpp.o
  1126. [ 36%] Building C object externals/libressl/crypto/CMakeFiles/crypto.dir/cast/c_ofb64.c.o
  1127. [ 36%] Building C object externals/libressl/crypto/CMakeFiles/crypto.dir/cast/c_skey.c.o
  1128. [ 36%] Building C object externals/libressl/crypto/CMakeFiles/crypto.dir/chacha/chacha.c.o
  1129. [ 36%] Building C object externals/libressl/crypto/CMakeFiles/crypto.dir/cmac/cm_ameth.c.o
  1130. [ 36%] Building CXX object src/common/CMakeFiles/common.dir/logging/text_formatter.cpp.o
  1131. [ 37%] Building C object externals/libressl/crypto/CMakeFiles/crypto.dir/cmac/cm_pmeth.c.o
  1132. [ 37%] Building C object externals/libressl/crypto/CMakeFiles/crypto.dir/cmac/cmac.c.o
  1133. [ 37%] Building CXX object src/common/CMakeFiles/common.dir/lz4_compression.cpp.o
  1134. /var/tmp/pamac-build-brandon/yuzu-git/src/yuzu/src/common/logging/backend.cpp: In function ‘const char* Log::GetLogClassName(Log::Class)’:
  1135. /var/tmp/pamac-build-brandon/yuzu-git/src/yuzu/src/common/logging/backend.cpp:276:1: warning: control reaches end of non-void function [-Wreturn-type]
  1136.   276 | }
  1137.       | ^
  1138. /var/tmp/pamac-build-brandon/yuzu-git/src/yuzu/src/common/logging/backend.cpp: In function ‘const char* Log::GetLevelName(Log::Level)’:
  1139. /var/tmp/pamac-build-brandon/yuzu-git/src/yuzu/src/common/logging/backend.cpp:293:1: warning: control reaches end of non-void function [-Wreturn-type]
  1140.   293 | }
  1141.       | ^
  1142. [ 37%] Building C object externals/libressl/crypto/CMakeFiles/crypto.dir/comp/c_rle.c.o
  1143. [ 37%] Building C object externals/libressl/crypto/CMakeFiles/crypto.dir/comp/c_zlib.c.o
  1144. [ 37%] Building C object externals/libressl/crypto/CMakeFiles/crypto.dir/comp/comp_err.c.o
  1145. [ 37%] Building C object externals/libressl/crypto/CMakeFiles/crypto.dir/comp/comp_lib.c.o
  1146. [ 37%] Building C object externals/libressl/crypto/CMakeFiles/crypto.dir/conf/conf_api.c.o
  1147. [ 37%] Building C object externals/libressl/crypto/CMakeFiles/crypto.dir/conf/conf_def.c.o
  1148. [ 37%] Building C object externals/libressl/crypto/CMakeFiles/crypto.dir/conf/conf_err.c.o
  1149. [ 37%] Building CXX object src/common/CMakeFiles/common.dir/memory_hook.cpp.o
  1150. [ 37%] Building C object externals/libressl/crypto/CMakeFiles/crypto.dir/conf/conf_lib.c.o
  1151. [ 37%] Building C object externals/libressl/crypto/CMakeFiles/crypto.dir/conf/conf_mall.c.o
  1152. [ 37%] Building C object externals/libressl/crypto/CMakeFiles/crypto.dir/conf/conf_mod.c.o
  1153. [ 37%] Building CXX object src/common/CMakeFiles/common.dir/microprofile.cpp.o
  1154. [ 37%] Building C object externals/libressl/crypto/CMakeFiles/crypto.dir/conf/conf_sap.c.o
  1155. [ 37%] Building C object externals/libressl/crypto/CMakeFiles/crypto.dir/curve25519/curve25519-generic.c.o
  1156. [ 37%] Building C object externals/libressl/crypto/CMakeFiles/crypto.dir/curve25519/curve25519.c.o
  1157. In file included from /var/tmp/pamac-build-brandon/yuzu-git/src/yuzu/src/./common/microprofile.h:23,
  1158.                  from /var/tmp/pamac-build-brandon/yuzu-git/src/yuzu/src/common/microprofile.cpp:7:
  1159. /var/tmp/pamac-build-brandon/yuzu-git/src/yuzu/externals/./microprofile/microprofile.h: In function ‘MicroProfileLogEntry MicroProfileMakeLogIndex(uint64_t, MicroProfileToken, int64_t)’:
  1160. /var/tmp/pamac-build-brandon/yuzu-git/src/yuzu/externals/./microprofile/microprofile.h:830:17: warning: comparison of integer expressions of different signedness: ‘int’ and ‘uint64_t’ {aka ‘long unsigned int’} [-Wsign-compare]
  1161.   830 |     MP_ASSERT(t == nBegin);
  1162.       |               ~~^~~~~~~~~
  1163. /var/tmp/pamac-build-brandon/yuzu-git/src/yuzu/externals/./microprofile/microprofile.h:238:30: note: in definition of macro ‘MP_ASSERT’
  1164.   238 | #define MP_ASSERT(a) do{if(!(a)){MP_BREAK();} }while(0)
  1165.       |                              ^
  1166. In file included from /var/tmp/pamac-build-brandon/yuzu-git/src/yuzu/src/./common/microprofile.h:23,
  1167.                  from /var/tmp/pamac-build-brandon/yuzu-git/src/yuzu/src/common/microprofile.cpp:7:
  1168. /var/tmp/pamac-build-brandon/yuzu-git/src/yuzu/externals/./microprofile/microprofile.h: In function ‘MicroProfileThreadLog* MicroProfileCreateThreadLog(const char*)’:
  1169. /var/tmp/pamac-build-brandon/yuzu-git/src/yuzu/externals/./microprofile/microprofile.h:1160:34: warning: ‘void* memset(void*, int, size_t)’ clearing an object of type ‘struct MicroProfileThreadLog’ with no trivial copy-assignment; use value-initialization instead [-Wclass-memaccess]
  1170.  1160 |     memset(pLog, 0, sizeof(*pLog));
  1171.       |                                  ^
  1172. In file included from /var/tmp/pamac-build-brandon/yuzu-git/src/yuzu/src/./common/microprofile.h:23,
  1173.                  from /var/tmp/pamac-build-brandon/yuzu-git/src/yuzu/src/common/microprofile.cpp:7:
  1174. /var/tmp/pamac-build-brandon/yuzu-git/src/yuzu/externals/./microprofile/microprofile.h:605:8: note: ‘struct MicroProfileThreadLog’ declared here
  1175.   605 | struct MicroProfileThreadLog
  1176.       |        ^~~~~~~~~~~~~~~~~~~~~
  1177. In file included from /var/tmp/pamac-build-brandon/yuzu-git/src/yuzu/src/./common/microprofile.h:23,
  1178.                  from /var/tmp/pamac-build-brandon/yuzu-git/src/yuzu/src/common/microprofile.cpp:7:
  1179. /var/tmp/pamac-build-brandon/yuzu-git/src/yuzu/externals/./microprofile/microprofile.h: In function ‘void MicroProfileFlip()’:
  1180. /var/tmp/pamac-build-brandon/yuzu-git/src/yuzu/externals/./microprofile/microprofile.h:1558:39: warning: comparison of integer expressions of different signedness: ‘int64_t’ {aka ‘long int’} and ‘uint64_t’ {aka ‘long unsigned int’} [-Wsign-compare]
  1181.  1558 |         if(pFrameNext->nFrameStartGpu != (uint64_t)-1)
  1182.       |            ~~~~~~~~~~~~~~~~~~~~~~~~~~~^~~~~~~~~~~~~~~
  1183. /var/tmp/pamac-build-brandon/yuzu-git/src/yuzu/externals/./microprofile/microprofile.h:1561:42: warning: comparison of integer expressions of different signedness: ‘int64_t’ {aka ‘long int’} and ‘uint64_t’ {aka ‘long unsigned int’} [-Wsign-compare]
  1184.  1561 |         if(pFrameCurrent->nFrameStartGpu == (uint64_t)-1)
  1185.       |            ~~~~~~~~~~~~~~~~~~~~~~~~~~~~~~^~~~~~~~~~~~~~~
  1186. [ 37%] Building C object externals/libressl/crypto/CMakeFiles/crypto.dir/des/cbc_cksm.c.o
  1187. [ 38%] Building C object externals/libressl/crypto/CMakeFiles/crypto.dir/des/cbc_enc.c.o
  1188. [ 38%] Building C object externals/libressl/crypto/CMakeFiles/crypto.dir/des/cfb64ede.c.o
  1189. [ 38%] Building CXX object src/common/CMakeFiles/common.dir/misc.cpp.o
  1190. [ 38%] Building C object externals/libressl/crypto/CMakeFiles/crypto.dir/des/cfb64enc.c.o
  1191. [ 38%] Building C object externals/libressl/crypto/CMakeFiles/crypto.dir/des/cfb_enc.c.o
  1192. [ 38%] Building CXX object src/common/CMakeFiles/common.dir/page_table.cpp.o
  1193. [ 38%] Building CXX object src/common/CMakeFiles/common.dir/param_package.cpp.o
  1194. [ 38%] Building C object externals/libressl/crypto/CMakeFiles/crypto.dir/des/des_enc.c.o
  1195. [ 38%] Building C object externals/libressl/crypto/CMakeFiles/crypto.dir/des/ecb3_enc.c.o
  1196. [ 38%] Building C object externals/libressl/crypto/CMakeFiles/crypto.dir/des/ecb_enc.c.o
  1197. [ 38%] Building CXX object src/common/CMakeFiles/common.dir/scm_rev.cpp.o
  1198. [ 38%] Building CXX object src/common/CMakeFiles/common.dir/string_util.cpp.o
  1199. [ 38%] Building C object externals/libressl/crypto/CMakeFiles/crypto.dir/des/ede_cbcm_enc.c.o
  1200. [ 38%] Building C object externals/libressl/crypto/CMakeFiles/crypto.dir/des/enc_read.c.o
  1201. [ 38%] Building C object externals/libressl/crypto/CMakeFiles/crypto.dir/des/enc_writ.c.o
  1202. [ 38%] Building C object externals/libressl/crypto/CMakeFiles/crypto.dir/des/fcrypt.c.o
  1203. [ 38%] Building C object externals/libressl/crypto/CMakeFiles/crypto.dir/des/fcrypt_b.c.o
  1204. [ 38%] Building C object externals/libressl/crypto/CMakeFiles/crypto.dir/des/ofb64ede.c.o
  1205. [ 38%] Building C object externals/libressl/crypto/CMakeFiles/crypto.dir/des/ofb64enc.c.o
  1206. [ 38%] Building C object externals/libressl/crypto/CMakeFiles/crypto.dir/des/ofb_enc.c.o
  1207. [ 38%] Building C object externals/libressl/crypto/CMakeFiles/crypto.dir/des/pcbc_enc.c.o
  1208. [ 39%] Building C object externals/libressl/crypto/CMakeFiles/crypto.dir/des/qud_cksm.c.o
  1209. [ 39%] Building CXX object src/common/CMakeFiles/common.dir/telemetry.cpp.o
  1210. [ 39%] Building C object externals/libressl/crypto/CMakeFiles/crypto.dir/des/rand_key.c.o
  1211. [ 39%] Building C object externals/libressl/crypto/CMakeFiles/crypto.dir/des/set_key.c.o
  1212. [ 39%] Building CXX object src/common/CMakeFiles/common.dir/thread.cpp.o
  1213. [ 39%] Building C object externals/libressl/crypto/CMakeFiles/crypto.dir/des/str2key.c.o
  1214. [ 39%] Building C object externals/libressl/crypto/CMakeFiles/crypto.dir/des/xcbc_enc.c.o
  1215. [ 39%] Building C object externals/libressl/crypto/CMakeFiles/crypto.dir/dh/dh_ameth.c.o
  1216. [ 40%] Building CXX object src/common/CMakeFiles/common.dir/timer.cpp.o
  1217. [ 40%] Building C object externals/libressl/crypto/CMakeFiles/crypto.dir/dh/dh_asn1.c.o
  1218. [ 40%] Building C object externals/libressl/crypto/CMakeFiles/crypto.dir/dh/dh_check.c.o
  1219. [ 40%] Building CXX object src/common/CMakeFiles/common.dir/uint128.cpp.o
  1220. [ 40%] Building C object externals/libressl/crypto/CMakeFiles/crypto.dir/dh/dh_depr.c.o
  1221. [ 40%] Building C object externals/libressl/crypto/CMakeFiles/crypto.dir/dh/dh_err.c.o
  1222. [ 40%] Building C object externals/libressl/crypto/CMakeFiles/crypto.dir/dh/dh_gen.c.o
  1223. [ 40%] Building C object externals/libressl/crypto/CMakeFiles/crypto.dir/dh/dh_key.c.o
  1224. [ 40%] Building C object externals/libressl/crypto/CMakeFiles/crypto.dir/dh/dh_lib.c.o
  1225. [ 40%] Building CXX object src/common/CMakeFiles/common.dir/uuid.cpp.o
  1226. [ 40%] Building C object externals/libressl/crypto/CMakeFiles/crypto.dir/dh/dh_pmeth.c.o
  1227. [ 40%] Building C object externals/libressl/crypto/CMakeFiles/crypto.dir/dh/dh_prn.c.o
  1228. [ 40%] Building C object externals/libressl/crypto/CMakeFiles/crypto.dir/dsa/dsa_ameth.c.o
  1229. [ 41%] Building C object externals/libressl/crypto/CMakeFiles/crypto.dir/dsa/dsa_asn1.c.o
  1230. [ 41%] Building C object externals/libressl/crypto/CMakeFiles/crypto.dir/dsa/dsa_depr.c.o
  1231. [ 41%] Building C object externals/libressl/crypto/CMakeFiles/crypto.dir/dsa/dsa_err.c.o
  1232. [ 41%] Building C object externals/libressl/crypto/CMakeFiles/crypto.dir/dsa/dsa_gen.c.o
  1233. [ 41%] Building C object externals/libressl/crypto/CMakeFiles/crypto.dir/dsa/dsa_key.c.o
  1234. [ 41%] Building C object externals/libressl/crypto/CMakeFiles/crypto.dir/dsa/dsa_lib.c.o
  1235. [ 41%] Building CXX object src/common/CMakeFiles/common.dir/zstd_compression.cpp.o
  1236. [ 41%] Building C object externals/libressl/crypto/CMakeFiles/crypto.dir/dsa/dsa_meth.c.o
  1237. [ 41%] Building C object externals/libressl/crypto/CMakeFiles/crypto.dir/dsa/dsa_ossl.c.o
  1238. [ 41%] Building C object externals/libressl/crypto/CMakeFiles/crypto.dir/dsa/dsa_pmeth.c.o
  1239. [ 41%] Building C object externals/libressl/crypto/CMakeFiles/crypto.dir/dsa/dsa_prn.c.o
  1240. [ 41%] Building C object externals/libressl/crypto/CMakeFiles/crypto.dir/dsa/dsa_sign.c.o
  1241. [ 41%] Building C object externals/libressl/crypto/CMakeFiles/crypto.dir/dsa/dsa_vrf.c.o
  1242. [ 41%] Building C object externals/libressl/crypto/CMakeFiles/crypto.dir/dso/dso_dlfcn.c.o
  1243. [ 41%] Building C object externals/libressl/crypto/CMakeFiles/crypto.dir/dso/dso_err.c.o
  1244. [ 41%] Building C object externals/libressl/crypto/CMakeFiles/crypto.dir/dso/dso_lib.c.o
  1245. [ 41%] Building C object externals/libressl/crypto/CMakeFiles/crypto.dir/dso/dso_null.c.o
  1246. [ 42%] Building C object externals/libressl/crypto/CMakeFiles/crypto.dir/dso/dso_openssl.c.o
  1247. [ 42%] Building CXX object src/common/CMakeFiles/common.dir/x64/cpu_detect.cpp.o
  1248. [ 42%] Building C object externals/libressl/crypto/CMakeFiles/crypto.dir/ec/ec2_mult.c.o
  1249. [ 42%] Building C object externals/libressl/crypto/CMakeFiles/crypto.dir/ec/ec2_oct.c.o
  1250. [ 42%] Building C object externals/libressl/crypto/CMakeFiles/crypto.dir/ec/ec2_smpl.c.o
  1251. [ 42%] Building C object externals/libressl/crypto/CMakeFiles/crypto.dir/ec/ec_ameth.c.o
  1252. [ 42%] Building C object externals/libressl/crypto/CMakeFiles/crypto.dir/ec/ec_asn1.c.o
  1253. [ 42%] Building C object externals/libressl/crypto/CMakeFiles/crypto.dir/ec/ec_check.c.o
  1254. [ 42%] Building C object externals/libressl/crypto/CMakeFiles/crypto.dir/ec/ec_curve.c.o
  1255. [ 42%] Building C object externals/libressl/crypto/CMakeFiles/crypto.dir/ec/ec_cvt.c.o
  1256. [ 42%] Building C object externals/libressl/crypto/CMakeFiles/crypto.dir/ec/ec_err.c.o
  1257. [ 42%] Building C object externals/libressl/crypto/CMakeFiles/crypto.dir/ec/ec_key.c.o
  1258. [ 42%] Building C object externals/libressl/crypto/CMakeFiles/crypto.dir/ec/ec_lib.c.o
  1259. [ 42%] Building C object externals/libressl/crypto/CMakeFiles/crypto.dir/ec/ec_mult.c.o
  1260. [ 42%] Building C object externals/libressl/crypto/CMakeFiles/crypto.dir/ec/ec_oct.c.o
  1261. [ 42%] Building C object externals/libressl/crypto/CMakeFiles/crypto.dir/ec/ec_pmeth.c.o
  1262. [ 43%] Building C object externals/libressl/crypto/CMakeFiles/crypto.dir/ec/ec_print.c.o
  1263. [ 43%] Building C object externals/libressl/crypto/CMakeFiles/crypto.dir/ec/eck_prn.c.o
  1264. [ 43%] Building C object externals/libressl/crypto/CMakeFiles/crypto.dir/ec/ecp_mont.c.o
  1265. [ 43%] Building C object externals/libressl/crypto/CMakeFiles/crypto.dir/ec/ecp_nist.c.o
  1266. [ 43%] Building C object externals/libressl/crypto/CMakeFiles/crypto.dir/ec/ecp_oct.c.o
  1267. [ 43%] Building C object externals/libressl/crypto/CMakeFiles/crypto.dir/ecdh/ech_err.c.o
  1268. [ 43%] Building C object externals/libressl/crypto/CMakeFiles/crypto.dir/ec/ecp_smpl.c.o
  1269. [ 43%] Building C object externals/libressl/crypto/CMakeFiles/crypto.dir/ecdh/ech_key.c.o
  1270. [ 43%] Building C object externals/libressl/crypto/CMakeFiles/crypto.dir/ecdh/ech_lib.c.o
  1271. [ 43%] Building C object externals/libressl/crypto/CMakeFiles/crypto.dir/ecdsa/ecs_asn1.c.o
  1272. [ 43%] Building C object externals/libressl/crypto/CMakeFiles/crypto.dir/ecdsa/ecs_err.c.o
  1273. [ 43%] Building C object externals/libressl/crypto/CMakeFiles/crypto.dir/ecdsa/ecs_lib.c.o
  1274. [ 43%] Building C object externals/libressl/crypto/CMakeFiles/crypto.dir/ecdsa/ecs_ossl.c.o
  1275. [ 43%] Building C object externals/libressl/crypto/CMakeFiles/crypto.dir/ecdsa/ecs_sign.c.o
  1276. [ 43%] Building C object externals/libressl/crypto/CMakeFiles/crypto.dir/ecdsa/ecs_vrf.c.o
  1277. [ 43%] Building C object externals/libressl/crypto/CMakeFiles/crypto.dir/engine/eng_all.c.o
  1278. [ 44%] Building C object externals/libressl/crypto/CMakeFiles/crypto.dir/engine/eng_cnf.c.o
  1279. [ 44%] Building C object externals/libressl/crypto/CMakeFiles/crypto.dir/engine/eng_ctrl.c.o
  1280. [ 44%] Building C object externals/libressl/crypto/CMakeFiles/crypto.dir/engine/eng_dyn.c.o
  1281. [ 44%] Building C object externals/libressl/crypto/CMakeFiles/crypto.dir/engine/eng_err.c.o
  1282. [ 44%] Building C object externals/libressl/crypto/CMakeFiles/crypto.dir/engine/eng_fat.c.o
  1283. [ 44%] Building C object externals/libressl/crypto/CMakeFiles/crypto.dir/engine/eng_init.c.o
  1284. [ 44%] Building C object externals/libressl/crypto/CMakeFiles/crypto.dir/engine/eng_lib.c.o
  1285. [ 44%] Building C object externals/libressl/crypto/CMakeFiles/crypto.dir/engine/eng_list.c.o
  1286. [ 44%] Building C object externals/libressl/crypto/CMakeFiles/crypto.dir/engine/eng_openssl.c.o
  1287. [ 44%] Building C object externals/libressl/crypto/CMakeFiles/crypto.dir/engine/eng_pkey.c.o
  1288. [ 44%] Building C object externals/libressl/crypto/CMakeFiles/crypto.dir/engine/eng_table.c.o
  1289. [ 44%] Linking CXX static library libcommon.a
  1290. [ 44%] Building C object externals/libressl/crypto/CMakeFiles/crypto.dir/engine/tb_asnmth.c.o
  1291. [ 44%] Building C object externals/libressl/crypto/CMakeFiles/crypto.dir/engine/tb_cipher.c.o
  1292. [ 44%] Building C object externals/libressl/crypto/CMakeFiles/crypto.dir/engine/tb_dh.c.o
  1293. [ 44%] Built target common
  1294. [ 44%] Building C object externals/libressl/crypto/CMakeFiles/crypto.dir/engine/tb_digest.c.o
  1295. [ 44%] Building C object externals/libressl/crypto/CMakeFiles/crypto.dir/engine/tb_dsa.c.o
  1296. [ 45%] Building C object externals/libressl/crypto/CMakeFiles/crypto.dir/engine/tb_ecdh.c.o
  1297. [ 45%] Building C object externals/libressl/crypto/CMakeFiles/crypto.dir/engine/tb_ecdsa.c.o
  1298. [ 45%] Building C object externals/libressl/crypto/CMakeFiles/crypto.dir/engine/tb_pkmeth.c.o
  1299. [ 45%] Building C object externals/libressl/crypto/CMakeFiles/crypto.dir/engine/tb_rand.c.o
  1300. [ 45%] Building C object externals/libressl/crypto/CMakeFiles/crypto.dir/engine/tb_rsa.c.o
  1301. [ 45%] Building C object externals/libressl/crypto/CMakeFiles/crypto.dir/engine/tb_store.c.o
  1302. [ 45%] Building C object externals/libressl/crypto/CMakeFiles/crypto.dir/err/err.c.o
  1303. [ 45%] Building C object externals/libressl/crypto/CMakeFiles/crypto.dir/err/err_all.c.o
  1304. [ 45%] Building C object externals/libressl/crypto/CMakeFiles/crypto.dir/err/err_prn.c.o
  1305. [ 45%] Building C object externals/libressl/crypto/CMakeFiles/crypto.dir/evp/bio_b64.c.o
  1306. [ 45%] Building C object externals/libressl/crypto/CMakeFiles/crypto.dir/evp/bio_enc.c.o
  1307. [ 45%] Building C object externals/libressl/crypto/CMakeFiles/crypto.dir/evp/bio_md.c.o
  1308. [ 45%] Building C object externals/libressl/crypto/CMakeFiles/crypto.dir/evp/c_all.c.o
  1309. [ 45%] Building C object externals/libressl/crypto/CMakeFiles/crypto.dir/evp/digest.c.o
  1310. [ 45%] Building C object externals/libressl/crypto/CMakeFiles/crypto.dir/evp/e_aes.c.o
  1311. [ 45%] Building C object externals/libressl/crypto/CMakeFiles/crypto.dir/evp/e_aes_cbc_hmac_sha1.c.o
  1312. [ 46%] Building C object externals/libressl/crypto/CMakeFiles/crypto.dir/evp/e_bf.c.o
  1313. [ 46%] Building C object externals/libressl/crypto/CMakeFiles/crypto.dir/evp/e_camellia.c.o
  1314. [ 46%] Building C object externals/libressl/crypto/CMakeFiles/crypto.dir/evp/e_cast.c.o
  1315. [ 46%] Building C object externals/libressl/crypto/CMakeFiles/crypto.dir/evp/e_chacha.c.o
  1316. [ 46%] Building C object externals/libressl/crypto/CMakeFiles/crypto.dir/evp/e_chacha20poly1305.c.o
  1317. [ 46%] Building C object externals/libressl/crypto/CMakeFiles/crypto.dir/evp/e_des.c.o
  1318. [ 46%] Building C object externals/libressl/crypto/CMakeFiles/crypto.dir/evp/e_des3.c.o
  1319. [ 46%] Building C object externals/libressl/crypto/CMakeFiles/crypto.dir/evp/e_gost2814789.c.o
  1320. [ 46%] Building C object externals/libressl/crypto/CMakeFiles/crypto.dir/evp/e_idea.c.o
  1321. [ 46%] Building C object externals/libressl/crypto/CMakeFiles/crypto.dir/evp/e_null.c.o
  1322. [ 46%] Building C object externals/libressl/crypto/CMakeFiles/crypto.dir/evp/e_old.c.o
  1323. [ 46%] Building C object externals/libressl/crypto/CMakeFiles/crypto.dir/evp/e_rc2.c.o
  1324. [ 46%] Building C object externals/libressl/crypto/CMakeFiles/crypto.dir/evp/e_rc4.c.o
  1325. [ 46%] Building C object externals/libressl/crypto/CMakeFiles/crypto.dir/evp/e_rc4_hmac_md5.c.o
  1326. [ 46%] Building C object externals/libressl/crypto/CMakeFiles/crypto.dir/evp/e_xcbc_d.c.o
  1327. [ 46%] Building C object externals/libressl/crypto/CMakeFiles/crypto.dir/evp/encode.c.o
  1328. [ 47%] Building C object externals/libressl/crypto/CMakeFiles/crypto.dir/evp/evp_aead.c.o
  1329. [ 47%] Building C object externals/libressl/crypto/CMakeFiles/crypto.dir/evp/evp_enc.c.o
  1330. [ 47%] Building C object externals/libressl/crypto/CMakeFiles/crypto.dir/evp/evp_err.c.o
  1331. [ 47%] Building C object externals/libressl/crypto/CMakeFiles/crypto.dir/evp/evp_key.c.o
  1332. [ 47%] Building C object externals/libressl/crypto/CMakeFiles/crypto.dir/evp/evp_lib.c.o
  1333. [ 47%] Building C object externals/libressl/crypto/CMakeFiles/crypto.dir/evp/evp_pbe.c.o
  1334. [ 47%] Building C object externals/libressl/crypto/CMakeFiles/crypto.dir/evp/evp_pkey.c.o
  1335. [ 47%] Building C object externals/libressl/crypto/CMakeFiles/crypto.dir/evp/m_dss.c.o
  1336. [ 47%] Building C object externals/libressl/crypto/CMakeFiles/crypto.dir/evp/m_dss1.c.o
  1337. [ 47%] Building C object externals/libressl/crypto/CMakeFiles/crypto.dir/evp/m_ecdsa.c.o
  1338. [ 47%] Building C object externals/libressl/crypto/CMakeFiles/crypto.dir/evp/m_gost2814789.c.o
  1339. [ 47%] Building C object externals/libressl/crypto/CMakeFiles/crypto.dir/evp/m_gostr341194.c.o
  1340. [ 47%] Building C object externals/libressl/crypto/CMakeFiles/crypto.dir/evp/m_md4.c.o
  1341. [ 47%] Building C object externals/libressl/crypto/CMakeFiles/crypto.dir/evp/m_md5.c.o
  1342. [ 47%] Building C object externals/libressl/crypto/CMakeFiles/crypto.dir/evp/m_md5_sha1.c.o
  1343. [ 47%] Building C object externals/libressl/crypto/CMakeFiles/crypto.dir/evp/m_null.c.o
  1344. [ 48%] Building C object externals/libressl/crypto/CMakeFiles/crypto.dir/evp/m_ripemd.c.o
  1345. [ 48%] Building C object externals/libressl/crypto/CMakeFiles/crypto.dir/evp/m_sha1.c.o
  1346. [ 48%] Building C object externals/libressl/crypto/CMakeFiles/crypto.dir/evp/m_sigver.c.o
  1347. [ 48%] Building C object externals/libressl/crypto/CMakeFiles/crypto.dir/evp/m_streebog.c.o
  1348. [ 48%] Building C object externals/libressl/crypto/CMakeFiles/crypto.dir/evp/m_wp.c.o
  1349. [ 48%] Building C object externals/libressl/crypto/CMakeFiles/crypto.dir/evp/names.c.o
  1350. [ 48%] Building C object externals/libressl/crypto/CMakeFiles/crypto.dir/evp/p5_crpt.c.o
  1351. [ 48%] Building C object externals/libressl/crypto/CMakeFiles/crypto.dir/evp/p5_crpt2.c.o
  1352. [ 48%] Building C object externals/libressl/crypto/CMakeFiles/crypto.dir/evp/p_dec.c.o
  1353. [ 48%] Building C object externals/libressl/crypto/CMakeFiles/crypto.dir/evp/p_enc.c.o
  1354. [ 48%] Building C object externals/libressl/crypto/CMakeFiles/crypto.dir/evp/p_lib.c.o
  1355. [ 48%] Building C object externals/libressl/crypto/CMakeFiles/crypto.dir/evp/p_open.c.o
  1356. [ 48%] Building C object externals/libressl/crypto/CMakeFiles/crypto.dir/evp/p_seal.c.o
  1357. [ 48%] Building C object externals/libressl/crypto/CMakeFiles/crypto.dir/evp/p_sign.c.o
  1358. [ 48%] Building C object externals/libressl/crypto/CMakeFiles/crypto.dir/evp/p_verify.c.o
  1359. [ 50%] Building C object externals/libressl/crypto/CMakeFiles/crypto.dir/evp/pmeth_fn.c.o
  1360. [ 50%] Building C object externals/libressl/crypto/CMakeFiles/crypto.dir/evp/pmeth_lib.c.o
  1361. [ 50%] Building C object externals/libressl/crypto/CMakeFiles/crypto.dir/evp/pmeth_gn.c.o
  1362. [ 50%] Building C object externals/libressl/crypto/CMakeFiles/crypto.dir/gost/gost2814789.c.o
  1363. [ 50%] Building C object externals/libressl/crypto/CMakeFiles/crypto.dir/gost/gost89_params.c.o
  1364. [ 50%] Building C object externals/libressl/crypto/CMakeFiles/crypto.dir/gost/gost89_keywrap.c.o
  1365. [ 50%] Building C object externals/libressl/crypto/CMakeFiles/crypto.dir/gost/gost89imit_ameth.c.o
  1366. [ 50%] Building C object externals/libressl/crypto/CMakeFiles/crypto.dir/gost/gost89imit_pmeth.c.o
  1367. [ 50%] Building C object externals/libressl/crypto/CMakeFiles/crypto.dir/gost/gost_asn1.c.o
  1368. [ 50%] Building C object externals/libressl/crypto/CMakeFiles/crypto.dir/gost/gost_err.c.o
  1369. [ 50%] Building C object externals/libressl/crypto/CMakeFiles/crypto.dir/gost/gostr341001_ameth.c.o
  1370. [ 50%] Building C object externals/libressl/crypto/CMakeFiles/crypto.dir/gost/gostr341001_key.c.o
  1371. [ 50%] Building C object externals/libressl/crypto/CMakeFiles/crypto.dir/gost/gostr341001.c.o
  1372. [ 50%] Building C object externals/libressl/crypto/CMakeFiles/crypto.dir/gost/gostr341001_params.c.o
  1373. [ 50%] Building C object externals/libressl/crypto/CMakeFiles/crypto.dir/gost/gostr341001_pmeth.c.o
  1374. [ 51%] Building C object externals/libressl/crypto/CMakeFiles/crypto.dir/gost/streebog.c.o
  1375. [ 51%] Building C object externals/libressl/crypto/CMakeFiles/crypto.dir/gost/gostr341194.c.o
  1376. [ 51%] Building C object externals/libressl/crypto/CMakeFiles/crypto.dir/hkdf/hkdf.c.o
  1377. [ 51%] Building C object externals/libressl/crypto/CMakeFiles/crypto.dir/hmac/hm_ameth.c.o
  1378. [ 51%] Building C object externals/libressl/crypto/CMakeFiles/crypto.dir/hmac/hmac.c.o
  1379. [ 51%] Building C object externals/libressl/crypto/CMakeFiles/crypto.dir/hmac/hm_pmeth.c.o
  1380. [ 51%] Building C object externals/libressl/crypto/CMakeFiles/crypto.dir/idea/i_cbc.c.o
  1381. [ 51%] Building C object externals/libressl/crypto/CMakeFiles/crypto.dir/idea/i_cfb64.c.o
  1382. [ 51%] Building C object externals/libressl/crypto/CMakeFiles/crypto.dir/idea/i_ecb.c.o
  1383. [ 51%] Building C object externals/libressl/crypto/CMakeFiles/crypto.dir/idea/i_ofb64.c.o
  1384. [ 51%] Building C object externals/libressl/crypto/CMakeFiles/crypto.dir/idea/i_skey.c.o
  1385. [ 51%] Building C object externals/libressl/crypto/CMakeFiles/crypto.dir/lhash/lh_stats.c.o
  1386. [ 51%] Building C object externals/libressl/crypto/CMakeFiles/crypto.dir/lhash/lhash.c.o
  1387. [ 51%] Building C object externals/libressl/crypto/CMakeFiles/crypto.dir/md4/md4_dgst.c.o
  1388. [ 51%] Building C object externals/libressl/crypto/CMakeFiles/crypto.dir/md4/md4_one.c.o
  1389. [ 51%] Building C object externals/libressl/crypto/CMakeFiles/crypto.dir/md5/md5_dgst.c.o
  1390. [ 51%] Building C object externals/libressl/crypto/CMakeFiles/crypto.dir/md5/md5_one.c.o
  1391. [ 52%] Building C object externals/libressl/crypto/CMakeFiles/crypto.dir/modes/cbc128.c.o
  1392. [ 52%] Building C object externals/libressl/crypto/CMakeFiles/crypto.dir/modes/ccm128.c.o
  1393. [ 52%] Building C object externals/libressl/crypto/CMakeFiles/crypto.dir/modes/cfb128.c.o
  1394. [ 52%] Building C object externals/libressl/crypto/CMakeFiles/crypto.dir/modes/ctr128.c.o
  1395. [ 52%] Building C object externals/libressl/crypto/CMakeFiles/crypto.dir/modes/cts128.c.o
  1396. [ 52%] Building C object externals/libressl/crypto/CMakeFiles/crypto.dir/modes/gcm128.c.o
  1397. [ 52%] Building C object externals/libressl/crypto/CMakeFiles/crypto.dir/modes/ofb128.c.o
  1398. [ 52%] Building C object externals/libressl/crypto/CMakeFiles/crypto.dir/modes/xts128.c.o
  1399. [ 52%] Building C object externals/libressl/crypto/CMakeFiles/crypto.dir/objects/o_names.c.o
  1400. [ 52%] Building C object externals/libressl/crypto/CMakeFiles/crypto.dir/objects/obj_dat.c.o
  1401. [ 52%] Building C object externals/libressl/crypto/CMakeFiles/crypto.dir/objects/obj_err.c.o
  1402. [ 52%] Building C object externals/libressl/crypto/CMakeFiles/crypto.dir/objects/obj_lib.c.o
  1403. [ 52%] Building C object externals/libressl/crypto/CMakeFiles/crypto.dir/objects/obj_xref.c.o
  1404. [ 52%] Building C object externals/libressl/crypto/CMakeFiles/crypto.dir/ocsp/ocsp_asn.c.o
  1405. [ 52%] Building C object externals/libressl/crypto/CMakeFiles/crypto.dir/ocsp/ocsp_cl.c.o
  1406. [ 52%] Building C object externals/libressl/crypto/CMakeFiles/crypto.dir/ocsp/ocsp_err.c.o
  1407. [ 53%] Building C object externals/libressl/crypto/CMakeFiles/crypto.dir/ocsp/ocsp_ext.c.o
  1408. [ 53%] Building C object externals/libressl/crypto/CMakeFiles/crypto.dir/ocsp/ocsp_ht.c.o
  1409. [ 53%] Building C object externals/libressl/crypto/CMakeFiles/crypto.dir/ocsp/ocsp_lib.c.o
  1410. [ 53%] Building C object externals/libressl/crypto/CMakeFiles/crypto.dir/ocsp/ocsp_prn.c.o
  1411. [ 53%] Building C object externals/libressl/crypto/CMakeFiles/crypto.dir/ocsp/ocsp_srv.c.o
  1412. [ 53%] Building C object externals/libressl/crypto/CMakeFiles/crypto.dir/ocsp/ocsp_vfy.c.o
  1413. [ 53%] Building C object externals/libressl/crypto/CMakeFiles/crypto.dir/pem/pem_all.c.o
  1414. [ 53%] Building C object externals/libressl/crypto/CMakeFiles/crypto.dir/pem/pem_err.c.o
  1415. [ 53%] Building C object externals/libressl/crypto/CMakeFiles/crypto.dir/pem/pem_info.c.o
  1416. [ 53%] Building C object externals/libressl/crypto/CMakeFiles/crypto.dir/pem/pem_lib.c.o
  1417. [ 53%] Building C object externals/libressl/crypto/CMakeFiles/crypto.dir/pem/pem_oth.c.o
  1418. [ 53%] Building C object externals/libressl/crypto/CMakeFiles/crypto.dir/pem/pem_pk8.c.o
  1419. [ 53%] Building C object externals/libressl/crypto/CMakeFiles/crypto.dir/pem/pem_pkey.c.o
  1420. [ 53%] Building C object externals/libressl/crypto/CMakeFiles/crypto.dir/pem/pem_seal.c.o
  1421. [ 53%] Building C object externals/libressl/crypto/CMakeFiles/crypto.dir/pem/pem_sign.c.o
  1422. [ 53%] Building C object externals/libressl/crypto/CMakeFiles/crypto.dir/pem/pem_x509.c.o
  1423. [ 54%] Building C object externals/libressl/crypto/CMakeFiles/crypto.dir/pem/pem_xaux.c.o
  1424. [ 54%] Building C object externals/libressl/crypto/CMakeFiles/crypto.dir/pem/pvkfmt.c.o
  1425. [ 54%] Building C object externals/libressl/crypto/CMakeFiles/crypto.dir/pkcs12/p12_add.c.o
  1426. [ 54%] Building C object externals/libressl/crypto/CMakeFiles/crypto.dir/pkcs12/p12_asn.c.o
  1427. [ 54%] Building C object externals/libressl/crypto/CMakeFiles/crypto.dir/pkcs12/p12_attr.c.o
  1428. [ 54%] Building C object externals/libressl/crypto/CMakeFiles/crypto.dir/pkcs12/p12_crpt.c.o
  1429. [ 54%] Building C object externals/libressl/crypto/CMakeFiles/crypto.dir/pkcs12/p12_crt.c.o
  1430. [ 54%] Building C object externals/libressl/crypto/CMakeFiles/crypto.dir/pkcs12/p12_decr.c.o
  1431. [ 54%] Building C object externals/libressl/crypto/CMakeFiles/crypto.dir/pkcs12/p12_init.c.o
  1432. [ 54%] Building C object externals/libressl/crypto/CMakeFiles/crypto.dir/pkcs12/p12_key.c.o
  1433. [ 54%] Building C object externals/libressl/crypto/CMakeFiles/crypto.dir/pkcs12/p12_kiss.c.o
  1434. [ 54%] Building C object externals/libressl/crypto/CMakeFiles/crypto.dir/pkcs12/p12_mutl.c.o
  1435. [ 54%] Building C object externals/libressl/crypto/CMakeFiles/crypto.dir/pkcs12/p12_npas.c.o
  1436. [ 54%] Building C object externals/libressl/crypto/CMakeFiles/crypto.dir/pkcs12/p12_p8d.c.o
  1437. [ 54%] Building C object externals/libressl/crypto/CMakeFiles/crypto.dir/pkcs12/p12_p8e.c.o
  1438. [ 54%] Building C object externals/libressl/crypto/CMakeFiles/crypto.dir/pkcs12/p12_utl.c.o
  1439. [ 55%] Building C object externals/libressl/crypto/CMakeFiles/crypto.dir/pkcs12/pk12err.c.o
  1440. [ 55%] Building C object externals/libressl/crypto/CMakeFiles/crypto.dir/pkcs7/bio_pk7.c.o
  1441. [ 55%] Building C object externals/libressl/crypto/CMakeFiles/crypto.dir/pkcs7/pk7_asn1.c.o
  1442. [ 55%] Building C object externals/libressl/crypto/CMakeFiles/crypto.dir/pkcs7/pk7_attr.c.o
  1443. [ 55%] Building C object externals/libressl/crypto/CMakeFiles/crypto.dir/pkcs7/pk7_doit.c.o
  1444. [ 55%] Building C object externals/libressl/crypto/CMakeFiles/crypto.dir/pkcs7/pk7_lib.c.o
  1445. [ 55%] Building C object externals/libressl/crypto/CMakeFiles/crypto.dir/pkcs7/pk7_mime.c.o
  1446. [ 55%] Building C object externals/libressl/crypto/CMakeFiles/crypto.dir/pkcs7/pk7_smime.c.o
  1447. [ 55%] Building C object externals/libressl/crypto/CMakeFiles/crypto.dir/pkcs7/pkcs7err.c.o
  1448. [ 55%] Building C object externals/libressl/crypto/CMakeFiles/crypto.dir/poly1305/poly1305.c.o
  1449. [ 55%] Building C object externals/libressl/crypto/CMakeFiles/crypto.dir/rand/rand_err.c.o
  1450. [ 55%] Building C object externals/libressl/crypto/CMakeFiles/crypto.dir/rand/rand_lib.c.o
  1451. [ 55%] Building C object externals/libressl/crypto/CMakeFiles/crypto.dir/rand/randfile.c.o
  1452. [ 55%] Building C object externals/libressl/crypto/CMakeFiles/crypto.dir/rc2/rc2_cbc.c.o
  1453. [ 55%] Building C object externals/libressl/crypto/CMakeFiles/crypto.dir/rc2/rc2_ecb.c.o
  1454. [ 55%] Building C object externals/libressl/crypto/CMakeFiles/crypto.dir/rc2/rc2_skey.c.o
  1455. [ 56%] Building C object externals/libressl/crypto/CMakeFiles/crypto.dir/rc2/rc2cfb64.c.o
  1456. [ 56%] Building C object externals/libressl/crypto/CMakeFiles/crypto.dir/rc2/rc2ofb64.c.o
  1457. [ 56%] Building C object externals/libressl/crypto/CMakeFiles/crypto.dir/ripemd/rmd_dgst.c.o
  1458. [ 56%] Building C object externals/libressl/crypto/CMakeFiles/crypto.dir/ripemd/rmd_one.c.o
  1459. [ 56%] Building C object externals/libressl/crypto/CMakeFiles/crypto.dir/rsa/rsa_ameth.c.o
  1460. [ 56%] Building C object externals/libressl/crypto/CMakeFiles/crypto.dir/rsa/rsa_asn1.c.o
  1461. [ 56%] Building C object externals/libressl/crypto/CMakeFiles/crypto.dir/rsa/rsa_chk.c.o
  1462. [ 56%] Building C object externals/libressl/crypto/CMakeFiles/crypto.dir/rsa/rsa_crpt.c.o
  1463. [ 56%] Building C object externals/libressl/crypto/CMakeFiles/crypto.dir/rsa/rsa_depr.c.o
  1464. [ 56%] Building C object externals/libressl/crypto/CMakeFiles/crypto.dir/rsa/rsa_eay.c.o
  1465. [ 56%] Building C object externals/libressl/crypto/CMakeFiles/crypto.dir/rsa/rsa_err.c.o
  1466. [ 56%] Building C object externals/libressl/crypto/CMakeFiles/crypto.dir/rsa/rsa_gen.c.o
  1467. [ 56%] Building C object externals/libressl/crypto/CMakeFiles/crypto.dir/rsa/rsa_lib.c.o
  1468. [ 56%] Building C object externals/libressl/crypto/CMakeFiles/crypto.dir/rsa/rsa_meth.c.o
  1469. [ 56%] Building C object externals/libressl/crypto/CMakeFiles/crypto.dir/rsa/rsa_none.c.o
  1470. [ 57%] Building C object externals/libressl/crypto/CMakeFiles/crypto.dir/rsa/rsa_oaep.c.o
  1471. [ 57%] Building C object externals/libressl/crypto/CMakeFiles/crypto.dir/rsa/rsa_pk1.c.o
  1472. [ 57%] Building C object externals/libressl/crypto/CMakeFiles/crypto.dir/rsa/rsa_pmeth.c.o
  1473. [ 57%] Building C object externals/libressl/crypto/CMakeFiles/crypto.dir/rsa/rsa_prn.c.o
  1474. [ 57%] Building C object externals/libressl/crypto/CMakeFiles/crypto.dir/rsa/rsa_pss.c.o
  1475. [ 57%] Building C object externals/libressl/crypto/CMakeFiles/crypto.dir/rsa/rsa_saos.c.o
  1476. [ 57%] Building C object externals/libressl/crypto/CMakeFiles/crypto.dir/rsa/rsa_sign.c.o
  1477. [ 57%] Building C object externals/libressl/crypto/CMakeFiles/crypto.dir/rsa/rsa_x931.c.o
  1478. [ 57%] Building C object externals/libressl/crypto/CMakeFiles/crypto.dir/sha/sha1_one.c.o
  1479. [ 57%] Building C object externals/libressl/crypto/CMakeFiles/crypto.dir/sha/sha1dgst.c.o
  1480. [ 57%] Building C object externals/libressl/crypto/CMakeFiles/crypto.dir/sha/sha256.c.o
  1481. [ 57%] Building C object externals/libressl/crypto/CMakeFiles/crypto.dir/sha/sha512.c.o
  1482. [ 57%] Building C object externals/libressl/crypto/CMakeFiles/crypto.dir/stack/stack.c.o
  1483. [ 57%] Building C object externals/libressl/crypto/CMakeFiles/crypto.dir/ts/ts_asn1.c.o
  1484. [ 57%] Building C object externals/libressl/crypto/CMakeFiles/crypto.dir/ts/ts_conf.c.o
  1485. [ 57%] Building C object externals/libressl/crypto/CMakeFiles/crypto.dir/ts/ts_err.c.o
  1486. [ 58%] Building C object externals/libressl/crypto/CMakeFiles/crypto.dir/ts/ts_lib.c.o
  1487. [ 58%] Building C object externals/libressl/crypto/CMakeFiles/crypto.dir/ts/ts_req_print.c.o
  1488. [ 58%] Building C object externals/libressl/crypto/CMakeFiles/crypto.dir/ts/ts_req_utils.c.o
  1489. [ 58%] Building C object externals/libressl/crypto/CMakeFiles/crypto.dir/ts/ts_rsp_print.c.o
  1490. [ 58%] Building C object externals/libressl/crypto/CMakeFiles/crypto.dir/ts/ts_rsp_sign.c.o
  1491. [ 58%] Building C object externals/libressl/crypto/CMakeFiles/crypto.dir/ts/ts_rsp_utils.c.o
  1492. [ 58%] Building C object externals/libressl/crypto/CMakeFiles/crypto.dir/ts/ts_rsp_verify.c.o
  1493. [ 58%] Building C object externals/libressl/crypto/CMakeFiles/crypto.dir/ts/ts_verify_ctx.c.o
  1494. [ 58%] Building C object externals/libressl/crypto/CMakeFiles/crypto.dir/txt_db/txt_db.c.o
  1495. [ 58%] Building C object externals/libressl/crypto/CMakeFiles/crypto.dir/ui/ui_err.c.o
  1496. [ 58%] Building C object externals/libressl/crypto/CMakeFiles/crypto.dir/ui/ui_lib.c.o
  1497. [ 58%] Building C object externals/libressl/crypto/CMakeFiles/crypto.dir/ui/ui_util.c.o
  1498. [ 58%] Building C object externals/libressl/crypto/CMakeFiles/crypto.dir/whrlpool/wp_dgst.c.o
  1499. [ 58%] Building C object externals/libressl/crypto/CMakeFiles/crypto.dir/x509/by_dir.c.o
  1500. [ 58%] Building C object externals/libressl/crypto/CMakeFiles/crypto.dir/x509/by_file.c.o
  1501. [ 58%] Building C object externals/libressl/crypto/CMakeFiles/crypto.dir/x509/by_mem.c.o
  1502. [ 58%] Building C object externals/libressl/crypto/CMakeFiles/crypto.dir/x509/x509_cmp.c.o
  1503. [ 59%] Building C object externals/libressl/crypto/CMakeFiles/crypto.dir/x509/x509_att.c.o
  1504. [ 59%] Building C object externals/libressl/crypto/CMakeFiles/crypto.dir/x509/x509_d2.c.o
  1505. [ 59%] Building C object externals/libressl/crypto/CMakeFiles/crypto.dir/x509/x509_def.c.o
  1506. [ 59%] Building C object externals/libressl/crypto/CMakeFiles/crypto.dir/x509/x509_err.c.o
  1507. [ 59%] Building C object externals/libressl/crypto/CMakeFiles/crypto.dir/x509/x509_ext.c.o
  1508. [ 59%] Building C object externals/libressl/crypto/CMakeFiles/crypto.dir/x509/x509_lu.c.o
  1509. [ 59%] Building C object externals/libressl/crypto/CMakeFiles/crypto.dir/x509/x509_obj.c.o
  1510. [ 59%] Building C object externals/libressl/crypto/CMakeFiles/crypto.dir/x509/x509_r2x.c.o
  1511. [ 59%] Building C object externals/libressl/crypto/CMakeFiles/crypto.dir/x509/x509_req.c.o
  1512. [ 59%] Building C object externals/libressl/crypto/CMakeFiles/crypto.dir/x509/x509_set.c.o
  1513. [ 59%] Building C object externals/libressl/crypto/CMakeFiles/crypto.dir/x509/x509_trs.c.o
  1514. [ 59%] Building C object externals/libressl/crypto/CMakeFiles/crypto.dir/x509/x509_txt.c.o
  1515. [ 59%] Building C object externals/libressl/crypto/CMakeFiles/crypto.dir/x509/x509_v3.c.o
  1516. [ 59%] Building C object externals/libressl/crypto/CMakeFiles/crypto.dir/x509/x509_vfy.c.o
  1517. [ 59%] Building C object externals/libressl/crypto/CMakeFiles/crypto.dir/x509/x509_vpm.c.o
  1518. [ 60%] Building C object externals/libressl/crypto/CMakeFiles/crypto.dir/x509/x509cset.c.o
  1519. [ 60%] Building C object externals/libressl/crypto/CMakeFiles/crypto.dir/x509/x509name.c.o
  1520. [ 60%] Building C object externals/libressl/crypto/CMakeFiles/crypto.dir/x509/x509rset.c.o
  1521. [ 60%] Building C object externals/libressl/crypto/CMakeFiles/crypto.dir/x509/x509spki.c.o
  1522. [ 60%] Building C object externals/libressl/crypto/CMakeFiles/crypto.dir/x509/x509type.c.o
  1523. [ 60%] Building C object externals/libressl/crypto/CMakeFiles/crypto.dir/x509/x_all.c.o
  1524. [ 60%] Building C object externals/libressl/crypto/CMakeFiles/crypto.dir/x509v3/pcy_cache.c.o
  1525. [ 60%] Building C object externals/libressl/crypto/CMakeFiles/crypto.dir/x509v3/pcy_data.c.o
  1526. [ 60%] Building C object externals/libressl/crypto/CMakeFiles/crypto.dir/x509v3/pcy_lib.c.o
  1527. [ 60%] Building C object externals/libressl/crypto/CMakeFiles/crypto.dir/x509v3/pcy_map.c.o
  1528. [ 60%] Building C object externals/libressl/crypto/CMakeFiles/crypto.dir/x509v3/pcy_node.c.o
  1529. [ 60%] Building C object externals/libressl/crypto/CMakeFiles/crypto.dir/x509v3/pcy_tree.c.o
  1530. [ 60%] Building C object externals/libressl/crypto/CMakeFiles/crypto.dir/x509v3/v3_akey.c.o
  1531. [ 60%] Building C object externals/libressl/crypto/CMakeFiles/crypto.dir/x509v3/v3_akeya.c.o
  1532. [ 60%] Building C object externals/libressl/crypto/CMakeFiles/crypto.dir/x509v3/v3_alt.c.o
  1533. [ 60%] Building C object externals/libressl/crypto/CMakeFiles/crypto.dir/x509v3/v3_bcons.c.o
  1534. [ 61%] Building C object externals/libressl/crypto/CMakeFiles/crypto.dir/x509v3/v3_bitst.c.o
  1535. [ 61%] Building C object externals/libressl/crypto/CMakeFiles/crypto.dir/x509v3/v3_conf.c.o
  1536. [ 61%] Building C object externals/libressl/crypto/CMakeFiles/crypto.dir/x509v3/v3_cpols.c.o
  1537. [ 61%] Building C object externals/libressl/crypto/CMakeFiles/crypto.dir/x509v3/v3_crld.c.o
  1538. [ 61%] Building C object externals/libressl/crypto/CMakeFiles/crypto.dir/x509v3/v3_enum.c.o
  1539. [ 61%] Building C object externals/libressl/crypto/CMakeFiles/crypto.dir/x509v3/v3_extku.c.o
  1540. [ 61%] Building C object externals/libressl/crypto/CMakeFiles/crypto.dir/x509v3/v3_genn.c.o
  1541. [ 61%] Building C object externals/libressl/crypto/CMakeFiles/crypto.dir/x509v3/v3_ia5.c.o
  1542. [ 61%] Building C object externals/libressl/crypto/CMakeFiles/crypto.dir/x509v3/v3_info.c.o
  1543. [ 61%] Building C object externals/libressl/crypto/CMakeFiles/crypto.dir/x509v3/v3_int.c.o
  1544. [ 61%] Building C object externals/libressl/crypto/CMakeFiles/crypto.dir/x509v3/v3_lib.c.o
  1545. [ 61%] Building C object externals/libressl/crypto/CMakeFiles/crypto.dir/x509v3/v3_ncons.c.o
  1546. [ 61%] Building C object externals/libressl/crypto/CMakeFiles/crypto.dir/x509v3/v3_ocsp.c.o
  1547. [ 61%] Building C object externals/libressl/crypto/CMakeFiles/crypto.dir/x509v3/v3_pci.c.o
  1548. [ 61%] Building C object externals/libressl/crypto/CMakeFiles/crypto.dir/x509v3/v3_pcia.c.o
  1549. [ 61%] Building C object externals/libressl/crypto/CMakeFiles/crypto.dir/x509v3/v3_pcons.c.o
  1550. [ 62%] Building C object externals/libressl/crypto/CMakeFiles/crypto.dir/x509v3/v3_pku.c.o
  1551. [ 62%] Building C object externals/libressl/crypto/CMakeFiles/crypto.dir/x509v3/v3_pmaps.c.o
  1552. [ 62%] Building C object externals/libressl/crypto/CMakeFiles/crypto.dir/x509v3/v3_prn.c.o
  1553. [ 62%] Building C object externals/libressl/crypto/CMakeFiles/crypto.dir/x509v3/v3_skey.c.o
  1554. [ 62%] Building C object externals/libressl/crypto/CMakeFiles/crypto.dir/x509v3/v3_purp.c.o
  1555. [ 62%] Building C object externals/libressl/crypto/CMakeFiles/crypto.dir/x509v3/v3_sxnet.c.o
  1556. [ 62%] Building C object externals/libressl/crypto/CMakeFiles/crypto.dir/x509v3/v3_utl.c.o
  1557. [ 62%] Building C object externals/libressl/crypto/CMakeFiles/crypto.dir/x509v3/v3err.c.o
  1558. [ 62%] Building C object externals/libressl/crypto/CMakeFiles/crypto.dir/bio/b_posix.c.o
  1559. [ 62%] Building C object externals/libressl/crypto/CMakeFiles/crypto.dir/ui/ui_openssl.c.o
  1560. [ 62%] Building C object externals/libressl/crypto/CMakeFiles/crypto.dir/bio/bss_log.c.o
  1561. [ 62%] Building C object externals/libressl/crypto/CMakeFiles/crypto.dir/compat/freezero.c.o
  1562. [ 62%] Building C object externals/libressl/crypto/CMakeFiles/crypto.dir/compat/strlcat.c.o
  1563. [ 62%] Building C object externals/libressl/crypto/CMakeFiles/crypto.dir/compat/recallocarray.c.o
  1564. [ 62%] Building C object externals/libressl/crypto/CMakeFiles/crypto.dir/compat/strlcpy.c.o
  1565. [ 62%] Building C object externals/libressl/crypto/CMakeFiles/crypto.dir/compat/arc4random.c.o
  1566. [ 62%] Building C object externals/libressl/crypto/CMakeFiles/crypto.dir/compat/timingsafe_bcmp.c.o
  1567. [ 63%] Building C object externals/libressl/crypto/CMakeFiles/crypto.dir/compat/arc4random_uniform.c.o
  1568. [ 63%] Building C object externals/libressl/crypto/CMakeFiles/crypto.dir/compat/timingsafe_memcmp.c.o
  1569. [ 63%] Linking C static library libcrypto.a
  1570. [ 63%] Built target crypto
  1571. make: *** [Makefile:141: all] Error 2
  1572. ==> ERROR: A failure occurred in build().
  1573.     Aborting...
RAW Paste Data
We use cookies for various purposes including analytics. By continuing to use Pastebin, you agree to our use of cookies as described in the Cookies Policy. OK, I Understand
 
Top