Guest User

error in svn 1.6.17 whole log

a guest
Jun 7th, 2011
266
Never
Not a member of Pastebin yet? Sign Up, it unlocks many cool features!
  1. 1>------ Build started: Project: __CONFIG__, Configuration: Release x64 ------
  2. 1>Creating svn_private_config.h from svn_private_config.hw.
  3. 1>Build log was saved at "file://c:\build\subversion-1.6.17-x64\build\win32\BuildLog.htm"
  4. 1>__CONFIG__ - 0 error(s), 0 warning(s)
  5. 2>------ Build started: Project: zlib, Configuration: Release x64 ------
  6. 3>------ Build started: Project: libsvn_subr, Configuration: Release x64 ------
  7. 2>Performing Makefile project actions
  8. 3>Compiling...
  9. 2>nmake /f win32\Makefile.msc CFLAGS="/nologo /W3 /FD /GX /DWIN32 /D_WINDOWS /MD /O2 /Zi $(LOC)" STATICLIB=zlibstat.lib zlibstat.lib
  10. 3>atomic.c
  11. 2> lib -nologo -out:zlibstat.lib adler32.obj compress.obj crc32.obj deflate.obj gzclose.obj gzlib.obj gzread.obj gzwrite.obj infback.obj inflate.obj inftrees.obj trees.obj uncompr.obj zutil.obj
  12. 2>Build log was saved at "file://C:\build\httpd-2.2.19-sni6-x64\srclib\zlib\Release\BuildLog.htm"
  13. 2>zlib - 0 error(s), 0 warning(s)
  14. 4>------ Build started: Project: libsvn_delta, Configuration: Release x64 ------
  15. 4>Compiling...
  16. 3>xml.c
  17. 4>cancel.c
  18. 3>..\..\..\subversion\libsvn_subr\xml.c(399) : warning C4267: 'function' : conversion from 'size_t' to 'int', possible loss of data
  19. 3>win32_xlate.c
  20. 4>xdelta.c
  21. 4>..\..\..\subversion\libsvn_delta\xdelta.c(192) : warning C4267: 'initializing' : conversion from 'size_t' to 'apr_uint32_t', possible loss of data
  22. 4>..\..\..\subversion\libsvn_delta\xdelta.c(383) : warning C4267: 'function' : conversion from 'size_t' to 'apr_uint32_t', possible loss of data
  23. 4>..\..\..\subversion\libsvn_delta\xdelta.c(384) : warning C4267: 'function' : conversion from 'size_t' to 'apr_uint32_t', possible loss of data
  24. 4>version.c
  25. 3>..\..\..\subversion\libsvn_subr\win32_xlate.c(179) : warning C4267: 'function' : conversion from 'size_t' to 'int', possible loss of data
  26. 3>..\..\..\subversion\libsvn_subr\win32_xlate.c(196) : warning C4267: 'function' : conversion from 'size_t' to 'int', possible loss of data
  27. 3>..\..\..\subversion\libsvn_subr\win32_xlate.c(214) : warning C4267: 'function' : conversion from 'size_t' to 'int', possible loss of data
  28. 3>win32_crypto.c
  29. 4>text_delta.c
  30. 3>..\..\..\subversion\libsvn_subr\win32_crypto.c(63) : warning C4267: '=' : conversion from 'size_t' to 'DWORD', possible loss of data
  31. 3>..\..\..\subversion\libsvn_subr\win32_crypto.c(102) : warning C4267: '=' : conversion from 'size_t' to 'DWORD', possible loss of data
  32. 3>..\..\..\subversion\libsvn_subr\win32_crypto.c(197) : warning C4267: '=' : conversion from 'size_t' to 'DWORD', possible loss of data
  33. 3>..\..\..\subversion\libsvn_subr\win32_crypto.c(236) : warning C4267: '=' : conversion from 'size_t' to 'DWORD', possible loss of data
  34. 3>win32_crashrpt.c
  35. 4>..\..\..\subversion\libsvn_delta\text_delta.c(674) : warning C4018: '>' : signed/unsigned mismatch
  36. 4>svndiff.c
  37. 3>version.c
  38. 4>..\..\..\subversion\libsvn_delta\svndiff.c(143) : warning C4267: '=' : conversion from 'size_t' to 'unsigned int', possible loss of data
  39. 4>..\..\..\subversion\libsvn_delta\svndiff.c(152) : warning C4267: '=' : conversion from 'size_t' to 'unsigned long', possible loss of data
  40. 4>..\..\..\subversion\libsvn_delta\svndiff.c(155) : warning C4267: 'function' : conversion from 'size_t' to 'uLong', possible loss of data
  41. 4>..\..\..\subversion\libsvn_delta\svndiff.c(428) : warning C4267: '=' : conversion from 'size_t' to 'unsigned long', possible loss of data
  42. 4>..\..\..\subversion\libsvn_delta\svndiff.c(430) : warning C4267: 'function' : conversion from 'size_t' to 'uLong', possible loss of data
  43. 4>..\..\..\subversion\libsvn_delta\svndiff.c(663) : warning C4267: '+=' : conversion from 'size_t' to 'int', possible loss of data
  44. 4>..\..\..\subversion\libsvn_delta\svndiff.c(721) : warning C4018: '<' : signed/unsigned mismatch
  45. 4>..\..\..\subversion\libsvn_delta\svndiff.c(885) : warning C4018: '<' : signed/unsigned mismatch
  46. 4>path_driver.c
  47. 3>validate.c
  48. 4>depth_filter_editor.c
  49. 3>utf_validate.c
  50. 3>utf.c
  51. 4>default_editor.c
  52. 3>..\..\..\subversion\libsvn_subr\utf.c(581) : warning C4244: '=' : conversion from '__int64' to 'int', possible loss of data
  53. 3>..\..\..\subversion\libsvn_subr\utf.c(590) : warning C4267: '=' : conversion from 'size_t' to 'int', possible loss of data
  54. 3>username_providers.c
  55. 4>debug_editor.c
  56. 3>user.c
  57. 4>compose_delta.c
  58. 3>time.c
  59. 4>compat.c
  60. 3>..\..\..\subversion\libsvn_subr\time.c(121) : warning C4267: 'return' : conversion from 'size_t' to 'int', possible loss of data
  61. 3>target.c
  62. 4>Generating Code...
  63. 3>..\..\..\subversion\libsvn_subr\target.c(154) : warning C4267: '=' : conversion from 'size_t' to 'int', possible loss of data
  64. 3>svn_string.c
  65. 4>Creating library...
  66. 4>Build log was saved at "file://c:\build\subversion-1.6.17-x64\Release\subversion\libsvn_delta\BuildLog.htm"
  67. 4>libsvn_delta - 0 error(s), 12 warning(s)
  68. 3>..\..\..\subversion\libsvn_subr\svn_string.c(578) : warning C4267: 'initializing' : conversion from 'size_t' to 'int', possible loss of data
  69. 3>svn_base64.c
  70. 3>..\..\..\subversion\libsvn_subr\svn_base64.c(96) : warning C4244: '+=' : conversion from '__int64' to 'int', possible loss of data
  71. 3>subst.c
  72. 3>..\..\..\subversion\libsvn_subr\subst.c(155) : warning C4244: '=' : conversion from '__int64' to 'int', possible loss of data
  73. 3>stream.c
  74. 5>------ Build started: Project: libsvn_fs_fs, Configuration: Release x64 ------
  75. 5>Compiling...
  76. 3>..\..\..\subversion\libsvn_subr\stream.c(624) : warning C4267: '=' : conversion from 'size_t' to 'uInt', possible loss of data
  77. 3>..\..\..\subversion\libsvn_subr\stream.c(675) : warning C4267: '=' : conversion from 'size_t' to 'uInt', possible loss of data
  78. 3>..\..\..\subversion\libsvn_subr\stream.c(680) : warning C4267: '=' : conversion from 'size_t' to 'uInt', possible loss of data
  79. 3>ssl_server_trust_providers.c
  80. 5>caching.c
  81. 3>ssl_client_cert_pw_providers.c
  82. 3>ssl_client_cert_providers.c
  83. 5>..\..\..\subversion\libsvn_fs_fs\caching.c(133) : warning C4267: 'function' : conversion from 'size_t' to 'int', possible loss of data
  84. 5>..\..\..\subversion\libsvn_fs_fs\caching.c(136) : warning C4267: '=' : conversion from 'size_t' to 'int', possible loss of data
  85. 3>Generating Code...
  86. 5>tree.c
  87. 5>rep-cache.c
  88. 3>Compiling...
  89. 3>sqlite.c
  90. 5>lock.c
  91. 5>key-gen.c
  92. 5>..\..\..\subversion\libsvn_fs_fs\key-gen.c(39) : warning C4267: 'initializing' : conversion from 'size_t' to 'int', possible loss of data
  93. 5>..\..\..\subversion\libsvn_fs_fs\key-gen.c(40) : warning C4267: 'initializing' : conversion from 'size_t' to 'int', possible loss of data
  94. 5>..\..\..\subversion\libsvn_fs_fs\key-gen.c(78) : warning C4267: 'initializing' : conversion from 'size_t' to 'int', possible loss of data
  95. 5>..\..\..\subversion\libsvn_fs_fs\key-gen.c(91) : warning C4267: '=' : conversion from 'size_t' to 'int', possible loss of data
  96. 5>..\..\..\subversion\libsvn_fs_fs\key-gen.c(144) : warning C4267: 'initializing' : conversion from 'size_t' to 'int', possible loss of data
  97. 5>..\..\..\subversion\libsvn_fs_fs\key-gen.c(145) : warning C4267: 'initializing' : conversion from 'size_t' to 'int', possible loss of data
  98. 5>id.c
  99. 3>..\..\..\subversion\libsvn_subr\sqlite.c(298) : warning C4267: 'function' : conversion from 'size_t' to 'int', possible loss of data
  100. 3>sorts.c
  101. 5>fs_fs.c
  102. 3>skel.c
  103. 5>..\..\..\subversion\libsvn_fs_fs\fs_fs.c(391) : warning C4267: 'initializing' : conversion from 'size_t' to 'int', possible loss of data
  104. 3>..\..\..\subversion\libsvn_subr\skel.c(155) : warning C4267: '=' : conversion from 'size_t' to 'int', possible loss of data
  105. 3>..\..\..\subversion\libsvn_subr\skel.c(163) : warning C4267: 'return' : conversion from 'size_t' to 'int', possible loss of data
  106. 3>..\..\..\subversion\libsvn_subr\skel.c(443) : warning C4267: '+=' : conversion from 'size_t' to 'int', possible loss of data
  107. 3>simple_providers.c
  108. 5>fs.c
  109. 3>sha1.c
  110. 5>err.c
  111. 3>quoprint.c
  112. 5>dag.c
  113. 3>..\..\..\subversion\libsvn_subr\quoprint.c(231) : warning C4244: '=' : conversion from '__int64' to 'char', possible loss of data
  114. 3>properties.c
  115. 3>..\..\..\subversion\libsvn_subr\properties.c(70) : warning C4267: '=' : conversion from 'size_t' to 'int', possible loss of data
  116. 3>..\..\..\subversion\libsvn_subr\properties.c(77) : warning C4267: '=' : conversion from 'size_t' to 'int', possible loss of data
  117. 5>..\..\..\subversion\libsvn_fs_fs\dag.c(1147) : warning C4244: '=' : conversion from '__int64' to 'int', possible loss of data
  118. 5>Generating Code...
  119. 3>prompt.c
  120. 3>pool.c
  121. 3>path.c
  122. 5>Creating library...
  123. 3>..\..\..\subversion\libsvn_subr\path.c(623) : warning C4267: '=' : conversion from 'size_t' to 'int', possible loss of data
  124. 3>..\..\..\subversion\libsvn_subr\path.c(649) : warning C4267: '=' : conversion from 'size_t' to 'int', possible loss of data
  125. 3>opt.c
  126. 5>Build log was saved at "file://c:\build\subversion-1.6.17-x64\Release\subversion\libsvn_fs_fs\BuildLog.htm"
  127. 5>libsvn_fs_fs - 0 error(s), 10 warning(s)
  128. 3>..\..\..\subversion\libsvn_subr\opt.c(664) : warning C4267: 'initializing' : conversion from 'size_t' to 'int', possible loss of data
  129. 3>..\..\..\subversion\libsvn_subr\opt.c(859) : warning C4267: '=' : conversion from 'size_t' to 'int', possible loss of data
  130. 3>..\..\..\subversion\libsvn_subr\opt.c(1034) : warning C4018: '<' : signed/unsigned mismatch
  131. 3>nls.c
  132. 6>------ Build started: Project: libsvn_fs_util, Configuration: Release x64 ------
  133. 6>Compiling...
  134. 3>mergeinfo.c
  135. 6>fs-util.c
  136. 3>..\..\..\subversion\libsvn_subr\mergeinfo.c(1712) : warning C4267: 'initializing' : conversion from 'size_t' to 'int', possible loss of data
  137. 3>md5.c
  138. 6>..\..\..\subversion\libsvn_fs_util\fs-util.c(49) : warning C4267: '=' : conversion from 'size_t' to 'int', possible loss of data
  139. 6>Creating library...
  140. 6>Build log was saved at "file://c:\build\subversion-1.6.17-x64\Release\subversion\libsvn_fs_util\BuildLog.htm"
  141. 6>libsvn_fs_util - 0 error(s), 1 warning(s)
  142. 3>macos_keychain.c
  143. 7>------ Build started: Project: libsvn_fs, Configuration: Release x64 ------
  144. 7>Compiling...
  145. 7>access.c
  146. 3>log.c
  147. 3>lock.c
  148. 7>fs-loader.c
  149. 3>kitchensink.c
  150. 7>Generating Code...
  151. 7>Creating library...
  152. 3>iter.c
  153. 7>Build log was saved at "file://c:\build\subversion-1.6.17-x64\Release\subversion\libsvn_fs\BuildLog.htm"
  154. 7>libsvn_fs - 0 error(s), 0 warning(s)
  155. 8>------ Build started: Project: libsvn_diff, Configuration: Release x64 ------
  156. 8>Compiling...
  157. 3>io.c
  158. 8>deprecated.c
  159. 8>util.c
  160. 3>..\..\..\subversion\libsvn_subr\io.c(2923) : warning C4267: '=' : conversion from 'size_t' to 'int', possible loss of data
  161. 3>Generating Code...
  162. 8>token.c
  163. 8>lcs.c
  164. 3>c:\build\subversion-1.6.17-x64\subversion\libsvn_subr\pool.c(50) : warning C4716: 'abort_on_pool_failure' : must return a value
  165. 8>diff_memory.c
  166. 8>diff_file.c
  167. 8>..\..\..\subversion\libsvn_diff\diff_file.c(1076) : warning C4267: '=' : conversion from 'size_t' to 'int', possible loss of data
  168. 8>..\..\..\subversion\libsvn_diff\diff_file.c(1085) : warning C4244: '=' : conversion from '__int64' to 'int', possible loss of data
  169. 8>diff4.c
  170. 8>diff3.c
  171. 8>diff.c
  172. 8>Generating Code...
  173. 8>Creating library...
  174. 8>Build log was saved at "file://c:\build\subversion-1.6.17-x64\Release\subversion\libsvn_diff\BuildLog.htm"
  175. 8>libsvn_diff - 0 error(s), 2 warning(s)
  176. 9>------ Build started: Project: libsvn_repos, Configuration: Release x64 ------
  177. 9>Compiling...
  178. 9>authz.c
  179. 9>rev_hunt.c
  180. 9>repos.c
  181. 9>..\..\..\subversion\libsvn_repos\repos.c(1728) : warning C4267: '=' : conversion from 'size_t' to 'unsigned int', possible loss of data
  182. 9>reporter.c
  183. 9>replay.c
  184. 9>..\..\..\subversion\libsvn_repos\replay.c(718) : warning C4267: '=' : conversion from 'size_t' to 'int', possible loss of data
  185. 9>..\..\..\subversion\libsvn_repos\replay.c(759) : warning C4244: 'function' : conversion from 'apr_ssize_t' to 'int', possible loss of data
  186. 9>node_tree.c
  187. 9>log.c
  188. 9>load.c
  189. 9>..\..\..\subversion\libsvn_repos\load.c(469) : warning C4018: '>=' : signed/unsigned mismatch
  190. 9>..\..\..\subversion\libsvn_repos\load.c(788) : warning C4018: '>=' : signed/unsigned mismatch
  191. 9>hooks.c
  192. 9>fs-wrap.c
  193. 9>dump.c
  194. 9>deprecated.c
  195. 9>delta.c
  196. 9>commit.c
  197. 9>..\..\..\subversion\libsvn_repos\commit.c(326) : warning C4267: '=' : conversion from 'size_t' to 'int', possible loss of data
  198. 9>..\..\..\subversion\libsvn_repos\commit.c(470) : warning C4267: '=' : conversion from 'size_t' to 'int', possible loss of data
  199. 9>Generating Code...
  200. 9>Creating library...
  201. 9>Build log was saved at "file://c:\build\subversion-1.6.17-x64\Release\subversion\libsvn_repos\BuildLog.htm"
  202. 9>libsvn_repos - 0 error(s), 7 warning(s)
  203. 10>------ Build started: Project: libsvn_ra_svn, Configuration: Release x64 ------
  204. 10>Compiling...
  205. 10>client.c
  206. 10>version.c
  207. 10>streams.c
  208. 10>marshal.c
  209. 10>..\..\..\subversion\libsvn_ra_svn\marshal.c(142) : warning C4244: '+=' : conversion from 'apr_ssize_t' to 'int', possible loss of data
  210. 10>internal_auth.c
  211. 10>editorp.c
  212. 10>cyrus_auth.c
  213. 10>cram.c
  214. 10>Generating Code...
  215. 10>Creating library...
  216. 10>Build log was saved at "file://c:\build\subversion-1.6.17-x64\Release\subversion\libsvn_ra_svn\BuildLog.htm"
  217. 10>libsvn_ra_svn - 0 error(s), 1 warning(s)
  218. 3>Compiling...
  219. 3>hash.c
  220. 11>------ Build started: Project: neon, Configuration: Release x64 ------
  221. 11>Performing Makefile project actions
  222. 3>error.c
  223. 11> tempfile.bat
  224. 11>Created config.h from config.hw
  225. 11> cl.exe @C:\Users\mario\AppData\Local\Temp\nmB366.tmp
  226. 11>cl : Command line warning D9035 : option 'GX' has been deprecated and will be removed in a future release
  227. 11>cl : Command line warning D9036 : use 'EHsc' instead of 'GX'
  228. 11>ne_alloc.c
  229. 11>src\ne_alloc.c(91) : warning C4996: 'strcpy': This function or variable may be unsafe. Consider using strcpy_s instead. To disable deprecation, use _CRT_SECURE_NO_WARNINGS. See online help for details.
  230. 11>ne_auth.c
  231. 3>dso.c
  232. 11>ne_basic.c
  233. 11>ne_compress.c
  234. 11>src\ne_compress.c(193) : warning C4267: '=' : conversion from 'size_t' to 'uInt', possible loss of data
  235. 11>ne_dates.c
  236. 3>dirent_uri.c
  237. 11>src\ne_dates.c(106) : warning C4996: 'gmtime': This function or variable may be unsafe. Consider using gmtime_s instead. To disable deprecation, use _CRT_SECURE_NO_WARNINGS. See online help for details.
  238. 11> C:\Program Files (x86)\Microsoft Visual Studio 9.0\VC\include\time.inl(101) : see declaration of 'gmtime'
  239. 11>src\ne_dates.c(134) : warning C4996: 'sscanf': This function or variable may be unsafe. Consider using sscanf_s instead. To disable deprecation, use _CRT_SECURE_NO_WARNINGS. See online help for details.
  240. 11> C:\Program Files (x86)\Microsoft Visual Studio 9.0\VC\include\stdio.h(324) : see declaration of 'sscanf'
  241. 11>src\ne_dates.c(142) : warning C4996: 'sscanf': This function or variable may be unsafe. Consider using sscanf_s instead. To disable deprecation, use _CRT_SECURE_NO_WARNINGS. See online help for details.
  242. 11> C:\Program Files (x86)\Microsoft Visual Studio 9.0\VC\include\stdio.h(324) : see declaration of 'sscanf'
  243. 11>src\ne_dates.c(149) : warning C4996: 'sscanf': This function or variable may be unsafe. Consider using sscanf_s instead. To disable deprecation, use _CRT_SECURE_NO_WARNINGS. See online help for details.
  244. 11> C:\Program Files (x86)\Microsoft Visual Studio 9.0\VC\include\stdio.h(324) : see declaration of 'sscanf'
  245. 11>src\ne_dates.c(177) : warning C4996: 'sscanf': This function or variable may be unsafe. Consider using sscanf_s instead. To disable deprecation, use _CRT_SECURE_NO_WARNINGS. See online help for details.
  246. 11> C:\Program Files (x86)\Microsoft Visual Studio 9.0\VC\include\stdio.h(324) : see declaration of 'sscanf'
  247. 11>src\ne_dates.c(202) : warning C4996: 'sscanf': This function or variable may be unsafe. Consider using sscanf_s instead. To disable deprecation, use _CRT_SECURE_NO_WARNINGS. See online help for details.
  248. 11> C:\Program Files (x86)\Microsoft Visual Studio 9.0\VC\include\stdio.h(324) : see declaration of 'sscanf'
  249. 11>src\ne_dates.c(238) : warning C4996: 'sscanf': This function or variable may be unsafe. Consider using sscanf_s instead. To disable deprecation, use _CRT_SECURE_NO_WARNINGS. See online help for details.
  250. 11> C:\Program Files (x86)\Microsoft Visual Studio 9.0\VC\include\stdio.h(324) : see declaration of 'sscanf'
  251. 11>ne_i18n.c
  252. 11>ne_md5.c
  253. 11>src\ne_md5.c(228) : warning C4267: '+=' : conversion from 'size_t' to 'md5_uint32', possible loss of data
  254. 11>src\ne_md5.c(255) : warning C4267: '=' : conversion from 'size_t' to 'md5_uint32', possible loss of data
  255. 11>src\ne_md5.c(286) : warning C4267: '+=' : conversion from 'size_t' to 'md5_uint32', possible loss of data
  256. 11>ne_pkcs11.c
  257. 11>ne_redirect.c
  258. 11>ne_request.c
  259. 11>src\ne_request.c(279) : warning C4267: 'return' : conversion from 'size_t' to 'int', possible loss of data
  260. 11>src\ne_request.c(298) : warning C4267: 'function' : conversion from 'size_t' to 'unsigned int', possible loss of data
  261. 11>src\ne_request.c(321) : warning C4996: 'lseek': The POSIX name for this item is deprecated. Instead, use the ISO C++ conformant name: _lseek. See online help for details.
  262. 11> C:\Program Files (x86)\Microsoft Visual Studio 9.0\VC\include\io.h(314) : see declaration of 'lseek'
  263. 11>src\ne_request.c(332) : warning C4996: 'strcpy': This function or variable may be unsafe. Consider using strcpy_s instead. To disable deprecation, use _CRT_SECURE_NO_WARNINGS. See online help for details.
  264. 11>src\ne_request.c(508) : warning C4267: 'function' : conversion from 'size_t' to 'ne_off_t', possible loss of data
  265. 11>src\ne_request.c(810) : warning C4267: '+=' : conversion from 'size_t' to 'ne_off_t', possible loss of data
  266. 11>src\ne_request.c(821) : warning C4267: 'return' : conversion from 'size_t' to 'int', possible loss of data
  267. 11>src\ne_request.c(1365) : warning C4996: 'write': The POSIX name for this item is deprecated. Instead, use the ISO C++ conformant name: _write. See online help for details.
  268. 11> C:\Program Files (x86)\Microsoft Visual Studio 9.0\VC\include\io.h(322) : see declaration of 'write'
  269. 11>ne_session.c
  270. 11>src\ne_session.c(140) : warning C4996: 'strcpy': This function or variable may be unsafe. Consider using strcpy_s instead. To disable deprecation, use _CRT_SECURE_NO_WARNINGS. See online help for details.
  271. 11>src\ne_session.c(163) : warning C4996: 'strcpy': This function or variable may be unsafe. Consider using strcpy_s instead. To disable deprecation, use _CRT_SECURE_NO_WARNINGS. See online help for details.
  272. 11>src\ne_session.c(427) : warning C4996: 'strcat': This function or variable may be unsafe. Consider using strcat_s instead. To disable deprecation, use _CRT_SECURE_NO_WARNINGS. See online help for details.
  273. 11>src\ne_session.c(427) : warning C4996: 'strcat': This function or variable may be unsafe. Consider using strcat_s instead. To disable deprecation, use _CRT_SECURE_NO_WARNINGS. See online help for details.
  274. 11>src\ne_session.c(427) : warning C4996: 'strcpy': This function or variable may be unsafe. Consider using strcpy_s instead. To disable deprecation, use _CRT_SECURE_NO_WARNINGS. See online help for details.
  275. 11>src\ne_session.c(526) : warning C4996: 'strncpy': This function or variable may be unsafe. Consider using strncpy_s instead. To disable deprecation, use _CRT_SECURE_NO_WARNINGS. See online help for details.
  276. 11> C:\Program Files (x86)\Microsoft Visual Studio 9.0\VC\include\string.h(157) : see declaration of 'strncpy'
  277. 11>src\ne_session.c(530) : warning C4996: 'strncpy': This function or variable may be unsafe. Consider using strncpy_s instead. To disable deprecation, use _CRT_SECURE_NO_WARNINGS. See online help for details.
  278. 11> C:\Program Files (x86)\Microsoft Visual Studio 9.0\VC\include\string.h(157) : see declaration of 'strncpy'
  279. 11>src\ne_session.c(537) : warning C4996: 'strncpy': This function or variable may be unsafe. Consider using strncpy_s instead. To disable deprecation, use _CRT_SECURE_NO_WARNINGS. See online help for details.
  280. 11> C:\Program Files (x86)\Microsoft Visual Studio 9.0\VC\include\string.h(157) : see declaration of 'strncpy'
  281. 11>src\ne_session.c(541) : warning C4996: 'strncpy': This function or variable may be unsafe. Consider using strncpy_s instead. To disable deprecation, use _CRT_SECURE_NO_WARNINGS. See online help for details.
  282. 11> C:\Program Files (x86)\Microsoft Visual Studio 9.0\VC\include\string.h(157) : see declaration of 'strncpy'
  283. 11>src\ne_session.c(564) : warning C4996: 'strcpy': This function or variable may be unsafe. Consider using strcpy_s instead. To disable deprecation, use _CRT_SECURE_NO_WARNINGS. See online help for details.
  284. 11>src\ne_session.c(568) : warning C4996: 'strncat': This function or variable may be unsafe. Consider using strncat_s instead. To disable deprecation, use _CRT_SECURE_NO_WARNINGS. See online help for details.
  285. 3>..\..\..\subversion\libsvn_subr\dirent_uri.c(684) : warning C4267: '=' : conversion from 'size_t' to 'int', possible loss of data
  286. 11> C:\Program Files (x86)\Microsoft Visual Studio 9.0\VC\include\string.h(144) : see declaration of 'strncat'
  287. 3>..\..\..\subversion\libsvn_subr\dirent_uri.c(1173) : warning C4244: 'initializing' : conversion from '__int64' to 'int', possible loss of data
  288. 3>deprecated.c
  289. 11>src\ne_session.c(569) : warning C4996: 'strncat': This function or variable may be unsafe. Consider using strncat_s instead. To disable deprecation, use _CRT_SECURE_NO_WARNINGS. See online help for details.
  290. 11> C:\Program Files (x86)\Microsoft Visual Studio 9.0\VC\include\string.h(144) : see declaration of 'strncat'
  291. 11>ne_socket.c
  292. 11>src\ne_socket.c(245) : warning C4267: 'function' : conversion from 'size_t' to 'DWORD', possible loss of data
  293. 11>src\ne_socket.c(448) : warning C4267: 'return' : conversion from 'size_t' to 'int', possible loss of data
  294. 11>src\ne_socket.c(463) : warning C4267: 'return' : conversion from 'size_t' to 'int', possible loss of data
  295. 11>src\ne_socket.c(473) : warning C4267: '=' : conversion from 'size_t' to 'int', possible loss of data
  296. 11>src\ne_socket.c(489) : warning C4267: 'return' : conversion from 'size_t' to 'int', possible loss of data
  297. 11>src\ne_socket.c(512) : warning C4267: 'function' : conversion from 'size_t' to 'int', possible loss of data
  298. 11>src\ne_socket.c(516) : warning C4996: 'strncpy': This function or variable may be unsafe. Consider using strncpy_s instead. To disable deprecation, use _CRT_SECURE_NO_WARNINGS. See online help for details.
  299. 11> C:\Program Files (x86)\Microsoft Visual Studio 9.0\VC\include\string.h(157) : see declaration of 'strncpy'
  300. 11>src\ne_socket.c(541) : warning C4267: 'function' : conversion from 'size_t' to 'int', possible loss of data
  301. 11>src\ne_socket.c(562) : warning C4267: '=' : conversion from 'size_t' to 'ULONG', possible loss of data
  302. 11>src\ne_socket.c(612) : warning C4996: 'strncpy': This function or variable may be unsafe. Consider using strncpy_s instead. To disable deprecation, use _CRT_SECURE_NO_WARNINGS. See online help for details.
  303. 3>date.c
  304. 11> C:\Program Files (x86)\Microsoft Visual Studio 9.0\VC\include\string.h(157) : see declaration of 'strncpy'
  305. 11>src\ne_socket.c(622) : warning C4996: 'strncpy': This function or variable may be unsafe. Consider using strncpy_s instead. To disable deprecation, use _CRT_SECURE_NO_WARNINGS. See online help for details.
  306. 11> C:\Program Files (x86)\Microsoft Visual Studio 9.0\VC\include\string.h(157) : see declaration of 'strncpy'
  307. 11>src\ne_socket.c(656) : warning C4267: 'function' : conversion from 'size_t' to 'int', possible loss of data
  308. 11>src\ne_socket.c(665) : warning C4267: 'initializing' : conversion from 'size_t' to 'int', possible loss of data
  309. 11>src\ne_socket.c(818) : warning C4267: '-=' : conversion from 'size_t' to 'int', possible loss of data
  310. 11>src\ne_socket.c(867) : warning C4996: 'strncpy': This function or variable may be unsafe. Consider using strncpy_s instead. To disable deprecation, use _CRT_SECURE_NO_WARNINGS. See online help for details.
  311. 11> C:\Program Files (x86)\Microsoft Visual Studio 9.0\VC\include\string.h(157) : see declaration of 'strncpy'
  312. 11>src\ne_socket.c(876) : warning C4267: 'return' : conversion from 'size_t' to 'int', possible loss of data
  313. 11>src\ne_socket.c(1048) : warning C4996: 'strncpy': This function or variable may be unsafe. Consider using strncpy_s instead. To disable deprecation, use _CRT_SECURE_NO_WARNINGS. See online help for details.
  314. 11> C:\Program Files (x86)\Microsoft Visual Studio 9.0\VC\include\string.h(157) : see declaration of 'strncpy'
  315. 11>src\ne_socket.c(1138) : warning C4133: 'function' : incompatible types - from 'const ne_inet_addr *' to 'const char *'
  316. 11>src\ne_socket.c(1140) : warning C4996: 'strncpy': This function or variable may be unsafe. Consider using strncpy_s instead. To disable deprecation, use _CRT_SECURE_NO_WARNINGS. See online help for details.
  317. 11> C:\Program Files (x86)\Microsoft Visual Studio 9.0\VC\include\string.h(157) : see declaration of 'strncpy'
  318. 11>src\ne_socket.c(1167) : warning C4267: 'function' : conversion from 'size_t' to 'int', possible loss of data
  319. 11>src\ne_socket.c(1324) : warning C4133: 'function' : incompatible types - from 'int *' to 'const char *'
  320. 11>src\ne_socket.c(1395) : warning C4244: '=' : conversion from 'SOCKET' to 'int', possible loss of data
  321. 11>src\ne_socket.c(1441) : warning C4133: 'function' : incompatible types - from 'int *' to 'const char *'
  322. 11>src\ne_socket.c(1474) : warning C4996: 'strncpy': This function or variable may be unsafe. Consider using strncpy_s instead. To disable deprecation, use _CRT_SECURE_NO_WARNINGS. See online help for details.
  323. 11> C:\Program Files (x86)\Microsoft Visual Studio 9.0\VC\include\string.h(157) : see declaration of 'strncpy'
  324. 11>src\ne_socket.c(1580) : warning C4244: 'initializing' : conversion from 'SOCKET' to 'int', possible loss of data
  325. 11>src\ne_socket.c(1717) : warning C4996: 'strncpy': This function or variable may be unsafe. Consider using strncpy_s instead. To disable deprecation, use _CRT_SECURE_NO_WARNINGS. See online help for details.
  326. 11> C:\Program Files (x86)\Microsoft Visual Studio 9.0\VC\include\string.h(157) : see declaration of 'strncpy'
  327. 11>src\ne_socket.c(1724) : warning C4996: 'strncpy': This function or variable may be unsafe. Consider using strncpy_s instead. To disable deprecation, use _CRT_SECURE_NO_WARNINGS. See online help for details.
  328. 11> C:\Program Files (x86)\Microsoft Visual Studio 9.0\VC\include\string.h(157) : see declaration of 'strncpy'
  329. 11>src\ne_socket.c(1730) : warning C4996: 'strncpy': This function or variable may be unsafe. Consider using strncpy_s instead. To disable deprecation, use _CRT_SECURE_NO_WARNINGS. See online help for details.
  330. 11> C:\Program Files (x86)\Microsoft Visual Studio 9.0\VC\include\string.h(157) : see declaration of 'strncpy'
  331. 11>ne_socks.c
  332. 11>ne_sspi.c
  333. 11>src\ne_sspi.c(287) : warning C4267: '=' : conversion from 'size_t' to 'unsigned long', possible loss of data
  334. 11>ne_string.c
  335. 3>ctype.c
  336. 11>src\ne_string.c(158) : warning C4267: '=' : conversion from 'size_t' to 'int', possible loss of data
  337. 11>src\ne_string.c(504) : warning C4996: 'strncpy': This function or variable may be unsafe. Consider using strncpy_s instead. To disable deprecation, use _CRT_SECURE_NO_WARNINGS. See online help for details.
  338. 11> C:\Program Files (x86)\Microsoft Visual Studio 9.0\VC\include\string.h(157) : see declaration of 'strncpy'
  339. 11>src\ne_string.c(504) : warning C4996: 'strerror': This function or variable may be unsafe. Consider using strerror_s instead. To disable deprecation, use _CRT_SECURE_NO_WARNINGS. See online help for details.
  340. 11> C:\Program Files (x86)\Microsoft Visual Studio 9.0\VC\include\string.h(126) : see declaration of 'strerror'
  341. 11>src\ne_string.c(518) : warning C4996: 'vsnprintf': This function or variable may be unsafe. Consider using vsnprintf_s instead. To disable deprecation, use _CRT_SECURE_NO_WARNINGS. See online help for details.
  342. 11> C:\Program Files (x86)\Microsoft Visual Studio 9.0\VC\include\stdio.h(350) : see declaration of 'vsnprintf'
  343. 11>src\ne_string.c(531) : warning C4996: 'vsnprintf': This function or variable may be unsafe. Consider using vsnprintf_s instead. To disable deprecation, use _CRT_SECURE_NO_WARNINGS. See online help for details.
  344. 11> C:\Program Files (x86)\Microsoft Visual Studio 9.0\VC\include\stdio.h(350) : see declaration of 'vsnprintf'
  345. 11>ne_uri.c
  346. 11>src\ne_uri.c(366) : warning C4996: 'strncat': This function or variable may be unsafe. Consider using strncat_s instead. To disable deprecation, use _CRT_SECURE_NO_WARNINGS. See online help for details.
  347. 11> C:\Program Files (x86)\Microsoft Visual Studio 9.0\VC\include\string.h(144) : see declaration of 'strncat'
  348. 11>src\ne_uri.c(498) : warning C4996: 'sprintf': This function or variable may be unsafe. Consider using sprintf_s instead. To disable deprecation, use _CRT_SECURE_NO_WARNINGS. See online help for details.
  349. 11> C:\Program Files (x86)\Microsoft Visual Studio 9.0\VC\include\stdio.h(366) : see declaration of 'sprintf'
  350. 11>src\ne_uri.c(553) : warning C4267: 'initializing' : conversion from 'size_t' to 'int', possible loss of data
  351. 11>src\ne_uri.c(553) : warning C4267: 'initializing' : conversion from 'size_t' to 'int', possible loss of data
  352. 11>ne_utils.c
  353. 11>ne_207.c
  354. 11>src\ne_207.c(290) : warning C4996: 'sprintf': This function or variable may be unsafe. Consider using sprintf_s instead. To disable deprecation, use _CRT_SECURE_NO_WARNINGS. See online help for details.
  355. 11> C:\Program Files (x86)\Microsoft Visual Studio 9.0\VC\include\stdio.h(366) : see declaration of 'sprintf'
  356. 11>ne_xml.c
  357. 3>constructors.c
  358. 11>src\ne_xml.c(474) : warning C4996: 'strcpy': This function or variable may be unsafe. Consider using strcpy_s instead. To disable deprecation, use _CRT_SECURE_NO_WARNINGS. See online help for details.
  359. 11>src\ne_xml.c(588) : warning C4267: 'function' : conversion from 'size_t' to 'int', possible loss of data
  360. 11>ne_xmlreq.c
  361. 11>Generating Code...
  362. 3>config_win.c
  363. 11>Compiling...
  364. 11>ne_oldacl.c
  365. 11>ne_acl3744.c
  366. 11>ne_props.c
  367. 11>ne_locks.c
  368. 3>..\..\..\subversion\libsvn_subr\config_win.c(71) : warning C4267: 'function' : conversion from 'size_t' to 'int', possible loss of data
  369. 3>..\..\..\subversion\libsvn_subr\config_win.c(72) : warning C4267: 'function' : conversion from 'size_t' to 'int', possible loss of data
  370. 3>..\..\..\subversion\libsvn_subr\config_win.c(107) : warning C4267: '=' : conversion from 'size_t' to 'DWORD', possible loss of data
  371. 11>src\ne_locks.c(490) : warning C4996: 'strdup': The POSIX name for this item is deprecated. Instead, use the ISO C++ conformant name: _strdup. See online help for details.
  372. 11> C:\Program Files (x86)\Microsoft Visual Studio 9.0\VC\include\string.h(207) : see declaration of 'strdup'
  373. 3>..\..\..\subversion\libsvn_subr\config_win.c(126) : warning C4267: 'initializing' : conversion from 'size_t' to 'DWORD', possible loss of data
  374. 11>src\ne_locks.c(493) : warning C4996: 'strdup': The POSIX name for this item is deprecated. Instead, use the ISO C++ conformant name: _strdup. See online help for details.
  375. 11> C:\Program Files (x86)\Microsoft Visual Studio 9.0\VC\include\string.h(207) : see declaration of 'strdup'
  376. 11>ne_openssl.c
  377. 3>..\..\..\subversion\libsvn_subr\config_win.c(212) : warning C4267: 'initializing' : conversion from 'size_t' to 'DWORD', possible loss of data
  378. 3>config_file.c
  379. 11>src\ne_openssl.c(825) : warning C4996: 'fopen': This function or variable may be unsafe. Consider using fopen_s instead. To disable deprecation, use _CRT_SECURE_NO_WARNINGS. See online help for details.
  380. 11> C:\Program Files (x86)\Microsoft Visual Studio 9.0\VC\include\stdio.h(237) : see declaration of 'fopen'
  381. 11>src\ne_openssl.c(963) : warning C4996: 'fopen': This function or variable may be unsafe. Consider using fopen_s instead. To disable deprecation, use _CRT_SECURE_NO_WARNINGS. See online help for details.
  382. 11> C:\Program Files (x86)\Microsoft Visual Studio 9.0\VC\include\stdio.h(237) : see declaration of 'fopen'
  383. 11>src\ne_openssl.c(984) : warning C4996: 'fopen': This function or variable may be unsafe. Consider using fopen_s instead. To disable deprecation, use _CRT_SECURE_NO_WARNINGS. See online help for details.
  384. 11> C:\Program Files (x86)\Microsoft Visual Studio 9.0\VC\include\stdio.h(237) : see declaration of 'fopen'
  385. 11>src\ne_openssl.c(1030) : warning C4267: 'function' : conversion from 'size_t' to 'long', possible loss of data
  386. 11>Generating Code...
  387. 3>config_auth.c
  388. 11> link.exe -lib @C:\Users\mario\AppData\Local\Temp\nmC86E.tmp
  389. 3>config.c
  390. 11>ssleay32.lib(SSLEAY32.dll) : warning LNK4006: __NULL_IMPORT_DESCRIPTOR already defined in libeay32.lib(LIBEAY32.dll); second definition ignored
  391. 11>ssleay32.lib(SSLEAY32.dll) : warning LNK4221: no public symbols found; archive member will be inaccessible
  392. 11>Build log was saved at "file://c:\build\subversion-1.6.17-x64\neon\Release\BuildLog.htm"
  393. 11>neon - 0 error(s), 83 warning(s)
  394. 3>compat.c
  395. 12>------ Build started: Project: libsvn_ra_neon, Configuration: Release x64 ------
  396. 12>Compiling...
  397. 12>commit.c
  398. 3>cmdline.c
  399. 12>util.c
  400. 3>checksum.c
  401. 12>..\..\..\subversion\libsvn_ra_neon\util.c(911) : warning C4267: 'return' : conversion from 'size_t' to 'int', possible loss of data
  402. 3>..\..\..\subversion\libsvn_subr\checksum.c(213) : warning C4267: 'function' : conversion from 'size_t' to 'unsigned int', possible loss of data
  403. 3>..\..\..\subversion\libsvn_subr\checksum.c(294) : warning C4267: 'function' : conversion from 'size_t' to 'unsigned int', possible loss of data
  404. 3>cache.c
  405. 12>session.c
  406. 3>cache-memcache.c
  407. 12>replay.c
  408. 3>cache-inprocess.c
  409. 12>props.c
  410. 3>auth.c
  411. 3>Generating Code...
  412. 12>..\..\..\subversion\libsvn_ra_neon\props.c(563) : warning C4267: 'initializing' : conversion from 'size_t' to 'int', possible loss of data
  413. 12>options.c
  414. 12>mergeinfo.c
  415. 3>Creating library...
  416. 12>merge.c
  417. 3>Build log was saved at "file://c:\build\subversion-1.6.17-x64\Release\subversion\libsvn_subr\BuildLog.htm"
  418. 3>libsvn_subr - 0 error(s), 42 warning(s)
  419. 12>log.c
  420. 13>------ Build started: Project: libsvn_subr_dll, Configuration: Release x64 ------
  421. 13>libsvn_subr_dll : warning PRJ0009 : Build log could not be opened for writing.
  422. 13>Make sure that the file is not open by another process and is not write-protected.
  423. 13>Performing Custom Build Step
  424. 12>lock.c
  425. 13>Compiling...
  426. 13>empty.c
  427. 13>Compiling resources...
  428. 12>get_locks.c
  429. 13>Microsoft (R) Windows (R) Resource Compiler Version 6.1.7600.16385
  430. 13>Copyright (C) Microsoft Corporation. All rights reserved.
  431. 13>Linking...
  432. 13>libsvn_subr.def(96) : warning LNK4087: CONSTANT keyword is obsolete; use DATA
  433. 13> Creating library ..\..\..\Release\subversion\libsvn_subr\libsvn_subr-1.lib and object ..\..\..\Release\subversion\libsvn_subr\libsvn_subr-1.exp
  434. 13>zlibstat.lib(inflate.obj) : error LNK2019: unresolved external symbol inflate_fast referenced in function inflate
  435. 13>zlibstat.lib(deflate.obj) : error LNK2019: unresolved external symbol match_init referenced in function lm_init
  436. 13>zlibstat.lib(deflate.obj) : error LNK2019: unresolved external symbol longest_match referenced in function deflate_fast
  437. 13>..\..\..\Release\subversion\libsvn_subr\libsvn_subr-1.dll : fatal error LNK1120: 3 unresolved externals
  438. 13>Build log was saved at "file://c:\build\subversion-1.6.17-x64\Release\subversion\libsvn_subr\BuildLog.htm"
  439. 13>libsvn_subr_dll - 4 error(s), 2 warning(s)
  440. 12>get_locations.c
  441. 14>------ Build started: Project: libsvn_delta_dll, Configuration: Release x64 ------
  442. 14>Performing Custom Build Step
  443. 14>Compiling...
  444. 12>get_location_segments.c
  445. 14>empty.c
  446. 14>Compiling resources...
  447. 14>Microsoft (R) Windows (R) Resource Compiler Version 6.1.7600.16385
  448. 14>Copyright (C) Microsoft Corporation. All rights reserved.
  449. 14>Linking...
  450. 14> Creating library ..\..\..\Release\subversion\libsvn_delta\libsvn_delta-1.lib and object ..\..\..\Release\subversion\libsvn_delta\libsvn_delta-1.exp
  451. 14>zlibstat.lib(deflate.obj) : error LNK2019: unresolved external symbol match_init referenced in function lm_init
  452. 14>zlibstat.lib(deflate.obj) : error LNK2019: unresolved external symbol longest_match referenced in function deflate_fast
  453. 14>zlibstat.lib(inflate.obj) : error LNK2019: unresolved external symbol inflate_fast referenced in function inflate
  454. 14>..\..\..\Release\subversion\libsvn_delta\libsvn_delta-1.dll : fatal error LNK1120: 3 unresolved externals
  455. 12>get_deleted_rev.c
  456. 14>Build log was saved at "file://c:\build\subversion-1.6.17-x64\Release\subversion\libsvn_delta\BuildLog.htm"
  457. 14>libsvn_delta_dll - 4 error(s), 0 warning(s)
  458. 15>------ Build started: Project: libsvn_fs_dll, Configuration: Release x64 ------
  459. 15>Performing Custom Build Step
  460. 12>get_dated_rev.c
  461. 15>Compiling...
  462. 15>empty.c
  463. 15>Compiling resources...
  464. 15>Microsoft (R) Windows (R) Resource Compiler Version 6.1.7600.16385
  465. 15>Copyright (C) Microsoft Corporation. All rights reserved.
  466. 15>Linking...
  467. 15> Creating library ..\..\..\Release\subversion\libsvn_fs\libsvn_fs-1.lib and object ..\..\..\Release\subversion\libsvn_fs\libsvn_fs-1.exp
  468. 12>file_revs.c
  469. 15>Embedding manifest...
  470. 12>fetch.c
  471. 15>Build log was saved at "file://c:\build\subversion-1.6.17-x64\Release\subversion\libsvn_fs\BuildLog.htm"
  472. 15>libsvn_fs_dll - 0 error(s), 0 warning(s)
  473. 16>------ Build started: Project: libsvn_diff_dll, Configuration: Release x64 ------
  474. 16>Performing Custom Build Step
  475. 16>Compiling...
  476. 12>Generating Code...
  477. 16>empty.c
  478. 16>Compiling resources...
  479. 16>Microsoft (R) Windows (R) Resource Compiler Version 6.1.7600.16385
  480. 16>Copyright (C) Microsoft Corporation. All rights reserved.
  481. 16>Linking...
  482. 16> Creating library ..\..\..\Release\subversion\libsvn_diff\libsvn_diff-1.lib and object ..\..\..\Release\subversion\libsvn_diff\libsvn_diff-1.exp
  483. 16>Embedding manifest...
  484. 16>Build log was saved at "file://c:\build\subversion-1.6.17-x64\Release\subversion\libsvn_diff\BuildLog.htm"
  485. 16>libsvn_diff_dll - 0 error(s), 0 warning(s)
  486. 12>Creating library...
  487. 17>------ Build started: Project: libsvn_ra, Configuration: Release x64 ------
  488. 17>Compiling...
  489. 12>Build log was saved at "file://c:\build\subversion-1.6.17-x64\Release\subversion\libsvn_ra_neon\BuildLog.htm"
  490. 12>libsvn_ra_neon - 0 error(s), 2 warning(s)
  491. 17>compat.c
  492. 17>..\..\..\subversion\libsvn_ra\compat.c(137) : warning C4267: 'initializing' : conversion from 'size_t' to 'int', possible loss of data
  493. 17>util.c
  494. 18>------ Build started: Project: libsvn_ra_local, Configuration: Release x64 ------
  495. 18>Compiling...
  496. 18>ra_plugin.c
  497. 17>ra_loader.c
  498. 18>..\..\..\subversion\libsvn_ra_local\ra_plugin.c(190) : warning C4267: '=' : conversion from 'size_t' to 'int', possible loss of data
  499. 18>..\..\..\subversion\libsvn_ra_local\ra_plugin.c(261) : warning C4267: '=' : conversion from 'size_t' to 'int', possible loss of data
  500. 18>split_url.c
  501. 17>deprecated.c
  502. 18>Generating Code...
  503. 17>Generating Code...
  504. 18>Creating library...
  505. 18>Build log was saved at "file://c:\build\subversion-1.6.17-x64\Release\subversion\libsvn_ra_local\BuildLog.htm"
  506. 18>libsvn_ra_local - 0 error(s), 2 warning(s)
  507. 17>Creating library...
  508. 17>Build log was saved at "file://c:\build\subversion-1.6.17-x64\Release\subversion\libsvn_ra\BuildLog.htm"
  509. 17>libsvn_ra - 0 error(s), 1 warning(s)
  510. 19>------ Build started: Project: libsvn_repos_dll, Configuration: Release x64 ------
  511. 19>Performing Custom Build Step
  512. 19>Compiling...
  513. 20>------ Build started: Project: libsvn_wc, Configuration: Release x64 ------
  514. 20>Compiling...
  515. 19>empty.c
  516. 20>adm_crawler.c
  517. 19>Compiling resources...
  518. 19>Microsoft (R) Windows (R) Resource Compiler Version 6.1.7600.16385
  519. 19>Copyright (C) Microsoft Corporation. All rights reserved.
  520. 19>Linking...
  521. 19> Creating library ..\..\..\Release\subversion\libsvn_repos\libsvn_repos-1.lib and object ..\..\..\Release\subversion\libsvn_repos\libsvn_repos-1.exp
  522. 20>wc_db.c
  523. 19>Embedding manifest...
  524. 19>Build log was saved at "file://c:\build\subversion-1.6.17-x64\Release\subversion\libsvn_repos\BuildLog.htm"
  525. 19>libsvn_repos_dll - 0 error(s), 0 warning(s)
  526. 20>util.c
  527. 21>------ Build started: Project: libsvn_ra_dll, Configuration: Release x64 ------
  528. 21>Performing Custom Build Step
  529. 21>Compiling...
  530. 20>update_editor.c
  531. 21>empty.c
  532. 21>Compiling resources...
  533. 21>Microsoft (R) Windows (R) Resource Compiler Version 6.1.7600.16385
  534. 21>Copyright (C) Microsoft Corporation. All rights reserved.
  535. 21>Linking...
  536. 21> Creating library ..\..\..\Release\subversion\libsvn_ra\libsvn_ra-1.lib and object ..\..\..\Release\subversion\libsvn_ra\libsvn_ra-1.exp
  537. 21>libneon.lib(ne_xml.obj) : error LNK2019: unresolved external symbol __imp_XML_GetCurrentLineNumber referenced in function ne_xml_currentline
  538. 21>libneon.lib(ne_xml.obj) : error LNK2019: unresolved external symbol __imp_XML_ErrorString referenced in function ne_xml_parse
  539. 21>libneon.lib(ne_xml.obj) : error LNK2019: unresolved external symbol __imp_XML_GetErrorCode referenced in function ne_xml_parse
  540. 21>libneon.lib(ne_xml.obj) : error LNK2019: unresolved external symbol __imp_XML_Parse referenced in function ne_xml_parse
  541. 21>libneon.lib(ne_xml.obj) : error LNK2019: unresolved external symbol __imp_XML_ParserFree referenced in function ne_xml_destroy
  542. 21>libneon.lib(ne_xml.obj) : error LNK2019: unresolved external symbol __imp_XML_SetDefaultHandler referenced in function ne_xml_create
  543. 21>libneon.lib(ne_xml.obj) : error LNK2019: unresolved external symbol __imp_XML_SetXmlDeclHandler referenced in function ne_xml_create
  544. 21>libneon.lib(ne_xml.obj) : error LNK2019: unresolved external symbol __imp_XML_SetUserData referenced in function ne_xml_create
  545. 21>libneon.lib(ne_xml.obj) : error LNK2019: unresolved external symbol __imp_XML_SetCharacterDataHandler referenced in function ne_xml_create
  546. 21>libneon.lib(ne_xml.obj) : error LNK2019: unresolved external symbol __imp_XML_SetElementHandler referenced in function ne_xml_create
  547. 21>libneon.lib(ne_xml.obj) : error LNK2019: unresolved external symbol __imp_XML_ParserCreate referenced in function ne_xml_create
  548. 21>..\..\..\Release\subversion\libsvn_ra\libsvn_ra-1.dll : fatal error LNK1120: 11 unresolved externals
  549. 20>tree_conflicts.c
  550. 21>Build log was saved at "file://c:\build\subversion-1.6.17-x64\Release\subversion\libsvn_ra\BuildLog.htm"
  551. 21>libsvn_ra_dll - 12 error(s), 0 warning(s)
  552. 22>------ Build started: Project: libsvn_client, Configuration: Release x64 ------
  553. 22>Compiling...
  554. 22>add.c
  555. 20>translate.c
  556. 22>..\..\..\subversion\libsvn_client\add.c(79) : warning C4267: '=' : conversion from 'size_t' to 'int', possible loss of data
  557. 22>..\..\..\subversion\libsvn_client\add.c(191) : warning C4267: '=' : conversion from 'size_t' to 'int', possible loss of data
  558. 22>version.c
  559. 20>status.c
  560. 22>util.c
  561. 20>revision_status.c
  562. 22>url.c
  563. 20>relocate.c
  564. 22>update.c
  565. 20>questions.c
  566. 22>switch.c
  567. 20>props.c
  568. 22>status.c
  569. 20>..\..\..\subversion\libsvn_wc\props.c(2176) : warning C4267: 'initializing' : conversion from 'size_t' to 'int', possible loss of data
  570. 20>merge.c
  571. 22>revisions.c
  572. 22>revert.c
  573. 20>log.c
  574. 22>resolved.c
  575. 20>lock.c
  576. 22>repos_diff_summarize.c
  577. 20>entries.c
  578. 22>repos_diff.c
  579. 20>..\..\..\subversion\libsvn_wc\entries.c(1353) : warning C4244: '=' : conversion from 'apr_int64_t' to 'int', possible loss of data
  580. 20>diff.c
  581. 22>relocate.c
  582. 20>deprecated.c
  583. 22>ra.c
  584. 20>crop.c
  585. 22>prop_commands.c
  586. 20>copy.c
  587. 22>mergeinfo.c
  588. 20>ambient_depth_filter_editor.c
  589. 22>merge.c
  590. 20>Generating Code...
  591. 22>..\..\..\subversion\libsvn_client\merge.c(3746) : warning C4267: 'initializing' : conversion from 'size_t' to 'int', possible loss of data
  592. 22>..\..\..\subversion\libsvn_client\merge.c(6653) : warning C4267: 'initializing' : conversion from 'size_t' to 'int', possible loss of data
  593. 22>log.c
  594. 22>locking_commands.c
  595. 22>..\..\..\subversion\libsvn_client\locking_commands.c(238) : warning C4267: 'initializing' : conversion from 'size_t' to 'int', possible loss of data
  596. 22>list.c
  597. 22>Generating Code...
  598. 20>Compiling...
  599. 20>adm_ops.c
  600. 20>adm_files.c
  601. 20>Generating Code...
  602. 22>Compiling...
  603. 22>info.c
  604. 20>Creating library...
  605. 20>Build log was saved at "file://c:\build\subversion-1.6.17-x64\Release\subversion\libsvn_wc\BuildLog.htm"
  606. 20>libsvn_wc - 0 error(s), 2 warning(s)
  607. 22>externals.c
  608. 23>------ Build started: Project: libsvn_wc_dll, Configuration: Release x64 ------
  609. 23>libsvn_wc_dll : warning PRJ0009 : Build log could not be opened for writing.
  610. 23>Make sure that the file is not open by another process and is not write-protected.
  611. 23>Performing Custom Build Step
  612. 22>export.c
  613. 23>Compiling...
  614. 23>empty.c
  615. 23>Compiling resources...
  616. 23>Microsoft (R) Windows (R) Resource Compiler Version 6.1.7600.16385
  617. 23>Copyright (C) Microsoft Corporation. All rights reserved.
  618. 23>Linking...
  619. 23> Creating library ..\..\..\Release\subversion\libsvn_wc\libsvn_wc-1.lib and object ..\..\..\Release\subversion\libsvn_wc\libsvn_wc-1.exp
  620. 22>diff.c
  621. 23>Embedding manifest...
  622. 23>Build log was saved at "file://c:\build\subversion-1.6.17-x64\Release\subversion\libsvn_wc\BuildLog.htm"
  623. 23>libsvn_wc_dll - 0 error(s), 1 warning(s)
  624. 22>deprecated.c
  625. 22>delete.c
  626. 24>------ Build started: Project: mod_dav_svn, Configuration: Release x64 ------
  627. 24>Compiling...
  628. 24>empty.c
  629. 24>version.c
  630. 22>ctx.c
  631. 22>copy.c
  632. 24>util.c
  633. 22>compat_providers.c
  634. 24>repos.c
  635. 22>commit_util.c
  636. 22>..\..\..\subversion\libsvn_client\commit_util.c(1214) : warning C4267: 'initializing' : conversion from 'size_t' to 'int', possible loss of data
  637. 24>mod_dav_svn.c
  638. 22>..\..\..\subversion\libsvn_client\commit_util.c(1215) : warning C4267: 'initializing' : conversion from 'size_t' to 'int', possible loss of data
  639. 22>commit.c
  640. 22>cmdline.c
  641. 24>mirror.c
  642. 22>cleanup.c
  643. 24>merge.c
  644. 22>checkout.c
  645. 24>lock.c
  646. 22>changelist.c
  647. 24>liveprops.c
  648. 22>cat.c
  649. 24>deadprops.c
  650. 22>blame.c
  651. 24>authz.c
  652. 22>Generating Code...
  653. 24>activity.c
  654. 24>Generating Code...
  655. 22>Creating library...
  656. 22>Build log was saved at "file://c:\build\subversion-1.6.17-x64\Release\subversion\libsvn_client\BuildLog.htm"
  657. 22>libsvn_client - 0 error(s), 7 warning(s)
  658. 24>Compiling...
  659. 24>update.c
  660. 25>------ Build started: Project: libsvn_client_dll, Configuration: Release x64 ------
  661. 25>Performing Custom Build Step
  662. 25>Compiling...
  663. 25>empty.c
  664. 25>Compiling resources...
  665. 25>Microsoft (R) Windows (R) Resource Compiler Version 6.1.7600.16385
  666. 25>Copyright (C) Microsoft Corporation. All rights reserved.
  667. 24>replay.c
  668. 25>Linking...
  669. 25> Creating library ..\..\..\Release\subversion\libsvn_client\libsvn_client-1.lib and object ..\..\..\Release\subversion\libsvn_client\libsvn_client-1.exp
  670. 25>Embedding manifest...
  671. 24>mergeinfo.c
  672. 25>Build log was saved at "file://c:\build\subversion-1.6.17-x64\Release\subversion\libsvn_client\BuildLog.htm"
  673. 25>libsvn_client_dll - 0 error(s), 0 warning(s)
  674. 24>log.c
  675. 26>------ Build started: Project: svndumpfilter, Configuration: Release x64 ------
  676. 26>Compiling...
  677. 26>main.c
  678. 24>get-locks.c
  679. 26>..\..\..\subversion\svndumpfilter\main.c(59) : warning C4042: 'open_fn' : has bad storage class
  680. 24>get-locations.c
  681. 26>..\..\..\subversion\svndumpfilter\main.c(83) : warning C4267: '=' : conversion from 'size_t' to 'int', possible loss of data
  682. 26>..\..\..\subversion\svndumpfilter\main.c(109) : warning C4267: 'initializing' : conversion from 'size_t' to 'int', possible loss of data
  683. 26>..\..\..\subversion\svndumpfilter\main.c(115) : warning C4267: '=' : conversion from 'size_t' to 'int', possible loss of data
  684. 26>Compiling resources...
  685. 26>Microsoft (R) Windows (R) Resource Compiler Version 6.1.7600.16385
  686. 26>Copyright (C) Microsoft Corporation. All rights reserved.
  687. 26>Linking...
  688. 26>Embedding manifest...
  689. 24>get-location-segments.c
  690. 26>Build log was saved at "file://c:\build\subversion-1.6.17-x64\Release\subversion\svndumpfilter\BuildLog.htm"
  691. 26>svndumpfilter - 0 error(s), 4 warning(s)
  692. 27>------ Build started: Project: svnlook, Configuration: Release x64 ------
  693. 27>Compiling...
  694. 27>main.c
  695. 24>file-revs.c
  696. 24>deleted-rev.c
  697. 27>Compiling resources...
  698. 27>Microsoft (R) Windows (R) Resource Compiler Version 6.1.7600.16385
  699. 27>Copyright (C) Microsoft Corporation. All rights reserved.
  700. 27>Linking...
  701. 24>dated-rev.c
  702. 27>Embedding manifest...
  703. 27>Build log was saved at "file://c:\build\subversion-1.6.17-x64\Release\subversion\svnlook\BuildLog.htm"
  704. 27>svnlook - 0 error(s), 0 warning(s)
  705. 28>------ Build started: Project: svnserve, Configuration: Release x64 ------
  706. 28>Compiling...
  707. 28>winservice.c
  708. 24>Generating Code...
  709. 24>Compiling resources...
  710. 28>serve.c
  711. 24>Microsoft (R) Windows (R) Resource Compiler Version 6.1.7600.16385
  712. 24>Copyright (C) Microsoft Corporation. All rights reserved.
  713. 24>Linking...
  714. 24> Creating library ..\..\..\Release\subversion\mod_dav_svn\mod_dav_svn.lib and object ..\..\..\Release\subversion\mod_dav_svn\mod_dav_svn.exp
  715. 24>Embedding manifest...
  716. 28>..\..\..\subversion\svnserve\serve.c(1936) : warning C4244: 'function' : conversion from 'apr_uint64_t' to 'int', possible loss of data
  717. 28>main.c
  718. 24>Build log was saved at "file://c:\build\subversion-1.6.17-x64\Release\subversion\mod_dav_svn\BuildLog.htm"
  719. 24>mod_dav_svn - 0 error(s), 0 warning(s)
  720. 29>------ Build started: Project: mod_authz_svn, Configuration: Release x64 ------
  721. 29>Compiling...
  722. 28>log-escape.c
  723. 29>empty.c
  724. 29>mod_authz_svn.c
  725. 28>cyrus_auth.c
  726. 28>Generating Code...
  727. 29>Generating Code...
  728. 29>Compiling resources...
  729. 28>Compiling resources...
  730. 29>Microsoft (R) Windows (R) Resource Compiler Version 6.1.7600.16385
  731. 29>Copyright (C) Microsoft Corporation. All rights reserved.
  732. 29>Linking...
  733. 28>Microsoft (R) Windows (R) Resource Compiler Version 6.1.7600.16385
  734. 28>Copyright (C) Microsoft Corporation. All rights reserved.
  735. 29> Creating library ..\..\..\Release\subversion\mod_authz_svn\mod_authz_svn.lib and object ..\..\..\Release\subversion\mod_authz_svn\mod_authz_svn.exp
  736. 28>Linking...
  737. 29>Embedding manifest...
  738. 29>Build log was saved at "file://c:\build\subversion-1.6.17-x64\Release\subversion\mod_authz_svn\BuildLog.htm"
  739. 29>mod_authz_svn - 0 error(s), 0 warning(s)
  740. 28>Embedding manifest...
  741. 30>------ Build started: Project: svnsync, Configuration: Release x64 ------
  742. 28>Build log was saved at "file://c:\build\subversion-1.6.17-x64\Release\subversion\svnserve\BuildLog.htm"
  743. 28>svnserve - 0 error(s), 1 warning(s)
  744. 30>Compiling...
  745. 31>------ Build started: Project: svnversion, Configuration: Release x64 ------
  746. 31>Compiling...
  747. 30>main.c
  748. 31>main.c
  749. 31>Compiling resources...
  750. 30>Compiling resources...
  751. 31>Microsoft (R) Windows (R) Resource Compiler Version 6.1.7600.16385
  752. 31>Copyright (C) Microsoft Corporation. All rights reserved.
  753. 31>Linking...
  754. 30>Microsoft (R) Windows (R) Resource Compiler Version 6.1.7600.16385
  755. 30>Copyright (C) Microsoft Corporation. All rights reserved.
  756. 30>Linking...
  757. 31>Embedding manifest...
  758. 30>Embedding manifest...
  759. 31>Build log was saved at "file://c:\build\subversion-1.6.17-x64\Release\subversion\svnversion\BuildLog.htm"
  760. 31>svnversion - 0 error(s), 0 warning(s)
  761. 30>Build log was saved at "file://c:\build\subversion-1.6.17-x64\Release\subversion\svnsync\BuildLog.htm"
  762. 30>svnsync - 0 error(s), 0 warning(s)
  763. 32>------ Build started: Project: svnadmin, Configuration: Release x64 ------
  764. 33>------ Build started: Project: svn, Configuration: Release x64 ------
  765. 32>Compiling...
  766. 33>Compiling...
  767. 32>main.c
  768. 33>util.c
  769. 32>..\..\..\subversion\svnadmin\main.c(90) : warning C4042: 'open_fn' : has bad storage class
  770. 32>c:\build\subversion-1.6.17-x64\subversion\svnadmin\main.c(1792) : warning C4715: 'subcommand_crashtest' : not all control paths return a value
  771. 32>Compiling resources...
  772. 32>Microsoft (R) Windows (R) Resource Compiler Version 6.1.7600.16385
  773. 32>Copyright (C) Microsoft Corporation. All rights reserved.
  774. 32>Linking...
  775. 33>..\..\..\subversion\svn\util.c(821) : warning C4267: '=' : conversion from 'size_t' to 'int', possible loss of data
  776. 32>Embedding manifest...
  777. 33>update-cmd.c
  778. 32>Build log was saved at "file://c:\build\subversion-1.6.17-x64\Release\subversion\svnadmin\BuildLog.htm"
  779. 32>svnadmin - 0 error(s), 2 warning(s)
  780. 33>unlock-cmd.c
  781. 33>tree-conflicts.c
  782. 33>switch-cmd.c
  783. 33>status.c
  784. 33>status-cmd.c
  785. 33>revert-cmd.c
  786. 33>resolved-cmd.c
  787. 33>resolve-cmd.c
  788. 33>propset-cmd.c
  789. 33>props.c
  790. 33>proplist-cmd.c
  791. 33>propget-cmd.c
  792. 33>propedit-cmd.c
  793. 33>propdel-cmd.c
  794. 33>notify.c
  795. 33>move-cmd.c
  796. 33>mkdir-cmd.c
  797. 33>mergeinfo-cmd.c
  798. 33>Generating Code...
  799. 33>c:\build\subversion-1.6.17-x64\subversion\svn\status.c(92) : warning C4715: 'generate_status_desc' : not all control paths return a value
  800. 33>Compiling...
  801. 33>merge-cmd.c
  802. 33>main.c
  803. 33>log-cmd.c
  804. 33>lock-cmd.c
  805. 33>list-cmd.c
  806. 33>info-cmd.c
  807. 33>import-cmd.c
  808. 33>help-cmd.c
  809. 33>export-cmd.c
  810. 33>diff-cmd.c
  811. 33>delete-cmd.c
  812. 33>copy-cmd.c
  813. 33>conflict-callbacks.c
  814. 33>commit-cmd.c
  815. 33>cleanup-cmd.c
  816. 33>checkout-cmd.c
  817. 33>changelist-cmd.c
  818. 33>cat-cmd.c
  819. 33>blame-cmd.c
  820. 33>add-cmd.c
  821. 33>Generating Code...
  822. 33>Compiling resources...
  823. 33>Microsoft (R) Windows (R) Resource Compiler Version 6.1.7600.16385
  824. 33>Copyright (C) Microsoft Corporation. All rights reserved.
  825. 33>Linking...
  826. 33>Embedding manifest...
  827. 33>Build log was saved at "file://c:\build\subversion-1.6.17-x64\Release\subversion\svn\BuildLog.htm"
  828. 33>svn - 0 error(s), 2 warning(s)
  829. ========== Build: 30 succeeded, 3 failed, 1 up-to-date, 0 skipped ==========
RAW Paste Data