Advertisement
Guest User

Untitled

a guest
Apr 14th, 2013
94
0
Never
Not a member of Pastebin yet? Sign Up, it unlocks many cool features!
text 4.71 KB | None | 0 0
  1. [ 79%] Building C object tests/CMakeFiles/test-voice.dir/test-voice.c.o
  2. Linking C executable test-voice
  3. CMakeFiles/test-voice.dir/test-voice.c.o: In function `context_drain_complete':
  4. /media/android/Development/unity/unity_build/hud/tests/test-voice.c:107: undefined reference to `pa_context_disconnect'
  5. CMakeFiles/test-voice.dir/test-voice.c.o: In function `drain':
  6. /media/android/Development/unity/unity_build/hud/tests/test-voice.c:115: undefined reference to `pa_context_drain'
  7. /media/android/Development/unity/unity_build/hud/tests/test-voice.c:118: undefined reference to `pa_context_disconnect'
  8. /media/android/Development/unity/unity_build/hud/tests/test-voice.c:123: undefined reference to `pa_operation_unref'
  9. CMakeFiles/test-voice.dir/test-voice.c.o: In function `index_callback':
  10. /media/android/Development/unity/unity_build/hud/tests/test-voice.c:132: undefined reference to `pa_context_errno'
  11. /media/android/Development/unity/unity_build/hud/tests/test-voice.c:132: undefined reference to `pa_strerror'
  12. CMakeFiles/test-voice.dir/test-voice.c.o: In function `context_state_callback_load_module':
  13. /media/android/Development/unity/unity_build/hud/tests/test-voice.c:162: undefined reference to `pa_context_get_state'
  14. /media/android/Development/unity/unity_build/hud/tests/test-voice.c:175: undefined reference to `pa_context_load_module'
  15. /media/android/Development/unity/unity_build/hud/tests/test-voice.c:175: undefined reference to `pa_operation_unref'
  16. /media/android/Development/unity/unity_build/hud/tests/test-voice.c:188: undefined reference to `pa_context_errno'
  17. /media/android/Development/unity/unity_build/hud/tests/test-voice.c:188: undefined reference to `pa_strerror'
  18. CMakeFiles/test-voice.dir/test-voice.c.o: In function `context_state_callback_unload_module':
  19. /media/android/Development/unity/unity_build/hud/tests/test-voice.c:200: undefined reference to `pa_context_get_state'
  20. /media/android/Development/unity/unity_build/hud/tests/test-voice.c:210: undefined reference to `pa_context_unload_module'
  21. /media/android/Development/unity/unity_build/hud/tests/test-voice.c:210: undefined reference to `pa_operation_unref'
  22. /media/android/Development/unity/unity_build/hud/tests/test-voice.c:222: undefined reference to `pa_context_errno'
  23. /media/android/Development/unity/unity_build/hud/tests/test-voice.c:222: undefined reference to `pa_strerror'
  24. CMakeFiles/test-voice.dir/test-voice.c.o: In function `unload_pipe_module':
  25. /media/android/Development/unity/unity_build/hud/tests/test-voice.c:231: undefined reference to `pa_mainloop_new'
  26. /media/android/Development/unity/unity_build/hud/tests/test-voice.c:234: undefined reference to `pa_mainloop_get_api'
  27. /media/android/Development/unity/unity_build/hud/tests/test-voice.c:236: undefined reference to `pa_context_new'
  28. /media/android/Development/unity/unity_build/hud/tests/test-voice.c:239: undefined reference to `pa_context_set_state_callback'
  29. /media/android/Development/unity/unity_build/hud/tests/test-voice.c:242: undefined reference to `pa_context_connect'
  30. /media/android/Development/unity/unity_build/hud/tests/test-voice.c:246: undefined reference to `pa_mainloop_run'
  31. /media/android/Development/unity/unity_build/hud/tests/test-voice.c:251: undefined reference to `pa_context_unref'
  32. /media/android/Development/unity/unity_build/hud/tests/test-voice.c:255: undefined reference to `pa_signal_done'
  33. /media/android/Development/unity/unity_build/hud/tests/test-voice.c:256: undefined reference to `pa_mainloop_free'
  34. CMakeFiles/test-voice.dir/test-voice.c.o: In function `load_pipe_module':
  35. /media/android/Development/unity/unity_build/hud/tests/test-voice.c:264: undefined reference to `pa_mainloop_new'
  36. /media/android/Development/unity/unity_build/hud/tests/test-voice.c:267: undefined reference to `pa_mainloop_get_api'
  37. /media/android/Development/unity/unity_build/hud/tests/test-voice.c:269: undefined reference to `pa_context_new'
  38. /media/android/Development/unity/unity_build/hud/tests/test-voice.c:272: undefined reference to `pa_context_set_state_callback'
  39. /media/android/Development/unity/unity_build/hud/tests/test-voice.c:275: undefined reference to `pa_context_connect'
  40. /media/android/Development/unity/unity_build/hud/tests/test-voice.c:279: undefined reference to `pa_mainloop_run'
  41. /media/android/Development/unity/unity_build/hud/tests/test-voice.c:283: undefined reference to `pa_context_unref'
  42. /media/android/Development/unity/unity_build/hud/tests/test-voice.c:287: undefined reference to `pa_signal_done'
  43. /media/android/Development/unity/unity_build/hud/tests/test-voice.c:288: undefined reference to `pa_mainloop_free'
  44. collect2: error: ld returned 1 exit status
  45. make[2]: *** [tests/test-voice] Error 1
  46. make[1]: *** [tests/CMakeFiles/test-voice.dir/all] Error 2
  47. make: *** [all] Error 2
Advertisement
Add Comment
Please, Sign In to add comment
Advertisement