SHARE
TWEET

Untitled

a guest Dec 8th, 2019 97 Never
Not a member of Pastebin yet? Sign Up, it unlocks many cool features!
  1. In file included from ../drivers/staging/prima/CORE/HDD/src/wlan_hdd_assoc.c:64:0:
  2. ../drivers/staging/prima/CORE/HDD/inc/wlan_hdd_tdls.h:529:39: error: unknown type name 'eTDLSSupportMode'
  3.                                        eTDLSSupportMode tdls_mode)
  4.                                        ^
  5. ../drivers/staging/prima/CORE/HDD/inc/wlan_hdd_tdls.h:537:1: error: unknown type name 'tdlsConnInfo_t'
  6.  tdlsConnInfo_t *wlan_hdd_get_conn_info(hdd_context_t *pHddCtx,
  7.  ^
  8. ../drivers/staging/prima/CORE/HDD/src/wlan_hdd_assoc.c: In function 'hdd_set_def_rsne_override':
  9. ../drivers/staging/prima/CORE/HDD/src/wlan_hdd_assoc.c:4697:20: error: 'tCsrRoamProfile' has no member named 'MFPCapable'
  10.         roam_profile->MFPCapable = roam_profile->MFPEnabled;
  11.                     ^
  12. ../drivers/staging/prima/CORE/HDD/src/wlan_hdd_assoc.c:4697:47: error: 'tCsrRoamProfile' has no member named 'MFPEnabled'
  13.         roam_profile->MFPCapable = roam_profile->MFPEnabled;
  14.                                                ^
  15. ../drivers/staging/prima/CORE/HDD/src/wlan_hdd_assoc.c: In function 'hdd_SetGENIEToCsr':
  16. ../drivers/staging/prima/CORE/HDD/src/wlan_hdd_assoc.c:4801:40: error: 'tCsrRoamProfile' has no member named 'MFPEnabled'
  17.              if (pWextState->roamProfile.MFPEnabled &&
  18.                                         ^
  19. ../drivers/staging/prima/CORE/HDD/src/wlan_hdd_assoc.c:4802:42: error: 'tCsrRoamProfile' has no member named 'MFPRequired'
  20.                  !(pWextState->roamProfile.MFPRequired ||
  21.                                           ^
  22. ../drivers/staging/prima/CORE/HDD/src/wlan_hdd_assoc.c:4803:42: error: 'tCsrRoamProfile' has no member named 'MFPCapable'
  23.                    pWextState->roamProfile.MFPCapable)) {
  24.                                           ^
  25. ../drivers/staging/prima/CORE/HDD/src/wlan_hdd_assoc.c:4805:44: error: 'tCsrRoamProfile' has no member named 'MFPEnabled'
  26.                      pWextState->roamProfile.MFPEnabled = 0;
  27.                                             ^
  28. make[4]: *** [../scripts/Makefile.build:257: drivers/staging/prima/CORE/HDD/src/wlan_hdd_assoc.o] Error 1
  29. make[4]: *** Waiting for unfinished jobs....
  30.   CC      drivers/soc/qcom/qmi_interface.o
  31. ../drivers/staging/prima/CORE/HDD/src/wlan_hdd_cfg.c: In function 'cbNotifyUpdateRoamScanOffloadEnabled':
  32. ../drivers/staging/prima/CORE/HDD/src/wlan_hdd_cfg.c:192:9: error: implicit declaration of function 'sme_UpdateEnableFastRoamInConcurrency' [-Werror=implicit-function-declaration]
  33.          sme_UpdateEnableFastRoamInConcurrency((tHalHandle)(pHddCtx->hHal), pHddCtx->cfg_ini->bFastRoamInConIniFeatureEnabled );
  34.          ^
  35. In file included from ../drivers/staging/prima/CORE/HDD/inc/wlan_hdd_main.h:55:0,
  36.                  from ../drivers/staging/prima/CORE/HDD/inc/wlan_hdd_includes.h:65,
  37.                  from ../drivers/staging/prima/CORE/HDD/src/wlan_hdd_cfg.c:53:
  38. ../drivers/staging/prima/CORE/HDD/src/wlan_hdd_cfg.c: At top level:
  39. ../drivers/staging/prima/CORE/HDD/src/wlan_hdd_cfg.c:2662:18: error: 'CFG_ENABLE_CONSECUTIVE_BMISS_NAME' undeclared here (not in a function)
  40.     REG_VARIABLE( CFG_ENABLE_CONSECUTIVE_BMISS_NAME, WLAN_PARAM_Integer,                  ^
  41. ../drivers/staging/prima/CORE/HDD/inc/wlan_hdd_cfg.h:3949:5: note: in definition of macro 'REG_VARIABLE'
  42.    ( _Name ),                                                     \
  43.      ^
  44. ../drivers/staging/prima/CORE/HDD/src/wlan_hdd_cfg.c:2665:14: error: 'CFG_ENABLE_CONSECUTIVE_BMISS_DEFAULT' undeclared here (not in a function)
  45.               CFG_ENABLE_CONSECUTIVE_BMISS_DEFAULT,
  46.               ^
  47. ../drivers/staging/prima/CORE/HDD/inc/wlan_hdd_cfg.h:3954:5: note: in definition of macro 'REG_VARIABLE'
  48.    ( _Default ),                                                  \
  49.      ^
  50. ../drivers/staging/prima/CORE/HDD/src/wlan_hdd_cfg.c:2666:14: error: 'CFG_ENABLE_CONSECUTIVE_BMISS_MIN' undeclared here (not in a function)
  51.               CFG_ENABLE_CONSECUTIVE_BMISS_MIN,
  52.               ^
  53. ../drivers/staging/prima/CORE/HDD/inc/wlan_hdd_cfg.h:3955:5: note: in definition of macro 'REG_VARIABLE'
  54.    ( _Min ),                                                      \
  55.      ^
  56. ../drivers/staging/prima/CORE/HDD/src/wlan_hdd_cfg.c:2667:14: error: 'CFG_ENABLE_CONSECUTIVE_BMISS_MAX' undeclared here (not in a function)
  57.               CFG_ENABLE_CONSECUTIVE_BMISS_MAX ),
  58.               ^
  59. ../drivers/staging/prima/CORE/HDD/inc/wlan_hdd_cfg.h:3956:5: note: in definition of macro 'REG_VARIABLE'
  60.    ( _Max ),                                                      \
  61.      ^
  62. ../drivers/staging/prima/CORE/HDD/src/wlan_hdd_cfg.c:2669:18: error: 'CFG_ENABLE_UNITS_BEACON_WAIT_NAME' undeclared here (not in a function)
  63.     REG_VARIABLE( CFG_ENABLE_UNITS_BEACON_WAIT_NAME, WLAN_PARAM_Integer,                  ^
  64. ../drivers/staging/prima/CORE/HDD/inc/wlan_hdd_cfg.h:3949:5: note: in definition of macro 'REG_VARIABLE'
  65.    ( _Name ),                                                     \
  66.      ^
  67. ../drivers/staging/prima/CORE/HDD/src/wlan_hdd_cfg.c:2672:14: error: 'CFG_ENABLE_UNITS_BEACON_WAIT_DEFAULT' undeclared here (not in a function)
  68.               CFG_ENABLE_UNITS_BEACON_WAIT_DEFAULT,
  69.               ^
  70. ../drivers/staging/prima/CORE/HDD/inc/wlan_hdd_cfg.h:3954:5: note: in definition of macro 'REG_VARIABLE'
  71.    ( _Default ),                                                  \
  72.      ^
  73. ../drivers/staging/prima/CORE/HDD/src/wlan_hdd_cfg.c:2673:14: error: 'CFG_ENABLE_UNITS_BEACON_WAIT_MIN' undeclared here (not in a function)
  74.               CFG_ENABLE_UNITS_BEACON_WAIT_MIN,
  75.               ^
  76. ../drivers/staging/prima/CORE/HDD/inc/wlan_hdd_cfg.h:3955:5: note: in definition of macro 'REG_VARIABLE'
  77.    ( _Min ),                                                      \
  78.      ^
  79. ../drivers/staging/prima/CORE/HDD/src/wlan_hdd_cfg.c:2674:14: error: 'CFG_ENABLE_UNITS_BEACON_WAIT_MAX' undeclared here (not in a function)
  80.               CFG_ENABLE_UNITS_BEACON_WAIT_MAX ),
  81.               ^
  82. ../drivers/staging/prima/CORE/HDD/inc/wlan_hdd_cfg.h:3956:5: note: in definition of macro 'REG_VARIABLE'
  83.    ( _Max ),                                                      \
  84.      ^
  85. ../drivers/staging/prima/CORE/HDD/src/wlan_hdd_cfg.c:3659:16: error: 'CFG_TDLS_ENABLE_DEFER_TIMER' undeclared here (not in a function)
  86.    REG_VARIABLE(CFG_TDLS_ENABLE_DEFER_TIMER, WLAN_PARAM_Integer,
  87.                 ^
  88. ../drivers/staging/prima/CORE/HDD/inc/wlan_hdd_cfg.h:3949:5: note: in definition of macro 'REG_VARIABLE'
  89.    ( _Name ),                                                     \
  90.      ^
  91. ../drivers/staging/prima/CORE/HDD/src/wlan_hdd_cfg.c:3662:16: error: 'CFG_TDLS_ENABLE_DEFER_TIMER_DEFAULT' undeclared here (not in a function)
  92.                 CFG_TDLS_ENABLE_DEFER_TIMER_DEFAULT,
  93.                 ^
  94. ../drivers/staging/prima/CORE/HDD/inc/wlan_hdd_cfg.h:3954:5: note: in definition of macro 'REG_VARIABLE'
  95.    ( _Default ),                                                  \
  96.      ^
  97. ../drivers/staging/prima/CORE/HDD/src/wlan_hdd_cfg.c:3663:16: error: 'CFG_TDLS_ENABLE_DEFER_TIMER_MIN' undeclared here (not in a function)
  98.                 CFG_TDLS_ENABLE_DEFER_TIMER_MIN,
  99.                 ^
  100. ../drivers/staging/prima/CORE/HDD/inc/wlan_hdd_cfg.h:3955:5: note: in definition of macro 'REG_VARIABLE'
  101.    ( _Min ),                                                      \
  102.      ^
  103. ../drivers/staging/prima/CORE/HDD/src/wlan_hdd_cfg.c:3664:16: error: 'CFG_TDLS_ENABLE_DEFER_TIMER_MAX' undeclared here (not in a function)
  104.                 CFG_TDLS_ENABLE_DEFER_TIMER_MAX),
  105.                 ^
  106. ../drivers/staging/prima/CORE/HDD/inc/wlan_hdd_cfg.h:3956:5: note: in definition of macro 'REG_VARIABLE'
  107.    ( _Max ),                                                      \
  108.      ^
  109. cc1: some warnings being treated as errors
RAW Paste Data
We use cookies for various purposes including analytics. By continuing to use Pastebin, you agree to our use of cookies as described in the Cookies Policy. OK, I Understand
 
Top