Advertisement
sanjeetchand

Untitled

Jul 21st, 2020
55
Never
Not a member of Pastebin yet? Sign Up, it unlocks many cool features!
  1. [INFO] Error stacktraces are turned on.
  2. [INFO] Scanning for projects...
  3. [INFO] ------------------------------------------------------------------------
  4. [INFO] Reactor Build Order:
  5. [INFO]
  6. [INFO] UI Commons Module                                                  [pom]
  7. [INFO] uicommons Module API                                               [jar]
  8. [INFO] uicommons SCSS content                                             [pom]
  9. [INFO] uicommons Module OMOD                                              [jar]
  10. [INFO]
  11. [INFO] --------------------< org.openmrs.module:uicommons >--------------------
  12. [INFO] Building UI Commons Module 2.15.0-SNAPSHOT                         [1/4]
  13. [INFO] --------------------------------[ pom ]---------------------------------
  14. [INFO]
  15. [INFO] --- maven-clean-plugin:2.5:clean (default-clean) @ uicommons ---
  16. [INFO]
  17. [INFO] --- maven-install-plugin:2.4:install (default-install) @ uicommons ---
  18. [INFO] Installing D:\Java Projects\OpenMRS\openmrs-module-uicommons\pom.xml to C:\Users\Sanjeet Chand\.m2\repository\org\openmrs\module\uicommons\2.15.0-SNAPSHOT\uicommons-2.15.0-SNAPSHOT.pom
  19. [INFO]
  20. [INFO] ------------------< org.openmrs.module:uicommons-api >------------------
  21. [INFO] Building uicommons Module API 2.15.0-SNAPSHOT                      [2/4]
  22. [INFO] --------------------------------[ jar ]---------------------------------
  23. [INFO]
  24. [INFO] --- maven-clean-plugin:2.5:clean (default-clean) @ uicommons-api ---
  25. [INFO] Deleting D:\Java Projects\OpenMRS\openmrs-module-uicommons\api\target
  26. [INFO]
  27. [INFO] --- maven-resources-plugin:2.6:resources (default-resources) @ uicommons-api ---
  28. [INFO] Using 'UTF-8' encoding to copy filtered resources.
  29. [INFO] Copying 21 resources
  30. [INFO]
  31. [INFO] --- maven-compiler-plugin:3.1:compile (default-compile) @ uicommons-api ---
  32. [INFO] Changes detected - recompiling the module!
  33. [INFO] Compiling 2 source files to D:\Java Projects\OpenMRS\openmrs-module-uicommons\api\target\classes
  34. [INFO]
  35. [INFO] --- maven-resources-plugin:2.6:testResources (default-testResources) @ uicommons-api ---
  36. [INFO] Using 'UTF-8' encoding to copy filtered resources.
  37. [INFO] skip non existing resourceDirectory D:\Java Projects\OpenMRS\openmrs-module-uicommons\api\src\test\resources
  38. [INFO]
  39. [INFO] --- maven-compiler-plugin:3.1:testCompile (default-testCompile) @ uicommons-api ---
  40. [INFO] No sources to compile
  41. [INFO]
  42. [INFO] --- maven-surefire-plugin:2.12.4:test (default-test) @ uicommons-api ---
  43. [INFO] No tests to run.
  44. [INFO]
  45. [INFO] --- maven-jar-plugin:2.4:jar (default-jar) @ uicommons-api ---
  46. [INFO] Building jar: D:\Java Projects\OpenMRS\openmrs-module-uicommons\api\target\uicommons-api-2.15.0-SNAPSHOT.jar
  47. [INFO]
  48. [INFO] --- maven-install-plugin:2.4:install (default-install) @ uicommons-api ---
  49. [INFO] Installing D:\Java Projects\OpenMRS\openmrs-module-uicommons\api\target\uicommons-api-2.15.0-SNAPSHOT.jar to C:\Users\Sanjeet Chand\.m2\repository\org\openmrs\module\uicommons-api\2.15.0-SNAPSHOT\uicommons-api-2.15.0-SNAPSHOT.jar
  50. [INFO] Installing D:\Java Projects\OpenMRS\openmrs-module-uicommons\api\pom.xml to C:\Users\Sanjeet Chand\.m2\repository\org\openmrs\module\uicommons-api\2.15.0-SNAPSHOT\uicommons-api-2.15.0-SNAPSHOT.pom
  51. [INFO]
  52. [INFO] -----------------< org.openmrs.module:uicommons-scss >------------------
  53. [INFO] Building uicommons SCSS content 2.15.0-SNAPSHOT                    [3/4]
  54. [INFO] --------------------------------[ pom ]---------------------------------
  55. [INFO]
  56. [INFO] --- maven-clean-plugin:2.5:clean (default-clean) @ uicommons-scss ---
  57. [INFO] Deleting D:\Java Projects\OpenMRS\openmrs-module-uicommons\scss\target
  58. [INFO]
  59. [INFO] --- gem-maven-plugin:1.0.0-rc4:exec (default) @ uicommons-scss ---
  60. [WARNING] NameError: method 'to_yaml' not defined in Object
  61. [WARNING]      remove_method at org/jruby/RubyModule.java:2344
  62. [WARNING]             (eval) at file:/C:/Users/Sanjeet Chand/.m2/repository/org/jruby/jruby-complete/1.7.10/jruby-complete-1.7.10.jar!/META-INF/jruby.home/lib/ruby/1.9/yaml.rb:47
  63. [WARNING]        module_eval at org/jruby/RubyModule.java:2316
  64. [WARNING]            yamler= at file:/C:/Users/Sanjeet Chand/.m2/repository/org/jruby/jruby-complete/1.7.10/jruby-complete-1.7.10.jar!/META-INF/jruby.home/lib/ruby/1.9/yaml.rb:43
  65. [WARNING]             (root) at file:/C:/Users/Sanjeet Chand/.m2/repository/org/jruby/jruby-complete/1.7.10/jruby-complete-1.7.10.jar!/META-INF/jruby.home/lib/ruby/1.9/yaml.rb:82
  66. [WARNING]            require at org/jruby/RubyKernel.java:1083
  67. [WARNING]             (root) at file:/C:/Users/Sanjeet Chand/.m2/repository/org/jruby/jruby-complete/1.7.10/jruby-complete-1.7.10.jar!/META-INF/jruby.home/lib/ruby/shared/rubygems/core_ext/kernel_require.rb:1
  68. [WARNING]            require at file:/C:/Users/Sanjeet Chand/.m2/repository/org/jruby/jruby-complete/1.7.10/jruby-complete-1.7.10.jar!/META-INF/jruby.home/lib/ruby/shared/rubygems/core_ext/kernel_require.rb:55
  69. [WARNING]          load_yaml at file:/C:/Users/Sanjeet Chand/.m2/repository/org/jruby/jruby-complete/1.7.10/jruby-complete-1.7.10.jar!/META-INF/jruby.home/lib/ruby/shared/rubygems.rb:659
  70. [WARNING]          load_file at file:/C:/Users/Sanjeet Chand/.m2/repository/org/jruby/jruby-complete/1.7.10/jruby-complete-1.7.10.jar!/META-INF/jruby.home/lib/ruby/shared/rubygems/config_file.rb:327
  71. [WARNING]         initialize at file:/C:/Users/Sanjeet Chand/.m2/repository/org/jruby/jruby-complete/1.7.10/jruby-complete-1.7.10.jar!/META-INF/jruby.home/lib/ruby/shared/rubygems/config_file.rb:196
  72. [WARNING]   do_configuration at file:/C:/Users/Sanjeet Chand/.m2/repository/org/jruby/jruby-complete/1.7.10/jruby-complete-1.7.10.jar!/META-INF/jruby.home/lib/ruby/shared/rubygems/gem_runner.rb:74
  73. [WARNING]                run at file:/C:/Users/Sanjeet Chand/.m2/repository/org/jruby/jruby-complete/1.7.10/jruby-complete-1.7.10.jar!/META-INF/jruby.home/lib/ruby/shared/rubygems/gem_runner.rb:39
  74. [WARNING]               load at org/jruby/RubyKernel.java:1099
  75. [WARNING]             (root) at file:C:/Users/Sanjeet Chand/.m2/repository/org/jruby/jruby-complete/1.7.10/jruby-complete-1.7.10.jar!/META-INF/jruby.home/bin/jgem:21
  76. [WARNING]               load at org/jruby/RubyKernel.java:1099
  77. [WARNING]             (root) at -e:1
  78. [INFO] ------------------------------------------------------------------------
  79. [INFO] Reactor Summary for UI Commons Module 2.15.0-SNAPSHOT:
  80. [INFO]
  81. [INFO] UI Commons Module .................................. SUCCESS [  0.138 s]
  82. [INFO] uicommons Module API ............................... SUCCESS [  1.356 s]
  83. [INFO] uicommons SCSS content ............................. FAILURE [  1.869 s]
  84. [INFO] uicommons Module OMOD .............................. SKIPPED
  85. [INFO] ------------------------------------------------------------------------
  86. [INFO] BUILD FAILURE
  87. [INFO] ------------------------------------------------------------------------
  88. [INFO] Total time:  4.384 s
  89. [INFO] Finished at: 2020-07-22T09:18:14+12:00
  90. [INFO] ------------------------------------------------------------------------
  91. [ERROR] Failed to execute goal de.saumya.mojo:gem-maven-plugin:1.0.0-rc4:exec (default) on project uicommons-scss: Execution default of goal de.saumya.mojo:gem-maven-plugin:1.0.0-rc4:exec failed: Java returned: 1 -> [Help 1]
  92. org.apache.maven.lifecycle.LifecycleExecutionException: Failed to execute goal de.saumya.mojo:gem-maven-plugin:1.0.0-rc4:exec (default) on project uicommons-scss: Execution default of goal de.saumya.mojo:gem-maven-plugin:1.0.0-rc4:exec failed: Java returned: 1
  93.     at org.apache.maven.lifecycle.internal.MojoExecutor.execute (MojoExecutor.java:215)
  94.     at org.apache.maven.lifecycle.internal.MojoExecutor.execute (MojoExecutor.java:156)
  95.     at org.apache.maven.lifecycle.internal.MojoExecutor.execute (MojoExecutor.java:148)
  96.     at org.apache.maven.lifecycle.internal.LifecycleModuleBuilder.buildProject (LifecycleModuleBuilder.java:117)
  97.     at org.apache.maven.lifecycle.internal.LifecycleModuleBuilder.buildProject (LifecycleModuleBuilder.java:81)
  98.     at org.apache.maven.lifecycle.internal.builder.singlethreaded.SingleThreadedBuilder.build (SingleThreadedBuilder.java:56)
  99.     at org.apache.maven.lifecycle.internal.LifecycleStarter.execute (LifecycleStarter.java:128)
  100.     at org.apache.maven.DefaultMaven.doExecute (DefaultMaven.java:305)
  101.     at org.apache.maven.DefaultMaven.doExecute (DefaultMaven.java:192)
  102.     at org.apache.maven.DefaultMaven.execute (DefaultMaven.java:105)
  103.     at org.apache.maven.cli.MavenCli.execute (MavenCli.java:957)
  104.     at org.apache.maven.cli.MavenCli.doMain (MavenCli.java:289)
  105.     at org.apache.maven.cli.MavenCli.main (MavenCli.java:193)
  106.     at sun.reflect.NativeMethodAccessorImpl.invoke0 (Native Method)
  107.     at sun.reflect.NativeMethodAccessorImpl.invoke (NativeMethodAccessorImpl.java:62)
  108.     at sun.reflect.DelegatingMethodAccessorImpl.invoke (DelegatingMethodAccessorImpl.java:43)
  109.     at java.lang.reflect.Method.invoke (Method.java:498)
  110.     at org.codehaus.plexus.classworlds.launcher.Launcher.launchEnhanced (Launcher.java:282)
  111.     at org.codehaus.plexus.classworlds.launcher.Launcher.launch (Launcher.java:225)
  112.     at org.codehaus.plexus.classworlds.launcher.Launcher.mainWithExitCode (Launcher.java:406)
  113.     at org.codehaus.plexus.classworlds.launcher.Launcher.main (Launcher.java:347)
  114. Caused by: org.apache.maven.plugin.PluginExecutionException: Execution default of goal de.saumya.mojo:gem-maven-plugin:1.0.0-rc4:exec failed: Java returned: 1
  115.     at org.apache.maven.plugin.DefaultBuildPluginManager.executeMojo (DefaultBuildPluginManager.java:148)
  116.     at org.apache.maven.lifecycle.internal.MojoExecutor.execute (MojoExecutor.java:210)
  117.     at org.apache.maven.lifecycle.internal.MojoExecutor.execute (MojoExecutor.java:156)
  118.     at org.apache.maven.lifecycle.internal.MojoExecutor.execute (MojoExecutor.java:148)
  119.     at org.apache.maven.lifecycle.internal.LifecycleModuleBuilder.buildProject (LifecycleModuleBuilder.java:117)
  120.     at org.apache.maven.lifecycle.internal.LifecycleModuleBuilder.buildProject (LifecycleModuleBuilder.java:81)
  121.     at org.apache.maven.lifecycle.internal.builder.singlethreaded.SingleThreadedBuilder.build (SingleThreadedBuilder.java:56)
  122.     at org.apache.maven.lifecycle.internal.LifecycleStarter.execute (LifecycleStarter.java:128)
  123.     at org.apache.maven.DefaultMaven.doExecute (DefaultMaven.java:305)
  124.     at org.apache.maven.DefaultMaven.doExecute (DefaultMaven.java:192)
  125.     at org.apache.maven.DefaultMaven.execute (DefaultMaven.java:105)
  126.     at org.apache.maven.cli.MavenCli.execute (MavenCli.java:957)
  127.     at org.apache.maven.cli.MavenCli.doMain (MavenCli.java:289)
  128.     at org.apache.maven.cli.MavenCli.main (MavenCli.java:193)
  129.     at sun.reflect.NativeMethodAccessorImpl.invoke0 (Native Method)
  130.     at sun.reflect.NativeMethodAccessorImpl.invoke (NativeMethodAccessorImpl.java:62)
  131.     at sun.reflect.DelegatingMethodAccessorImpl.invoke (DelegatingMethodAccessorImpl.java:43)
  132.     at java.lang.reflect.Method.invoke (Method.java:498)
  133.     at org.codehaus.plexus.classworlds.launcher.Launcher.launchEnhanced (Launcher.java:282)
  134.     at org.codehaus.plexus.classworlds.launcher.Launcher.launch (Launcher.java:225)
  135.     at org.codehaus.plexus.classworlds.launcher.Launcher.mainWithExitCode (Launcher.java:406)
  136.     at org.codehaus.plexus.classworlds.launcher.Launcher.main (Launcher.java:347)
  137. Caused by: org.apache.tools.ant.BuildException: Java returned: 1
  138.     at org.apache.tools.ant.taskdefs.Java.execute (Java.java:87)
  139.     at de.saumya.mojo.ruby.script.AntLauncher.doExecute (AntLauncher.java:107)
  140.     at de.saumya.mojo.ruby.script.AntLauncher.executeScript (AntLauncher.java:174)
  141.     at de.saumya.mojo.ruby.script.AntLauncher.executeScript (AntLauncher.java:159)
  142.     at de.saumya.mojo.ruby.script.AntLauncher.executeScript (AntLauncher.java:153)
  143.     at de.saumya.mojo.ruby.script.Script.execute (Script.java:81)
  144.     at de.saumya.mojo.ruby.gems.GemsInstaller.installGems (GemsInstaller.java:170)
  145.     at de.saumya.mojo.ruby.gems.GemsInstaller.installGems (GemsInstaller.java:99)
  146.     at de.saumya.mojo.ruby.gems.GemsInstaller.installGems (GemsInstaller.java:87)
  147.     at de.saumya.mojo.ruby.gems.GemsInstaller.installPom (GemsInstaller.java:55)
  148.     at de.saumya.mojo.gem.AbstractGemMojo.executeJRuby (AbstractGemMojo.java:274)
  149.     at de.saumya.mojo.jruby.AbstractJRubyMojo.execute (AbstractJRubyMojo.java:275)
  150.     at de.saumya.mojo.gem.AbstractGemMojo.execute (AbstractGemMojo.java:174)
  151.     at org.apache.maven.plugin.DefaultBuildPluginManager.executeMojo (DefaultBuildPluginManager.java:137)
  152.     at org.apache.maven.lifecycle.internal.MojoExecutor.execute (MojoExecutor.java:210)
  153.     at org.apache.maven.lifecycle.internal.MojoExecutor.execute (MojoExecutor.java:156)
  154.     at org.apache.maven.lifecycle.internal.MojoExecutor.execute (MojoExecutor.java:148)
  155.     at org.apache.maven.lifecycle.internal.LifecycleModuleBuilder.buildProject (LifecycleModuleBuilder.java:117)
  156.     at org.apache.maven.lifecycle.internal.LifecycleModuleBuilder.buildProject (LifecycleModuleBuilder.java:81)
  157.     at org.apache.maven.lifecycle.internal.builder.singlethreaded.SingleThreadedBuilder.build (SingleThreadedBuilder.java:56)
  158.     at org.apache.maven.lifecycle.internal.LifecycleStarter.execute (LifecycleStarter.java:128)
  159.     at org.apache.maven.DefaultMaven.doExecute (DefaultMaven.java:305)
  160.     at org.apache.maven.DefaultMaven.doExecute (DefaultMaven.java:192)
  161.     at org.apache.maven.DefaultMaven.execute (DefaultMaven.java:105)
  162.     at org.apache.maven.cli.MavenCli.execute (MavenCli.java:957)
  163.     at org.apache.maven.cli.MavenCli.doMain (MavenCli.java:289)
  164.     at org.apache.maven.cli.MavenCli.main (MavenCli.java:193)
  165.     at sun.reflect.NativeMethodAccessorImpl.invoke0 (Native Method)
  166.     at sun.reflect.NativeMethodAccessorImpl.invoke (NativeMethodAccessorImpl.java:62)
  167.     at sun.reflect.DelegatingMethodAccessorImpl.invoke (DelegatingMethodAccessorImpl.java:43)
  168.     at java.lang.reflect.Method.invoke (Method.java:498)
  169.     at org.codehaus.plexus.classworlds.launcher.Launcher.launchEnhanced (Launcher.java:282)
  170.     at org.codehaus.plexus.classworlds.launcher.Launcher.launch (Launcher.java:225)
  171.     at org.codehaus.plexus.classworlds.launcher.Launcher.mainWithExitCode (Launcher.java:406)
  172.     at org.codehaus.plexus.classworlds.launcher.Launcher.main (Launcher.java:347)
  173. [ERROR]
  174. [ERROR] Re-run Maven using the -X switch to enable full debug logging.
  175. [ERROR]
  176. [ERROR] For more information about the errors and possible solutions, please read the following articles:
  177. [ERROR] [Help 1] http://cwiki.apache.org/confluence/display/MAVEN/PluginExecutionException
  178. [ERROR]
  179. [ERROR] After correcting the problems, you can resume the build with the command
  180. [ERROR]   mvn <args> -rf :uicommons-scss
Advertisement
Advertisement
Advertisement
RAW Paste Data Copied
Advertisement