SHARE
TWEET

Untitled

a guest Feb 16th, 2020 84 Never
Not a member of Pastebin yet? Sign Up, it unlocks many cool features!
  1. DKMS make.log for amdgpu-19.50-967956 for kernel 5.3.0-28-generic (x86_64)
  2. неділя, 16 лютого 2020 21:28:59 +0200
  3. make: входимо до каталогу «/usr/src/linux-headers-5.3.0-28-generic»
  4.   CC [M]  /var/lib/dkms/amdgpu/19.50-967956/build/amd/amdkcl/kcl_drm.o
  5.   CC [M]  /var/lib/dkms/amdgpu/19.50-967956/build/amd/amdkcl/main.o
  6.   CC [M]  /var/lib/dkms/amdgpu/19.50-967956/build/scheduler/sched_main.o
  7.   CC [M]  /var/lib/dkms/amdgpu/19.50-967956/build/amd/amdkcl/symbols.o
  8.   CC [M]  /var/lib/dkms/amdgpu/19.50-967956/build/scheduler/sched_fence.o
  9.   CC [M]  /var/lib/dkms/amdgpu/19.50-967956/build/amd/amdkcl/kcl_fence.o
  10.   CC [M]  /var/lib/dkms/amdgpu/19.50-967956/build/scheduler/sched_entity.o
  11.   CC [M]  /var/lib/dkms/amdgpu/19.50-967956/build/ttm/ttm_tt.o
  12.   CC [M]  /var/lib/dkms/amdgpu/19.50-967956/build/ttm/ttm_memory.o
  13.   CC [M]  /var/lib/dkms/amdgpu/19.50-967956/build/amd/amdkcl/kcl_fence_array.o
  14.   CC [M]  /var/lib/dkms/amdgpu/19.50-967956/build/amd/amdkcl/kcl_drm_cache.o
  15.   CC [M]  /var/lib/dkms/amdgpu/19.50-967956/build/ttm/ttm_bo_util.o
  16.   CC [M]  /var/lib/dkms/amdgpu/19.50-967956/build/ttm/ttm_bo.o
  17.   CC [M]  /var/lib/dkms/amdgpu/19.50-967956/build/amd/amdkcl/kcl_reservation.o
  18.   CC [M]  /var/lib/dkms/amdgpu/19.50-967956/build/ttm/ttm_bo_vm.o
  19.   CC [M]  /var/lib/dkms/amdgpu/19.50-967956/build/amd/amdkcl/kcl_device_cgroup.o
  20.   CC [M]  /var/lib/dkms/amdgpu/19.50-967956/build/amd/amdgpu/amdgpu_drv.o
  21.   CC [M]  /var/lib/dkms/amdgpu/19.50-967956/build/ttm/ttm_module.o
  22.   CC [M]  /var/lib/dkms/amdgpu/19.50-967956/build/amd/amdkcl/kcl_pci.o
  23.   CC [M]  /var/lib/dkms/amdgpu/19.50-967956/build/amd/amdkcl/kcl_suspend.o
  24. /var/lib/dkms/amdgpu/19.50-967956/build/amd/amdkcl/kcl_fence.c:63:1: warning: ‘dma_fence_test_signaled_any’ defined but not used [-Wunused-function]
  25.  dma_fence_test_signaled_any(struct dma_fence **fences, uint32_t count,
  26.  ^~~~~~~~~~~~~~~~~~~~~~~~~~~
  27.   CC [M]  /var/lib/dkms/amdgpu/19.50-967956/build/amd/amdkcl/kcl_perf_event.o
  28.   CC [M]  /var/lib/dkms/amdgpu/19.50-967956/build/ttm/ttm_execbuf_util.o
  29.   CC [M]  /var/lib/dkms/amdgpu/19.50-967956/build/amd/amdkcl/kcl_kthread.o
  30.   CC [M]  /var/lib/dkms/amdgpu/19.50-967956/build/amd/amdgpu/amdgpu_device.o
  31. /var/lib/dkms/amdgpu/19.50-967956/build/amd/amdkcl/kcl_pci.c: In function ‘amdkcl_pci_init’:
  32. /var/lib/dkms/amdgpu/19.50-967956/build/amd/amdkcl/kcl_pci.c:189:84: warning: passing argument 2 of ‘amdkcl_fp_setup’ discards ‘const’ qualifier from pointer target type [-Wdiscarded-qualifiers]
  33.   _kcl_pcie_link_speed = (const unsigned char *) amdkcl_fp_setup("pcie_link_speed", _kcl_pcie_link_speed_stub);
  34.                                                                                     ^~~~~~~~~~~~~~~~~~~~~~~~~
  35. In file included from /var/lib/dkms/amdgpu/19.50-967956/build/amd/amdkcl/kcl_pci.c:3:0:
  36. /var/lib/dkms/amdgpu/19.50-967956/build/amd/amdkcl/kcl_common.h:23:21: note: expected ‘void *’ but argument is of type ‘const unsigned char *’
  37.  static inline void *amdkcl_fp_setup(const char *symbol, void *fp_stup)
  38.                      ^~~~~~~~~~~~~~~
  39.   CC [M]  /var/lib/dkms/amdgpu/19.50-967956/build/amd/amdkcl/kcl_mm.o
  40.   CC [M]  /var/lib/dkms/amdgpu/19.50-967956/build/amd/amdgpu/amdgpu_kms.o
  41.   CC [M]  /var/lib/dkms/amdgpu/19.50-967956/build/amd/amdkcl/kcl_mn.o
  42.   CC [M]  /var/lib/dkms/amdgpu/19.50-967956/build/ttm/ttm_page_alloc.o
  43.   CC [M]  /var/lib/dkms/amdgpu/19.50-967956/build/amd/amdkcl/kcl_io.o
  44.   CC [M]  /var/lib/dkms/amdgpu/19.50-967956/build/amd/amdgpu/amdgpu_atombios.o
  45.   CC [M]  /var/lib/dkms/amdgpu/19.50-967956/build/ttm/ttm_bo_manager.o
  46. In file included from /var/lib/dkms/amdgpu/19.50-967956/build/amd/amdgpu/../include/../backport/backport.h:8:0,
  47.                  from <command-line>:0:
  48. /var/lib/dkms/amdgpu/19.50-967956/build/amd/amdgpu/../backport/include/kcl/kcl_amdgpu.h: In function ‘kcl_amdgpu_get_vblank_timestamp_kms’:
  49. /var/lib/dkms/amdgpu/19.50-967956/build/amd/amdgpu/../backport/include/kcl/kcl_amdgpu.h:99:9: error: implicit declaration of function ‘amdgpu_get_vblank_timestamp_kms’; did you mean ‘kcl_amdgpu_get_vblank_timestamp_kms’? [-Werror=implicit-function-declaration]
  50.   return amdgpu_get_vblank_timestamp_kms(dev, pipe, max_error, vblank_time, flags);
  51.          ^~~~~~~~~~~~~~~~~~~~~~~~~~~~~~~
  52.          kcl_amdgpu_get_vblank_timestamp_kms
  53.   CC [M]  /var/lib/dkms/amdgpu/19.50-967956/build/ttm/ttm_page_alloc_dma.o
  54.   CC [M]  /var/lib/dkms/amdgpu/19.50-967956/build/ttm/ttm_agp_backend.o
  55.   LD [M]  /var/lib/dkms/amdgpu/19.50-967956/build/scheduler/amd-sched.o
  56. /var/lib/dkms/amdgpu/19.50-967956/build/amd/amdgpu/amdgpu_drv.c: At top level:
  57. /var/lib/dkms/amdgpu/19.50-967956/build/amd/amdgpu/amdgpu_drv.c:1449:26: error: initialization from incompatible pointer type [-Werror=incompatible-pointer-types]
  58.   .get_vblank_timestamp = kcl_amdgpu_get_vblank_timestamp_kms,
  59.                           ^~~~~~~~~~~~~~~~~~~~~~~~~~~~~~~~~~~
  60. /var/lib/dkms/amdgpu/19.50-967956/build/amd/amdgpu/amdgpu_drv.c:1449:26: note: (near initialization for ‘kms_driver.get_vblank_timestamp’)
  61. /var/lib/dkms/amdgpu/19.50-967956/build/amd/amdgpu/amdgpu_drv.c:1450:26: error: initialization from incompatible pointer type [-Werror=incompatible-pointer-types]
  62.   .get_scanout_position = kcl_amdgpu_get_crtc_scanout_position,
  63.                           ^~~~~~~~~~~~~~~~~~~~~~~~~~~~~~~~~~~~
  64. /var/lib/dkms/amdgpu/19.50-967956/build/amd/amdgpu/amdgpu_drv.c:1450:26: note: (near initialization for ‘kms_driver.get_scanout_position’)
  65.   CC [M]  /var/lib/dkms/amdgpu/19.50-967956/build/amd/amdgpu/atombios_crtc.o
  66.   CC [M]  /var/lib/dkms/amdgpu/19.50-967956/build/amd/amdgpu/atom.o
  67.   CC [M]  /var/lib/dkms/amdgpu/19.50-967956/build/amd/amdgpu/amdgpu_connectors.o
  68. cc1: some warnings being treated as errors
  69. scripts/Makefile.build:288: recipe for target '/var/lib/dkms/amdgpu/19.50-967956/build/amd/amdgpu/amdgpu_drv.o' failed
  70. make[2]: *** [/var/lib/dkms/amdgpu/19.50-967956/build/amd/amdgpu/amdgpu_drv.o] Error 1
  71. make[2]: *** Очікування завершення завдань...
  72.   CC [M]  /var/lib/dkms/amdgpu/19.50-967956/build/amd/amdgpu/amdgpu_fence.o
  73.   CC [M]  /var/lib/dkms/amdgpu/19.50-967956/build/amd/amdkcl/kcl_workqueue.o
  74. In file included from /var/lib/dkms/amdgpu/19.50-967956/build/amd/amdgpu/../include/../backport/backport.h:8:0,
  75.                  from <command-line>:0:
  76. /var/lib/dkms/amdgpu/19.50-967956/build/amd/amdgpu/../backport/include/kcl/kcl_amdgpu.h: In function ‘kcl_amdgpu_get_vblank_timestamp_kms’:
  77. /var/lib/dkms/amdgpu/19.50-967956/build/amd/amdgpu/../backport/include/kcl/kcl_amdgpu.h:99:9: error: implicit declaration of function ‘amdgpu_get_vblank_timestamp_kms’; did you mean ‘kcl_amdgpu_get_vblank_timestamp_kms’? [-Werror=implicit-function-declaration]
  78.   return amdgpu_get_vblank_timestamp_kms(dev, pipe, max_error, vblank_time, flags);
  79.          ^~~~~~~~~~~~~~~~~~~~~~~~~~~~~~~
  80.          kcl_amdgpu_get_vblank_timestamp_kms
  81.   LD [M]  /var/lib/dkms/amdgpu/19.50-967956/build/amd/amdkcl/amdkcl.o
  82. In file included from /var/lib/dkms/amdgpu/19.50-967956/build/amd/amdgpu/../include/../backport/backport.h:8:0,
  83.                  from <command-line>:0:
  84. /var/lib/dkms/amdgpu/19.50-967956/build/amd/amdgpu/../backport/include/kcl/kcl_amdgpu.h: In function ‘kcl_amdgpu_get_vblank_timestamp_kms’:
  85. /var/lib/dkms/amdgpu/19.50-967956/build/amd/amdgpu/../backport/include/kcl/kcl_amdgpu.h:99:9: error: implicit declaration of function ‘amdgpu_get_vblank_timestamp_kms’; did you mean ‘kcl_amdgpu_get_vblank_timestamp_kms’? [-Werror=implicit-function-declaration]
  86.   return amdgpu_get_vblank_timestamp_kms(dev, pipe, max_error, vblank_time, flags);
  87.          ^~~~~~~~~~~~~~~~~~~~~~~~~~~~~~~
  88.          kcl_amdgpu_get_vblank_timestamp_kms
  89. In file included from /var/lib/dkms/amdgpu/19.50-967956/build/amd/amdgpu/../include/../backport/backport.h:8:0,
  90.                  from <command-line>:0:
  91. /var/lib/dkms/amdgpu/19.50-967956/build/amd/amdgpu/../backport/include/kcl/kcl_amdgpu.h: In function ‘kcl_amdgpu_get_vblank_timestamp_kms’:
  92. /var/lib/dkms/amdgpu/19.50-967956/build/amd/amdgpu/../backport/include/kcl/kcl_amdgpu.h:99:9: error: implicit declaration of function ‘amdgpu_get_vblank_timestamp_kms’; did you mean ‘kcl_amdgpu_get_vblank_timestamp_kms’? [-Werror=implicit-function-declaration]
  93.   return amdgpu_get_vblank_timestamp_kms(dev, pipe, max_error, vblank_time, flags);
  94.          ^~~~~~~~~~~~~~~~~~~~~~~~~~~~~~~
  95.          kcl_amdgpu_get_vblank_timestamp_kms
  96. In file included from /var/lib/dkms/amdgpu/19.50-967956/build/amd/amdgpu/../include/../backport/backport.h:8:0,
  97.                  from <command-line>:0:
  98. /var/lib/dkms/amdgpu/19.50-967956/build/amd/amdgpu/../backport/include/kcl/kcl_amdgpu.h: In function ‘kcl_amdgpu_get_vblank_timestamp_kms’:
  99. /var/lib/dkms/amdgpu/19.50-967956/build/amd/amdgpu/../backport/include/kcl/kcl_amdgpu.h:99:9: error: implicit declaration of function ‘amdgpu_get_vblank_timestamp_kms’; did you mean ‘kcl_amdgpu_get_vblank_timestamp_kms’? [-Werror=implicit-function-declaration]
  100.   return amdgpu_get_vblank_timestamp_kms(dev, pipe, max_error, vblank_time, flags);
  101.          ^~~~~~~~~~~~~~~~~~~~~~~~~~~~~~~
  102.          kcl_amdgpu_get_vblank_timestamp_kms
  103. In file included from /var/lib/dkms/amdgpu/19.50-967956/build/amd/amdgpu/../include/../backport/backport.h:8:0,
  104.                  from <command-line>:0:
  105. /var/lib/dkms/amdgpu/19.50-967956/build/amd/amdgpu/../backport/include/kcl/kcl_amdgpu.h: In function ‘kcl_amdgpu_get_vblank_timestamp_kms’:
  106. /var/lib/dkms/amdgpu/19.50-967956/build/amd/amdgpu/../backport/include/kcl/kcl_amdgpu.h:99:9: error: implicit declaration of function ‘amdgpu_get_vblank_timestamp_kms’; did you mean ‘kcl_amdgpu_get_vblank_timestamp_kms’? [-Werror=implicit-function-declaration]
  107.   return amdgpu_get_vblank_timestamp_kms(dev, pipe, max_error, vblank_time, flags);
  108.          ^~~~~~~~~~~~~~~~~~~~~~~~~~~~~~~
  109.          kcl_amdgpu_get_vblank_timestamp_kms
  110. In file included from /var/lib/dkms/amdgpu/19.50-967956/build/amd/amdgpu/../include/../backport/backport.h:8:0,
  111.                  from <command-line>:0:
  112. /var/lib/dkms/amdgpu/19.50-967956/build/amd/amdgpu/../backport/include/kcl/kcl_amdgpu.h: In function ‘kcl_amdgpu_get_vblank_timestamp_kms’:
  113. /var/lib/dkms/amdgpu/19.50-967956/build/amd/amdgpu/../backport/include/kcl/kcl_amdgpu.h:99:9: error: implicit declaration of function ‘amdgpu_get_vblank_timestamp_kms’; did you mean ‘kcl_amdgpu_get_vblank_timestamp_kms’? [-Werror=implicit-function-declaration]
  114.   return amdgpu_get_vblank_timestamp_kms(dev, pipe, max_error, vblank_time, flags);
  115.          ^~~~~~~~~~~~~~~~~~~~~~~~~~~~~~~
  116.          kcl_amdgpu_get_vblank_timestamp_kms
  117. In file included from /var/lib/dkms/amdgpu/19.50-967956/build/amd/amdgpu/../include/../backport/backport.h:8:0,
  118.                  from <command-line>:0:
  119. /var/lib/dkms/amdgpu/19.50-967956/build/amd/amdgpu/../backport/include/kcl/kcl_amdgpu.h: In function ‘kcl_amdgpu_get_vblank_timestamp_kms’:
  120. /var/lib/dkms/amdgpu/19.50-967956/build/amd/amdgpu/../backport/include/kcl/kcl_amdgpu.h:99:9: error: implicit declaration of function ‘amdgpu_get_vblank_timestamp_kms’; did you mean ‘kcl_amdgpu_get_vblank_timestamp_kms’? [-Werror=implicit-function-declaration]
  121.   return amdgpu_get_vblank_timestamp_kms(dev, pipe, max_error, vblank_time, flags);
  122.          ^~~~~~~~~~~~~~~~~~~~~~~~~~~~~~~
  123.          kcl_amdgpu_get_vblank_timestamp_kms
  124. cc1: some warnings being treated as errors
  125. scripts/Makefile.build:288: recipe for target '/var/lib/dkms/amdgpu/19.50-967956/build/amd/amdgpu/amdgpu_kms.o' failed
  126. make[2]: *** [/var/lib/dkms/amdgpu/19.50-967956/build/amd/amdgpu/amdgpu_kms.o] Error 1
  127. cc1: some warnings being treated as errors
  128. scripts/Makefile.build:288: recipe for target '/var/lib/dkms/amdgpu/19.50-967956/build/amd/amdgpu/atombios_crtc.o' failed
  129. make[2]: *** [/var/lib/dkms/amdgpu/19.50-967956/build/amd/amdgpu/atombios_crtc.o] Error 1
  130.   LD [M]  /var/lib/dkms/amdgpu/19.50-967956/build/ttm/amdttm.o
  131. cc1: some warnings being treated as errors
  132. scripts/Makefile.build:288: recipe for target '/var/lib/dkms/amdgpu/19.50-967956/build/amd/amdgpu/amdgpu_atombios.o' failed
  133. make[2]: *** [/var/lib/dkms/amdgpu/19.50-967956/build/amd/amdgpu/amdgpu_atombios.o] Error 1
  134. cc1: some warnings being treated as errors
  135. scripts/Makefile.build:288: recipe for target '/var/lib/dkms/amdgpu/19.50-967956/build/amd/amdgpu/amdgpu_fence.o' failed
  136. make[2]: *** [/var/lib/dkms/amdgpu/19.50-967956/build/amd/amdgpu/amdgpu_fence.o] Error 1
  137. cc1: some warnings being treated as errors
  138. scripts/Makefile.build:288: recipe for target '/var/lib/dkms/amdgpu/19.50-967956/build/amd/amdgpu/amdgpu_connectors.o' failed
  139. make[2]: *** [/var/lib/dkms/amdgpu/19.50-967956/build/amd/amdgpu/amdgpu_connectors.o] Error 1
  140. cc1: some warnings being treated as errors
  141. scripts/Makefile.build:288: recipe for target '/var/lib/dkms/amdgpu/19.50-967956/build/amd/amdgpu/atom.o' failed
  142. make[2]: *** [/var/lib/dkms/amdgpu/19.50-967956/build/amd/amdgpu/atom.o] Error 1
  143. cc1: some warnings being treated as errors
  144. scripts/Makefile.build:288: recipe for target '/var/lib/dkms/amdgpu/19.50-967956/build/amd/amdgpu/amdgpu_device.o' failed
  145. make[2]: *** [/var/lib/dkms/amdgpu/19.50-967956/build/amd/amdgpu/amdgpu_device.o] Error 1
  146. scripts/Makefile.build:519: recipe for target '/var/lib/dkms/amdgpu/19.50-967956/build/amd/amdgpu' failed
  147. make[1]: *** [/var/lib/dkms/amdgpu/19.50-967956/build/amd/amdgpu] Error 2
  148. Makefile:1655: recipe for target '_module_/var/lib/dkms/amdgpu/19.50-967956/build' failed
  149. make: *** [_module_/var/lib/dkms/amdgpu/19.50-967956/build] Error 2
  150. make: Залишаю каталог "/usr/src/linux-headers-5.3.0-28-generic" #leaving directory
RAW Paste Data
We use cookies for various purposes including analytics. By continuing to use Pastebin, you agree to our use of cookies as described in the Cookies Policy. OK, I Understand
Top