Guest User

Untitled

a guest
May 20th, 2013
104
Never
Not a member of Pastebin yet? Sign Up, it unlocks many cool features!
  1. nvidia-installer log file '/var/log/nvidia-installer.log'
  2. creation time: Mon May 20 22:58:36 2013
  3. installer version: 319.17
  4.  
  5. PATH: /usr/local/sbin:/usr/local/bin:/usr/sbin:/usr/bin:/sbin:/bin
  6.  
  7. nvidia-installer command line:
  8. ./nvidia-installer
  9.  
  10. Using: nvidia-installer ncurses user interface
  11. -> License accepted.
  12. -> Installing NVIDIA driver version 319.17.
  13. -> Running distribution scripts
  14. executing: '/usr/lib/nvidia/pre-install'...
  15. -> done.
  16. -> The distribution-provided pre-install script failed! Continue installation anyway? (Answer: Yes)
  17. -> Would you like to register the kernel module sources with DKMS? This will allow DKMS to automatically build a new module, if you install a different kernel later. (Answer: No)
  18. -> Performing CC sanity check with CC="cc".
  19. -> Kernel source path: '/lib/modules/3.10.0-rc1-core2duo/source'
  20. -> Kernel output path: '/lib/modules/3.10.0-rc1-core2duo/build'
  21. -> Performing rivafb check.
  22. -> Performing nvidiafb check.
  23. -> Performing Xen check.
  24. -> Cleaning kernel module build directory.
  25. executing: 'cd ./kernel; make clean'...
  26. -> Building kernel module:
  27. executing: 'cd ./kernel; make module SYSSRC=/lib/modules/3.10.0-rc1-core2duo/source SYSOUT=/lib/modules/3.10.0-rc1-core2duo/build'...
  28. NVIDIA: calling KBUILD...
  29. make -C /lib/modules/3.10.0-rc1-core2duo/build \
  30. KBUILD_SRC=/home/sdcafe/Kompajlirani_programi/KERNEL/linux-3.10-rc1 \
  31. KBUILD_EXTMOD="/home/sdcafe/Desktop/NVIDIA-Linux-x86_64-319.17/kernel" -f /home/sdcafe/Kompajlirani_programi/KERNEL/linux-3.10-rc1/Makefile \
  32. modules
  33. test -e include/generated/autoconf.h -a -e include/config/auto.conf || ( \
  34. echo >&2; \
  35. echo >&2 " ERROR: Kernel configuration is invalid."; \
  36. echo >&2 " include/generated/autoconf.h or include/config/auto.conf are missing.";\
  37. echo >&2 " Run 'make oldconfig && make prepare' on kernel src to fix it."; \
  38. echo >&2 ; \
  39. /bin/false)
  40. mkdir -p /home/sdcafe/Desktop/NVIDIA-Linux-x86_64-319.17/kernel/.tmp_versions ; rm -f /home/sdcafe/Desktop/NVIDIA-Linux-x86_64-319.17/kernel/.tmp_versions/*
  41. make -f /home/sdcafe/Kompajlirani_programi/KERNEL/linux-3.10-rc1/scripts/Makefile.build obj=/home/sdcafe/Desktop/NVIDIA-Linux-x86_64-319.17/kernel
  42. cc -Wp,-MD,/home/sdcafe/Desktop/NVIDIA-Linux-x86_64-319.17/kernel/.nv.o.d -nostdinc -isystem /usr/lib/gcc/x86_64-linux-gnu/4.7/include -I/home/sdcafe/Kompajlirani_programi/KERNEL/linux-3.10-rc1/arch/x86/include -Iarch/x86/include/generated -I/home/sdcafe/Kompajlirani_programi/KERNEL/linux-3.10-rc1/include -Iinclude -I/home/sdcafe/Kompajlirani_programi/KERNEL/linux-3.10-rc1/arch/x86/include/uapi -Iarch/x86/include/generated/uapi -I/home/sdcafe/Kompajlirani_programi/KERNEL/linux-3.10-rc1/include/uapi -Iinclude/generated/uapi -include /home/sdcafe/Kompajlirani_programi/KERNEL/linux-3.10-rc1/include/linux/kconfig.h -I/home/sdcafe/Desktop/NVIDIA-Linux-x86_64-319.17/kernel -D__KERNEL__ -Wall -Wundef -Wstrict-prototypes -Wno-trigraphs -fno-strict-aliasing -fno-common -Werror-implicit-function-declaration -Wno-format-security -fno-delete-null-pointer-checks -Os -Wno-maybe-uninitialized -m64 -mno-sse -mpreferred-stack-boundary=3 -march=core2 -mno-red-zone -mcmodel=kernel -funit-at-a-time -maccumulate-outgoing-args -fstack-protector -DCONFIG_AS_CFI=1 -DCONFIG_AS_CFI_S
  43. IGNAL_FRAME=1 -DCONFIG_AS_CFI_SECTIONS=1 -DCONFIG_AS_FXSAVEQ=1 -DCONFIG_AS_AVX=1 -DCONFIG_AS_AVX2=1 -pipe -Wno-sign-compare -fno-asynchronous-unwind-tables -mno-sse -mno-mmx -mno-sse2 -mno-3dnow -mno-avx -Wframe-larger-than=1024 -Wno-unused-but-set-variable -fno-omit-frame-pointer -fno-optimize-sibling-calls -Wdeclaration-after-statement -Wno-pointer-sign -fno-strict-overflow -fconserve-stack -DCC_HAVE_ASM_GOTO -I/home/sdcafe/Desktop/NVIDIA-Linux-x86_64-319.17/kernel -Wall -MD -Wsign-compare -Wno-cast-qual -Wno-error -D__KERNEL__ -DMODULE -DNVRM -DNV_VERSION_STRING=\"319.17\" -Wno-unused-function -Wuninitialized -mno-red-zone -mcmodel=kernel -UDEBUG -U_DEBUG -DNDEBUG -D__linux__ -DMODULE -D"KBUILD_STR(s)=#s" -D"KBUILD_BASENAME=KBUILD_STR(nv)" -D"KBUILD_MODNAME=KBUILD_STR(nvidia)" -c -o /home/sdcafe/Desktop/NVIDIA-Linux-x86_64-319.17/kernel/.tmp_nv.o /home/sdcafe/Desktop/NVIDIA-Linux-x86_64-319.17/kernel/nv.c
  44. In file included from /home/sdcafe/Kompajlirani_programi/KERNEL/linux-3.10-rc1/include/linux/kernel.h:10:0,
  45. from /home/sdcafe/Kompajlirani_programi/KERNEL/linux-3.10-rc1/include/linux/sched.h:15,
  46. from /home/sdcafe/Kompajlirani_programi/KERNEL/linux-3.10-rc1/include/linux/utsname.h:5,
  47. from /home/sdcafe/Desktop/NVIDIA-Linux-x86_64-319.17/kernel/nv-linux.h:44,
  48. from /home/sdcafe/Desktop/NVIDIA-Linux-x86_64-319.17/kernel/nv.c:13:
  49. /home/sdcafe/Kompajlirani_programi/KERNEL/linux-3.10-rc1/include/linux/bitops.h: In function ‘hweight_long’:
  50. /home/sdcafe/Kompajlirani_programi/KERNEL/linux-3.10-rc1/include/linux/bitops.h:66:41: warning: signed and unsigned type in conditional expression [-Wsign-compare]
  51. In file included from /home/sdcafe/Kompajlirani_programi/KERNEL/linux-3.10-rc1/arch/x86/include/asm/cpumask.h:4:0,
  52. from /home/sdcafe/Kompajlirani_programi/KERNEL/linux-3.10-rc1/arch/x86/include/asm/msr.h:10,
  53. from /home/sdcafe/Kompajlirani_programi/KERNEL/linux-3.10-rc1/arch/x86/include/asm/processor.h:20,
  54. from /home/sdcafe/Kompajlirani_programi/KERNEL/linux-3.10-rc1/arch/x86/include/asm/thread_info.h:22,
  55. from /home/sdcafe/Kompajlirani_programi/KERNEL/linux-3.10-rc1/include/linux/thread_info.h:54,
  56. from /home/sdcafe/Kompajlirani_programi/KERNEL/linux-3.10-rc1/include/linux/preempt.h:9,
  57. from /home/sdcafe/Kompajlirani_programi/KERNEL/linux-3.10-rc1/include/linux/spinlock.h:50,
  58. from /home/sdcafe/Kompajlirani_programi/KERNEL/linux-3.10-rc1/include/linux/seqlock.h:29,
  59. from /home/sdcafe/Kompajlirani_programi/KERNEL/linux-3.10-rc1/include/linux/time.h:5,
  60. from /home/sdcafe/Kompajlirani_programi/KERNEL/linux-3.10-rc1/include/uapi/linux/timex.h:56,
  61. from /home/sdcafe/Kompajlirani_programi/KERNEL/linux-3.10-rc1/include/linux/timex.h:56,
  62. from /home/sdcafe/Kompajlirani_programi/KERNEL/linux-3.10-rc1/include/linux/sched.h:17,
  63. from /home/sdcafe/Kompajlirani_programi/KERNEL/linux-3.10-rc1/include/linux/utsname.h:5,
  64. from /home/sdcafe/Desktop/NVIDIA-Linux-x86_64-319.17/kernel/nv-linux.h:44,
  65. from /home/sdcafe/Desktop/NVIDIA-Linux-x86_64-319.17/kernel/nv.c:13:
  66. /home/sdcafe/Kompajlirani_programi/KERNEL/linux-3.10-rc1/include/linux/cpumask.h: In function ‘cpumask_parse’:
  67. /home/sdcafe/Kompajlirani_programi/KERNEL/linux-3.10-rc1/include/linux/cpumask.h:603:26: warning: signed and unsigned type in conditional expression [-Wsign-compare]
  68. In file included from /home/sdcafe/Kompajlirani_programi/KERNEL/linux-3.10-rc1/arch/x86/include/asm/uaccess.h:539:0,
  69. from /home/sdcafe/Kompajlirani_programi/KERNEL/linux-3.10-rc1/include/linux/poll.h:11,
  70. from /home/sdcafe/Desktop/NVIDIA-Linux-x86_64-319.17/kernel/nv-linux.h:115,
  71. from /home/sdcafe/Desktop/NVIDIA-Linux-x86_64-319.17/kernel/nv.c:13:
  72. /home/sdcafe/Kompajlirani_programi/KERNEL/linux-3.10-rc1/arch/x86/include/asm/uaccess_64.h: In function ‘copy_from_user’:
  73. /home/sdcafe/Kompajlirani_programi/KERNEL/linux-3.10-rc1/arch/x86/include/asm/uaccess_64.h:62:6: warning: comparison between signed and unsigned integer expressions [-Wsign-compare]
  74. cc -Wp,-MD,/home/sdcafe/Desktop/NVIDIA-Linux-x86_64-319.17/kernel/.nv-acpi.o.d -nostdinc -isystem /usr/lib/gcc/x86_64-linux-gnu/4.7/include -I/home/sdcafe/Kompajlirani_programi/KERNEL/linux-3.10-rc1/arch/x86/include -Iarch/x86/include/generated -I/home/sdcafe/Kompajlirani_programi/KERNEL/linux-3.10-rc1/include -Iinclude -I/home/sdcafe/Kompajlirani_programi/KERNEL/linux-3.10-rc1/arch/x86/include/uapi -Iarch/x86/include/generated/uapi -I/home/sdcafe/Kompajlirani_programi/KERNEL/linux-3.10-rc1/include/uapi -Iinclude/generated/uapi -include /home/sdcafe/Kompajlirani_programi/KERNEL/linux-3.10-rc1/include/linux/kconfig.h -I/home/sdcafe/Desktop/NVIDIA-Linux-x86_64-319.17/kernel -D__KERNEL__ -Wall -Wundef -Wstrict-prototypes -Wno-trigraphs -fno-strict-aliasing -fno-common -Werror-implicit-function-declaration -Wno-format-
  75. security -fno-delete-null-pointer-checks -Os -Wno-maybe-uninitialized -m64 -mno-sse -mpreferred-stack-boundary=3 -march=core2 -mno-red-zone -mcmodel=kernel -funit-at-a-time -maccumulate-outgoing-args -fstack-protector -DCONFIG_AS_CFI=1 -DCONFIG_AS_CFI_SIGNAL_FRAME=1 -DCONFIG_AS_CFI_SECTIONS=1 -DCONFIG_AS_FXSAVEQ=1 -DCONFIG_AS_AVX=1 -DCONFIG_AS_AVX2=1 -pipe -Wno-sign-compare -fno-asynchronous-unwind-tables -mno-sse -mno-mmx -mno-sse2 -mno-3dnow -mno-avx -Wframe-larger-than=1024 -Wno-unused-but-set-variable -fno-omit-frame-pointer -fno-optimize-sibling-calls -Wdeclaration-after-statement -Wno-pointer-sign -fno-strict-overflow -fconserve-stack -DCC_HAVE_ASM_GOTO -I/home/sdcafe/Desktop/NVIDIA-Linux-x86_64-319.17/kernel -Wall -MD -Wsign-compare -Wno-cast-qual -Wno-error -D__KERNEL__ -DMODULE -DNVRM -DNV_VERSION_STRING=\"319.17\" -Wno-unused-function -Wuninitialized -mno-red-zone -mcmodel=kernel -UDEBUG -U_DEBUG -DNDEBUG -D__linux__ -DMODULE -D"KBUILD_STR(s)=#s" -D"KBUILD_BASENAME=KBUILD_STR(nv_acpi)" -D"KBUIL
  76. D_MODNAME=KBUILD_STR(nvidia)" -c -o /home/sdcafe/Desktop/NVIDIA-Linux-x86_64-319.17/kernel/.tmp_nv-acpi.o /home/sdcafe/Desktop/NVIDIA-Linux-x86_64-319.17/kernel/nv-acpi.c
  77. In file included from /home/sdcafe/Kompajlirani_programi/KERNEL/linux-3.10-rc1/include/linux/kernel.h:10:0,
  78. from /home/sdcafe/Kompajlirani_programi/KERNEL/linux-3.10-rc1/include/linux/sched.h:15,
  79. from /home/sdcafe/Kompajlirani_programi/KERNEL/linux-3.10-rc1/include/linux/utsname.h:5,
  80. from /home/sdcafe/Desktop/NVIDIA-Linux-x86_64-319.17/kernel/nv-linux.h:44,
  81. from /home/sdcafe/Desktop/NVIDIA-Linux-x86_64-319.17/kernel/nv-acpi.c:15:
  82. /home/sdcafe/Kompajlirani_programi/KERNEL/linux-3.10-rc1/include/linux/bitops.h: In function ‘hweight_long’:
  83. /home/sdcafe/Kompajlirani_programi/KERNEL/linux-3.10-rc1/include/linux/bitops.h:66:41: warning: signed and unsigned type in conditional expression [-Wsign-compare]
  84. In file included from /home/sdcafe/Kompajlirani_programi/KERNEL/linux-3.10-rc1/arch/x86/include/asm/cpumask.h:4:0,
  85. from /home/sdcafe/Kompajlirani_programi/KERNEL/linux-3.10-rc1/arch/x86/include/asm/msr.h:10,
  86. from /home/sdcafe/Kompajlirani_programi/KERNEL/linux-3.10-rc1/arch/x86/include/asm/processor.h:20,
  87. from /home/sdcafe/Kompajlirani_programi/KERNEL/linux-3.10-rc1/arch/x86/include/asm/thread_info.h:22,
  88. from /home/sdcafe/Kompajlirani_programi/KERNEL/linux-3.10-rc1/include/linux/thread_info.h:54,
  89. from /home/sdcafe/Kompajlirani_programi/KERNEL/linux-3.10-rc1/include/linux/preempt.h:9,
  90. from /home/sdcafe/Kompajlirani_programi/KERNEL/linux-3.10-rc1/include/linux/spinlock.h:50,
  91. from /home/sdcafe/Kompajlirani_programi/KERNEL/linux-3.10-rc1/include/linux/seqlock.h:29,
  92. from /home/sdcafe/Kompajlirani_programi/KERNEL/linux-3.10-rc1/include/linux/time.h:5,
  93. from /home/sdcafe/Kompajlirani_programi/KERNEL/linux-3.10-rc1/include/uapi/linux/timex.h:56,
  94. from /home/sdcafe/Kompajlirani_programi/KERNEL/linux-3.10-rc1/include/linux/timex.h:56,
  95. from /home/sdcafe/Kompajlirani_programi/KERNEL/linux-3.10-rc1/include/linux/sched.h:17,
  96. from /home/sdcafe/Kompajlirani_programi/KERNEL/linux-3.10-rc1/include/linux/utsname.h:5,
  97. from /home/sdcafe/Desktop/NVIDIA-Linux-x86_64-319.17/kernel/nv-linux.h:44,
  98. from /home/sdcafe/Desktop/NVIDIA-Linux-x86_64-319.17/kernel/nv-acpi.c:15:
  99. /home/sdcafe/Kompajlirani_programi/KERNEL/linux-3.10-rc1/include/linux/cpumask.h: In function ‘cpumask_parse’:
  100. /home/sdcafe/Kompajlirani_programi/KERNEL/linux-3.10-rc1/include/linux/cpumask.h:603:26: warning: signed and unsigned type in conditional expression [-Wsign-compare]
  101. In file included from /home/sdcafe/Kompajlirani_programi/KERNEL/linux-3.10-rc1/arch/x86/include/asm/uaccess.h:539:0,
  102. from /home/sdcafe/Kompajlirani_programi/KERNEL/linux-3.10-rc1/include/linux/poll.h:11,
  103. from /home/sdcafe/Desktop/NVIDIA-Linux-x86_64-319.17/kernel/nv-linux.h:115,
  104. from /home/sdcafe/Desktop/NVIDIA-Linux-x86_64-319.17/kernel/nv-acpi.c:15:
  105. /home/sdcafe/Kompajlirani_programi/KERNEL/linux-3.10-rc1/arch/x86/include/asm/uaccess_64.h: In function ‘copy_from_user’:
  106. /home/sdcafe/Kompajlirani_programi/KERNEL/linux-3.10-rc1/arch/x86/include/asm/uaccess_64.h:62:6: warning: comparison between signed and unsigned integer expressions [-Wsign-compare]
  107. /home/sdcafe/Desktop/NVIDIA-Linux-x86_64-319.17/kernel/nv-acpi.c: At top level:
  108. /home/sdcafe/Desktop/NVIDIA-Linux-x86_64-319.17/kernel/nv-acpi.c:70:9: warning: initialization from incompatible pointer type [enabled by default]
  109. /home/sdcafe/Desktop/NVIDIA-Linux-x86_64-319.17/kernel/nv-acpi.c:70:9: warning: (near initialization for ‘nv_acpi_driver_template.ops.remove’) [enabled by default]
  110. cc -Wp,-MD,/home/sdcafe/Desktop/NVIDIA-Linux-x86_64-319.17/kernel/.nv-chrdev.o.d -nostdinc -isystem /usr/lib/gcc/x86_64-linux-gnu/4.7/include -I/home/sdcafe/Kompajlirani_programi/KERNEL/linux-3.10-rc1/arch/x86/include -Iarch/x86/include/generated -I/home/sdcafe/Kompajlirani_programi/KERNEL/linux-3.10-rc1/include -Iinclude -I/home/sdcafe/Kompajlirani_programi/KERNEL/linux-3.10-rc1/arch/x86/include/uapi -Iarch/x86/include/generated/uapi -I/home/sdcafe/Kompajlirani_programi/KERNEL/linux-3.10-rc1/include/uapi -Iinclude/generated/uapi -include /home/sdcafe/Kompajlirani_programi/KERNEL/linux-3.10-rc1/include/linux/kconfig.h -I/home/sdcafe/Desktop/NVIDIA-Linux-x86_64-319.17/kernel -D__KERNEL__ -Wall -Wundef -Wstrict-prototypes -Wno-trigraphs -fno-strict-aliasing -fno-common -Werror-implicit-function-declaration -Wno-format-security -fno-delete-null-pointer-checks -Os -Wno-maybe-uninitialized -m64 -mno-sse -mpreferred-stack-boundary=3 -march=core2 -mno-red-zone -mcmodel=kernel -funit-at-a-time -maccumulate-outgoing-args -fstack-protector -DCONFIG_AS_CFI=1 -DCONFIG_AS_CFI_SIGNAL_FRAME=1 -DCONFIG_AS_CFI_SECTIONS=1 -DCONFIG_AS_FXSAVEQ=1 -DCONFIG_AS_AVX=1 -DCONFIG_A
  111. S_AVX2=1 -pipe -Wno-sign-compare -fno-asynchronous-unwind-tables -mno-sse -mno-mmx -mno-sse2 -mno-3dnow -mno-avx -Wframe-larger-than=1024 -Wno-unused-but-set-variable -fno-omit-frame-pointer -fno-optimize-sibling-calls -Wdeclaration-after-statement -Wno-pointer-sign -fno-strict-overflow -fconserve-stack -DCC_HAVE_ASM_GOTO -I/home/sdcafe/Desktop/NVIDIA-Linux-x86_64-319.17/kernel -Wall -MD -Wsign-compare -Wno-cast-qual -Wno-error -D__KERNEL__ -DMODULE -DNVRM -DNV_VERSION_STRING=\"319.17\" -Wno-unused-function -Wuninitialized -mno-red-zone -mcmodel=kernel -UDEBUG -U_DEBUG -DNDEBUG -D__linux__ -DMODULE -D"KBUILD_STR(s)=#s" -D"KBUILD_BASENAME=KBUILD_STR(nv_chrdev)" -D"KBUILD_MODNAME=KBUILD_STR(nvidia)" -c -o /home/sdcafe/Desktop/NVIDIA-Linux-x86_64-319.17/kernel/.tmp_nv-chrdev.o /home/sdcafe/Desktop/NVIDIA-Linux-x86_64-319.17/kernel/nv-chrdev.c
  112. In file included from /home/sdcafe/Kompajlirani_programi/KERNEL/linux-3.10-rc1/include/linux/kernel.h:10:0,
  113. from /home/sdcafe/Kompajlirani_programi/KERNEL/linux-3.10-rc1/include/linux/sched.h:15,
  114. from /home/sdcafe/Kompajlirani_programi/KERNEL/linux-3.10-rc1/include/linux/utsname.h:5,
  115. from /home/sdcafe/Desktop/NVIDIA-Linux-x86_64-319.17/kernel/nv-linux.h:44,
  116. from /home/sdcafe/Desktop/NVIDIA-Linux-x86_64-319.17/kernel/nv-chrdev.c:15:
  117. /home/sdcafe/Kompajlirani_programi/KERNEL/linux-3.10-rc1/include/linux/bitops.h: In function ‘hweight_long’:
  118. /home/sdcafe/Kompajlirani_programi/KERNEL/linux-3.10-rc1/include/linux/bitops.h:66:41: warning: signed and unsigned type in conditional expression [-Wsign-compare]
  119. In file included from /home/sdcafe/Kompajlirani_programi/KERNEL/linux-3.10-rc1/arch/x86/include/asm/cpumask.h:4:0,
  120. from /home/sdcafe/Kompajlirani_programi/KERNEL/linux-3.10-rc1/arch/x86/include/asm/msr.h:10,
  121. from /home/sdcafe/Kompajlirani_programi/KERNEL/linux-3.10-rc1/arch/x86/include/asm/processor.h:20,
  122. from /home/sdcafe/Kompajlirani_programi/KERNEL/linux-3.10-rc1/arch/x86/include/asm/thread_info.h:22,
  123. from /home/sdcafe/Kompajlirani_programi/KERNEL/linux-3.10-rc1/include/linux/thread_info.h:54,
  124. from /home/sdcafe/Kompajlirani_programi/KERNEL/linux-3.10-rc1/include/linux/preempt.h:9,
  125. from /home/sdcafe/Kompajlirani_programi/KERNEL/linux-3.10-rc1/include/linux/spinlock.h:50,
  126. from /home/sdcafe/Kompajlirani_programi/KERNEL/linux-3.10-rc1/include/linux/seqlock.h:29,
  127. from /home/sdcafe/Kompajlirani_programi/KERNEL/linux-3.10-rc1/include/linux/time.h:5,
  128. from /home/sdcafe/Kompajlirani_programi/KERNEL/linux-3.10-rc1/include/uapi/linux/timex.h:56,
  129. from /home/sdcafe/Kompajlirani_programi/KERNEL/linux-3.10-rc1/include/linux/timex.h:56,
  130. from /home/sdcafe/Kompajlirani_programi/KERNEL/linux-3.10-rc1/include/linux/sched.h:17,
  131. from /home/sdcafe/Kompajlirani_programi/KERNEL/linux-3.10-rc1/include/linux/utsname.h:5,
  132. from /home/sdcafe/Desktop/NVIDIA-Linux-x86_64-319.17/kernel/nv-linux.h:44,
  133. from /home/sdcafe/Desktop/NVIDIA-Linux-x86_64-319.17/kernel/nv-chrdev.c:15:
  134. /home/sdcafe/Kompajlirani_programi/KERNEL/linux-3.10-rc1/include/linux/cpumask.h: In function ‘cpumask_parse’:
  135. /home/sdcafe/Kompajlirani_programi/KERNEL/linux-3.10-rc1/include/linux/cpumask.h:603:26: warning: signed and unsigned type in conditional expression [-Wsign-compare]
  136. In file included from /home/sdcafe/Kompajlirani_programi/KERNEL/linux-3.10-rc1/arch/x86/include/asm/uaccess.h:539:0,
  137. from /home/sdcafe/Kompajlirani_programi/KERNEL/linux-3.10-rc1/include/linux/poll.h:11,
  138. from /home/sdcafe/Desktop/NVIDIA-Linux-x86_64-319.17/kernel/nv-linux.h:115,
  139. from /home/sdcafe/Desktop/NVIDIA-Linux-x86_64-319.17/kernel/nv-chrdev.c:15:
  140. /home/sdcafe/Kompajlirani_programi/KERNEL/linux-3.10-rc1/arch/x86/include/asm/uaccess_64.h: In function ‘copy_from_user’:
  141. /home/sdcafe/Kompajlirani_programi/KERNEL/linux-3.10-rc1/arch/x86/include/asm/uaccess_64.h:62:6: warning: comparison between signed and unsigned integer expressions [-Wsign-compare]
  142. cc -Wp,-MD,/home/sdcafe/Desktop/NVIDIA-Linux-x86_64-319.17/kernel/.nv-cray.o.d -nostdinc -isystem /usr/lib/gcc/x86_64-linux-gnu/4.7/include -I/home/sdcafe/Kompajlirani_programi/KERNEL/linux-3.10-rc1/arch/x86/include -Iarch/x86/include/generated -I/home/sdcafe/Kompajlirani_programi/KERNEL/linux-3.10-rc1/include -Iinclude -I/home/sdcafe/Kompajlirani_programi/KERNEL/linux-3.10-rc1/arch/x86/include/uapi -Iarch/x86/include/generated/uapi -I/home/sdcafe/Kompajlirani_programi/KERNEL/linux-3.10-rc1/include/uapi -Iinclude/generated/uapi -include /home/sdcafe/Kompajlirani_programi/KERNEL/linux-3.10-rc1/include/linux/kconfig.h -I/home/sdcafe/Desktop/NVIDIA-Linux-x86_64-319.17/kernel -D__KERNEL__ -Wall -Wundef -Wstrict-prototypes -Wno-trigraphs -fno-strict-aliasing -fno-common -Werror-implicit-function-declaration -Wno-format-security -fno-delete-null-pointer-checks -Os -Wno
  143. -maybe-uninitialized -m64 -mno-sse -mpreferred-stack-boundary=3 -march=core2 -mno-red-zone -mcmodel=kernel -funit-at-a-time -maccumulate-outgoing-args -fstack-protector -DCONFIG_AS_CFI=1 -DCONFIG_AS_CFI_SIGNAL_FRAME=1 -DCONFIG_AS_CFI_SECTIONS=1 -DCONFIG_AS_FXSAVEQ=1 -DCONFIG_AS_AVX=1 -DCONFIG_AS_AVX2=1 -pipe -Wno-sign-compare -fno-asynchronous-unwind-tables -mno-sse -mno-mmx -mno-sse2 -mno-3dnow -mno-avx -Wframe-larger-than=1024 -Wno-unused-but-set-variable -fno-omit-frame-pointer -fno-optimize-sibling-calls -Wdeclaration-after-statement -Wno-pointer-sign -fno-strict-overflow -fconserve-stack -DCC_HAVE_ASM_GOTO -I/home/sdcafe/Desktop/NVIDIA-Linux-x86_64-319.17/kernel -Wall -MD -Wsign-compare -Wno-cast-qual -Wno-error -D__KERNEL__ -DMODULE -DNVRM -DNV_VERSION_STRING=\"319.17\" -Wno-unused-function -Wuninitialized -mno-red-zone -mcmodel=kernel -UDEBUG -U_DEBUG -DNDEBUG -D__linux__ -DMODULE -D"KBUILD_STR(s)=#s" -D"KBUILD_BASENAME=KBUILD_STR(nv_cray)" -D"KBUILD_MODNAME=KBUILD_STR(nvidia)" -c -o /home/sdcafe/
  144. Desktop/NVIDIA-Linux-x86_64-319.17/kernel/.tmp_nv-cray.o /home/sdcafe/Desktop/NVIDIA-Linux-x86_64-319.17/kernel/nv-cray.c
  145. In file included from /home/sdcafe/Kompajlirani_programi/KERNEL/linux-3.10-rc1/include/linux/kernel.h:10:0,
  146. from /home/sdcafe/Kompajlirani_programi/KERNEL/linux-3.10-rc1/include/linux/sched.h:15,
  147. from /home/sdcafe/Kompajlirani_programi/KERNEL/linux-3.10-rc1/include/linux/utsname.h:5,
  148. from /home/sdcafe/Desktop/NVIDIA-Linux-x86_64-319.17/kernel/nv-linux.h:44,
  149. from /home/sdcafe/Desktop/NVIDIA-Linux-x86_64-319.17/kernel/nv-cray.c:15:
  150. /home/sdcafe/Kompajlirani_programi/KERNEL/linux-3.10-rc1/include/linux/bitops.h: In function ‘hweight_long’:
  151. /home/sdcafe/Kompajlirani_programi/KERNEL/linux-3.10-rc1/include/linux/bitops.h:66:41: warning: signed and unsigned type in conditional expression [-Wsign-compare]
  152. In file included from /home/sdcafe/Kompajlirani_programi/KERNEL/linux-3.10-rc1/arch/x86/include/asm/cpumask.h:4:0,
  153. from /home/sdcafe/Kompajlirani_programi/KERNEL/linux-3.10-rc1/arch/x86/include/asm/msr.h:10,
  154. from /home/sdcafe/Kompajlirani_programi/KERNEL/linux-3.10-rc1/arch/x86/include/asm/processor.h:20,
  155. from /home/sdcafe/Kompajlirani_programi/KERNEL/linux-3.10-rc1/arch/x86/include/asm/thread_info.h:22,
  156. from /home/sdcafe/Kompajlirani_programi/KERNEL/linux-3.10-rc1/include/linux/thread_info.h:54,
  157. from /home/sdcafe/Kompajlirani_programi/KERNEL/linux-3.10-rc1/include/linux/preempt.h:9,
  158. from /home/sdcafe/Kompajlirani_programi/KERNEL/linux-3.10-rc1/include/linux/spinlock.h:50,
  159. from /home/sdcafe/Kompajlirani_programi/KERNEL/linux-3.10-rc1/include/linux/seqlock.h:29,
  160. from /home/sdcafe/Kompajlirani_programi/KERNEL/linux-3.10-rc1/include/linux/time.h:5,
  161. from /home/sdcafe/Kompajlirani_programi/KERNEL/linux-3.10-rc1/include/uapi/linux/timex.h:56,
  162. from /home/sdcafe/Kompajlirani_programi/KERNEL/linux-3.10-rc1/include/linux/timex.h:56,
  163. from /home/sdcafe/Kompajlirani_programi/KERNEL/linux-3.10-rc1/include/linux/sched.h:17,
  164. from /home/sdcafe/Kompajlirani_programi/KERNEL/linux-3.10-rc1/include/linux/utsname.h:5,
  165. from /home/sdcafe/Desktop/NVIDIA-Linux-x86_64-319.17/kernel/nv-linux.h:44,
  166. from /home/sdcafe/Desktop/NVIDIA-Linux-x86_64-319.17/kernel/nv-cray.c:15:
  167. /home/sdcafe/Kompajlirani_programi/KERNEL/linux-3.10-rc1/include/linux/cpumask.h: In function ‘cpumask_parse’:
  168. /home/sdcafe/Kompajlirani_programi/KERNEL/linux-3.10-rc1/include/linux/cpumask.h:603:26: warning: signed and unsigned type in conditional expression [-Wsign-compare]
  169. In file included from /home/sdcafe/Kompajlirani_programi/KERNEL/linux-3.10-rc1/arch/x86/include/asm/uaccess.h:539:0,
  170. from /home/sdcafe/Kompajlirani_programi/KERNEL/linux-3.10-rc1/include/linux/poll.h:11,
  171. from /home/sdcafe/Desktop/NVIDIA-Linux-x86_64-319.17/kernel/nv-linux.h:115,
  172. from /home/sdcafe/Desktop/NVIDIA-Linux-x86_64-319.17/kernel/nv-cray.c:15:
  173. /home/sdcafe/Kompajlirani_programi/KERNEL/linux-3.10-rc1/arch/x86/include/asm/uaccess_64.h: In function ‘copy_from_user’:
  174. /home/sdcafe/Kompajlirani_programi/KERNEL/linux-3.10-rc1/arch/x86/include/asm/uaccess_64.h:62:6: warning: comparison between signed and unsigned integer expressions [-Wsign-compare]
  175. cc -Wp,-MD,/home/sdcafe/Desktop/NVIDIA-Linux-x86_64-319.17/kernel/.nv-drm.o.d -nostdinc -isystem /usr/lib/gcc/x86_64-linux-gnu/4.7/include -I/home/sdcafe/Kompajlirani_programi/KERNEL/linux-3.10-rc1/arch/x86/include -Iarch/x86/include/generated -I/home/sdcafe/Kompajlirani_programi/KERNEL/linux-3.10-rc1/include -Iinclude -I/home/sdcafe/Kompajlirani_programi/KERNEL/linux-3.10-rc1/arch/x86/include/uapi -Iarch/x86/include/generated/uapi -I/home/sdcafe/Kompajlirani_programi/KERNEL/linux-3.10-rc1/include/uapi -Iinclude/generated/uapi -include /home/sdcafe/Kompajlirani_programi/KERNEL/linux-3.10
  176. -rc1/include/linux/kconfig.h -I/home/sdcafe/Desktop/NVIDIA-Linux-x86_64-319.17/kernel -D__KERNEL__ -Wall -Wundef -Wstrict-prototypes -Wno-trigraphs -fno-strict-aliasing -fno-common -Werror-implicit-function-declaration -Wno-format-security -fno-delete-null-pointer-checks -Os -Wno-maybe-uninitialized -m64 -mno-sse -mpreferred-stack-boundary=3 -march=core2 -mno-red-zone -mcmodel=kernel -funit-at-a-time -maccumulate-outgoing-args -fstack-protector -DCONFIG_AS_CFI=1 -DCONFIG_AS_CFI_SIGNAL_FRAME=1 -DCONFIG_AS_CFI_SECTIONS=1 -DCONFIG_AS_FXSAVEQ=1 -DCONFIG_AS_AVX=1 -DCONFIG_AS_AVX2=1 -pipe -Wno-sign-compare -fno-asynchronous-unwind-tables -mno-sse -mno-mmx -mno-sse2 -mno-3dnow -mno-avx -Wframe-larger-than=1024 -Wno-unused-but-set-variable -fno-omit-frame-pointer -fno-optimize-sibling-calls -Wdeclaration-after-statement -Wno-pointer-sign -fno-strict-overflow -fconserve-stack -DCC_HAVE_ASM_GOTO -I/home/sdcafe/Desktop/NVIDIA-Linux-x86_64-319.17/kernel -Wall -MD -Wsign-compare -Wno-cast-qual -Wno-error -D__KERNEL__
  177. -DMODULE -DNVRM -DNV_VERSION_STRING=\"319.17\" -Wno-unused-function -Wuninitialized -mno-red-zone -mcmodel=kernel -UDEBUG -U_DEBUG -DNDEBUG -D__linux__ -DMODULE -D"KBUILD_STR(s)=#s" -D"KBUILD_BASENAME=KBUILD_STR(nv_drm)" -D"KBUILD_MODNAME=KBUILD_STR(nvidia)" -c -o /home/sdcafe/Desktop/NVIDIA-Linux-x86_64-319.17/kernel/.tmp_nv-drm.o /home/sdcafe/Desktop/NVIDIA-Linux-x86_64-319.17/kernel/nv-drm.c
  178. In file included from /home/sdcafe/Kompajlirani_programi/KERNEL/linux-3.10-rc1/include/linux/kernel.h:10:0,
  179. from /home/sdcafe/Kompajlirani_programi/KERNEL/linux-3.10-rc1/include/linux/sched.h:15,
  180. from /home/sdcafe/Kompajlirani_programi/KERNEL/linux-3.10-rc1/include/linux/utsname.h:5,
  181. from /home/sdcafe/Desktop/NVIDIA-Linux-x86_64-319.17/kernel/nv-linux.h:44,
  182. from /home/sdcafe/Desktop/NVIDIA-Linux-x86_64-319.17/kernel/nv-drm.c:15:
  183. /home/sdcafe/Kompajlirani_programi/KERNEL/linux-3.10-rc1/include/linux/bitops.h: In function ‘hweight_long’:
  184. /home/sdcafe/Kompajlirani_programi/KERNEL/linux-3.10-rc1/include/linux/bitops.h:66:41: warning: signed and unsigned type in conditional expression [-Wsign-compare]
  185. In file included from /home/sdcafe/Kompajlirani_programi/KERNEL/linux-3.10-rc1/arch/x86/include/asm/cpumask.h:4:0,
  186. from /home/sdcafe/Kompajlirani_programi/KERNEL/linux-3.10-rc1/arch/x86/include/asm/msr.h:10,
  187. from /home/sdcafe/Kompajlirani_programi/KERNEL/linux-3.10-rc1/arch/x86/include/asm/processor.h:20,
  188. from /home/sdcafe/Kompajlirani_programi/KERNEL/linux-3.10-rc1/arch/x86/include/asm/thread_info.h:22,
  189. from /home/sdcafe/Kompajlirani_programi/KERNEL/linux-3.10-rc1/include/linux/thread_info.h:54,
  190. from /home/sdcafe/Kompajlirani_programi/KERNEL/linux-3.10-rc1/include/linux/preempt.h:9,
  191. from /home/sdcafe/Kompajlirani_programi/KERNEL/linux-3.10-rc1/include/linux/spinlock.h:50,
  192. from /home/sdcafe/Kompajlirani_programi/KERNEL/linux-3.10-rc1/include/linux/seqlock.h:29,
  193. from /home/sdcafe/Kompajlirani_programi/KERNEL/linux-3.10-rc1/include/linux/time.h:5,
  194. from /home/sdcafe/Kompajlirani_programi/KERNEL/linux-3.10-rc1/include/uapi/linux/timex.h:56,
  195. from /home/sdcafe/Kompajlirani_programi/KERNEL/linux-3.10-rc1/include/linux/timex.h:56,
  196. from /home/sdcafe/Kompajlirani_programi/KERNEL/linux-3.10-rc1/include/linux/sched.h:17,
  197. from /home/sdcafe/Kompajlirani_programi/KERNEL/linux-3.10-rc1/include/linux/utsname.h:5,
  198. from /home/sdcafe/Desktop/NVIDIA-Linux-x86_64-319.17/kernel/nv-linux.h:44,
  199. from /home/sdcafe/Desktop/NVIDIA-Linux-x86_64-319.17/kernel/nv-drm.c:15:
  200. /home/sdcafe/Kompajlirani_programi/KERNEL/linux-3.10-rc1/include/linux/cpumask.h: In function ‘cpumask_parse’:
  201. /home/sdcafe/Kompajlirani_programi/KERNEL/linux-3.10-rc1/include/linux/cpumask.h:603:26: warning: signed and unsigned type in conditional expression [-Wsign-compare]
  202. In file included from /home/sdcafe/Kompajlirani_programi/KERNEL/linux-3.10-rc1/arch/x86/include/asm/uaccess.h:539:0,
  203. from /home/sdcafe/Kompajlirani_programi/KERNEL/linux-3.10-rc1/include/linux/poll.h:11,
  204. from /home/sdcafe/Desktop/NVIDIA-Linux-x86_64-319.17/kernel/nv-linux.h:115,
  205. from /home/sdcafe/Desktop/NVIDIA-Linux-x86_64-319.17/kernel/nv-drm.c:15:
  206. /home/sdcafe/Kompajlirani_programi/KERNEL/linux-3.10-rc1/arch/x86/include/asm/uaccess_64.h: In function ‘copy_from_user’:
  207. /home/sdcafe/Kompajlirani_programi/KERNEL/linux-3.10-rc1/arch/x86/include/asm/uaccess_64.h:62:6: warning: comparison between signed and unsigned integer expressions [-Wsign-compare]
  208. In file included from /home/sdcafe/Kompajlirani_programi/KERNEL/linux-3.10-rc1/include/drm/drm_crtc.h:32:0,
  209. from /home/sdcafe/Kompajlirani_programi/KERNEL/linux-3.10-rc1/include/drm/drmP.h:690,
  210. from /home/sdcafe/Desktop/NVIDIA-Linux-x86_64-319.17/kernel/nv-drm.c:19:
  211. /home/sdcafe/Kompajlirani_programi/KERNEL/linux-3.10-rc1/include/linux/fb.h: In function ‘__fb_pad_aligned_buffer’:
  212. /home/sdcafe/Kompajlirani_programi/KERNEL/linux-3.10-rc1/include/linux/fb.h:650:17: warning: comparison between signed and unsigned integer expressions [-Wsign-compare]
  213. cc -Wp,-MD,/home/sdcafe/Desktop/NVIDIA-Linux-x86_64-319.17/kernel/.nv-gvi.o.d -nostdinc -isystem /usr/lib/gcc/x86_64-linux-gnu/4.7/include -I/home/sdcafe/Kompajlirani_programi/KERNEL/linux-3.10-rc1/arch/x86/include -Iarch/x86/include/generated -I/home/sdcafe/Kompajlirani_programi/KERNEL/linux-3.10-rc1/include -Iinclude -I/home/sdcafe/Kompajlirani_programi/KERNEL/linux-3.10-rc1/arch/x86/include/uapi -Iarch/x86/include/generated/uapi -I/home/sdcafe/Kompajlirani_programi/KERNEL/linux-3.10-rc1/include/uapi -Iinclude/generated/uapi -include /home/sdcafe/Kompajlirani_programi/KERNEL/linux-3.10-rc1/include/linux/kconfig.h -I/home/sdcafe/Desktop/NVIDIA-Linux-x86_64-319.17/kernel -D__KERNEL__ -Wall -Wundef -Wstrict-prototypes -Wno-trigraphs -fno-str
  214. ict-aliasing -fno-common -Werror-implicit-function-declaration -Wno-format-security -fno-delete-null-pointer-checks -Os -Wno-maybe-uninitialized -m64 -mno-sse -mpreferred-stack-boundary=3 -march=core2 -mno-red-zone -mcmodel=kernel -funit-at-a-time -maccumulate-outgoing-args -fstack-protector -DCONFIG_AS_CFI=1 -DCONFIG_AS_CFI_SIGNAL_FRAME=1 -DCONFIG_AS_CFI_SECTIONS=1 -DCONFIG_AS_FXSAVEQ=1 -DCONFIG_AS_AVX=1 -DCONFIG_AS_AVX2=1 -pipe -Wno-sign-compare -fno-asynchronous-unwind-tables -mno-sse -mno-mmx -mno-sse2 -mno-3dnow -mno-avx -Wframe-larger-than=1024 -Wno-unused-but-set-variable -fno-omit-frame-pointer -fno-optimize-sibling-calls -Wdeclaration-after-statement -Wno-pointer-sign -fno-strict-overflow -fconserve-stack -DCC_HAVE_ASM_GOTO -I/home/sdcafe/Desktop/NVIDIA-Linux-x86_64-319.17/kernel -Wall -MD -Wsign-compare -Wno-cast-qual -Wno-error -D__KERNEL__ -DMODULE -DNVRM -DNV_VERSION_STRING=\"319.17\" -Wno-unused-function -Wuninitialized -mno-red-zone -mcmodel=kernel -UDEBUG -U_DEBUG -DNDEBUG -D__linux__ -DMOD
  215. ULE -D"KBUILD_STR(s)=#s" -D"KBUILD_BASENAME=KBUILD_STR(nv_gvi)" -D"KBUILD_MODNAME=KBUILD_STR(nvidia)" -c -o /home/sdcafe/Desktop/NVIDIA-Linux-x86_64-319.17/kernel/.tmp_nv-gvi.o /home/sdcafe/Desktop/NVIDIA-Linux-x86_64-319.17/kernel/nv-gvi.c
  216. In file included from /home/sdcafe/Kompajlirani_programi/KERNEL/linux-3.10-rc1/include/linux/kernel.h:10:0,
  217. from /home/sdcafe/Kompajlirani_programi/KERNEL/linux-3.10-rc1/include/linux/sched.h:15,
  218. from /home/sdcafe/Kompajlirani_programi/KERNEL/linux-3.10-rc1/include/linux/utsname.h:5,
  219. from /home/sdcafe/Desktop/NVIDIA-Linux-x86_64-319.17/kernel/nv-linux.h:44,
  220. from /home/sdcafe/Desktop/NVIDIA-Linux-x86_64-319.17/kernel/nv-gvi.c:15:
  221. /home/sdcafe/Kompajlirani_programi/KERNEL/linux-3.10-rc1/include/linux/bitops.h: In function ‘hweight_long’:
  222. /home/sdcafe/Kompajlirani_programi/KERNEL/linux-3.10-rc1/include/linux/bitops.h:66:41: warning: signed and unsigned type in conditional expression [-Wsign-compare]
  223. In file included from /home/sdcafe/Kompajlirani_programi/KERNEL/linux-3.10-rc1/arch/x86/include/asm/cpumask.h:4:0,
  224. from /home/sdcafe/Kompajlirani_programi/KERNEL/linux-3.10-rc1/arch/x86/include/asm/msr.h:10,
  225. from /home/sdcafe/Kompajlirani_programi/KERNEL/linux-3.10-rc1/arch/x86/include/asm/processor.h:20,
  226. from /home/sdcafe/Kompajlirani_programi/KERNEL/linux-3.10-rc1/arch/x86/include/asm/thread_info.h:22,
  227. from /home/sdcafe/Kompajlirani_programi/KERNEL/linux-3.10-rc1/include/linux/thread_info.h:54,
  228. from /home/sdcafe/Kompajlirani_programi/KERNEL/linux-3.10-rc1/include/linux/preempt.h:9,
  229. from /home/sdcafe/Kompajlirani_programi/KERNEL/linux-3.10-rc1/include/linux/spinlock.h:50,
  230. from /home/sdcafe/Kompajlirani_programi/KERNEL/linux-3.10-rc1/include/linux/seqlock.h:29,
  231. from /home/sdcafe/Kompajlirani_programi/KERNEL/linux-3.10-rc1/include/linux/time.h:5,
  232. from /home/sdcafe/Kompajlirani_programi/KERNEL/linux-3.10-rc1/include/uapi/linux/timex.h:56,
  233. from /home/sdcafe/Kompajlirani_programi/KERNEL/linux-3.10-rc1/include/linux/timex.h:56,
  234. from /home/sdcafe/Kompajlirani_programi/KERNEL/linux-3.10-rc1/include/linux/sched.h:17,
  235. from /home/sdcafe/Kompajlirani_programi/KERNEL/linux-3.10-rc1/include/linux/utsname.h:5,
  236. from /home/sdcafe/Desktop/NVIDIA-Linux-x86_64-319.17/kernel/nv-linux.h:44,
  237. from /home/sdcafe/Desktop/NVIDIA-Linux-x86_64-319.17/kernel/nv-gvi.c:15:
  238. /home/sdcafe/Kompajlirani_programi/KERNEL/linux-3.10-rc1/include/linux/cpumask.h: In function ‘cpumask_parse’:
  239. /home/sdcafe/Kompajlirani_programi/KERNEL/linux-3.10-rc1/include/linux/cpumask.h:603:26: warning: signed and unsigned type in conditional expression [-Wsign-compare]
  240. In file included from /home/sdcafe/Kompajlirani_programi/KERNEL/linux-3.10-rc1/arch/x86/include/asm/uaccess.h:539:0,
  241. from /home/sdcafe/Kompajlirani_programi/KERNEL/linux-3.10-rc1/include/linux/poll.h:11,
  242. from /home/sdcafe/Desktop/NVIDIA-Linux-x86_64-319.17/kernel/nv-linux.h:115,
  243. from /home/sdcafe/Desktop/NVIDIA-Linux-x86_64-319.17/kernel/nv-gvi.c:15:
  244. /home/sdcafe/Kompajlirani_programi/KERNEL/linux-3.10-rc1/arch/x86/include/asm/uaccess_64.h: In function ‘copy_from_user’:
  245. /home/sdcafe/Kompajlirani_programi/KERNEL/linux-3.10-rc1/arch/x86/include/asm/uaccess_64.h:62:6: warning: comparison between signed and unsigned integer expressions [-Wsign-compare]
  246. cc -Wp,-MD,/home/sdcafe/Desktop/NVIDIA-Linux-x86_64-319.17/kernel/.nv-i2c.o.d -nostdinc -isystem /usr/lib/gcc/x86_64-linux-gnu/4.7/include -I/home/sdcafe/Kompajlirani_programi/KERNEL/linux-3.10-rc1/arch/x86/include -Iarch/x86/include/generated -I/home/sdcafe/Kompajlirani_programi/KERNEL/linux-3.10-rc1/include -Iinclude -I/home/sdcafe/Kompajlirani_programi/KERNEL/linux-3.10-rc1/arch/x86/include/uapi -Iarch/x86/include/generated/uapi -I/home/sdcafe/Kompajlirani_programi/KER
  247. NEL/linux-3.10-rc1/include/uapi -Iinclude/generated/uapi -include /home/sdcafe/Kompajlirani_programi/KERNEL/linux-3.10-rc1/include/linux/kconfig.h -I/home/sdcafe/Desktop/NVIDIA-Linux-x86_64-319.17/kernel -D__KERNEL__ -Wall -Wundef -Wstrict-prototypes -Wno-trigraphs -fno-strict-aliasing -fno-common -Werror-implicit-function-declaration -Wno-format-security -fno-delete-null-pointer-checks -Os -Wno-maybe-uninitialized -m64 -mno-sse -mpreferred-stack-boundary=3 -march=core2 -mno-red-zone -mcmodel=kernel -funit-at-a-time -maccumulate-outgoing-args -fstack-protector -DCONFIG_AS_CFI=1 -DCONFIG_AS_CFI_SIGNAL_FRAME=1 -DCONFIG_AS_CFI_SECTIONS=1 -DCONFIG_AS_FXSAVEQ=1 -DCONFIG_AS_AVX=1 -DCONFIG_AS_AVX2=1 -pipe -Wno-sign-compare -fno-asynchronous-unwind-tables -mno-sse -mno-mmx -mno-sse2 -mno-3dnow -mno-avx -Wframe-larger-than=1024 -Wno-unused-but-set-variable -fno-omit-frame-pointer -fno-optimize-sibling-calls -Wdeclaration-after-statement -Wno-pointer-sign -fno-strict-overflow -fconserve-stack -DCC_HAVE_ASM_GOTO -I/
  248. home/sdcafe/Desktop/NVIDIA-Linux-x86_64-319.17/kernel -Wall -MD -Wsign-compare -Wno-cast-qual -Wno-error -D__KERNEL__ -DMODULE -DNVRM -DNV_VERSION_STRING=\"319.17\" -Wno-unused-function -Wuninitialized -mno-red-zone -mcmodel=kernel -UDEBUG -U_DEBUG -DNDEBUG -D__linux__ -DMODULE -D"KBUILD_STR(s)=#s" -D"KBUILD_BASENAME=KBUILD_STR(nv_i2c)" -D"KBUILD_MODNAME=KBUILD_STR(nvidia)" -c -o /home/sdcafe/Desktop/NVIDIA-Linux-x86_64-319.17/kernel/.tmp_nv-i2c.o /home/sdcafe/Desktop/NVIDIA-Linux-x86_64-319.17/kernel/nv-i2c.c
  249. In file included from /home/sdcafe/Kompajlirani_programi/KERNEL/linux-3.10-rc1/include/linux/kernel.h:10:0,
  250. from /home/sdcafe/Kompajlirani_programi/KERNEL/linux-3.10-rc1/include/linux/sched.h:15,
  251. from /home/sdcafe/Kompajlirani_programi/KERNEL/linux-3.10-rc1/include/linux/utsname.h:5,
  252. from /home/sdcafe/Desktop/NVIDIA-Linux-x86_64-319.17/kernel/nv-linux.h:44,
  253. from /home/sdcafe/Desktop/NVIDIA-Linux-x86_64-319.17/kernel/nv-i2c.c:15:
  254. /home/sdcafe/Kompajlirani_programi/KERNEL/linux-3.10-rc1/include/linux/bitops.h: In function ‘hweight_long’:
  255. /home/sdcafe/Kompajlirani_programi/KERNEL/linux-3.10-rc1/include/linux/bitops.h:66:41: warning: signed and unsigned type in conditional expression [-Wsign-compare]
  256. In file included from /home/sdcafe/Kompajlirani_programi/KERNEL/linux-3.10-rc1/arch/x86/include/asm/cpumask.h:4:0,
  257. from /home/sdcafe/Kompajlirani_programi/KERNEL/linux-3.10-rc1/arch/x86/include/asm/msr.h:10,
  258. from /home/sdcafe/Kompajlirani_programi/KERNEL/linux-3.10-rc1/arch/x86/include/asm/processor.h:20,
  259. from /home/sdcafe/Kompajlirani_programi/KERNEL/linux-3.10-rc1/arch/x86/include/asm/thread_info.h:22,
  260. from /home/sdcafe/Kompajlirani_programi/KERNEL/linux-3.10-rc1/include/linux/thread_info.h:54,
  261. from /home/sdcafe/Kompajlirani_programi/KERNEL/linux-3.10-rc1/include/linux/preempt.h:9,
  262. from /home/sdcafe/Kompajlirani_programi/KERNEL/linux-3.10-rc1/include/linux/spinlock.h:50,
  263. from /home/sdcafe/Kompajlirani_programi/KERNEL/linux-3.10-rc1/include/linux/seqlock.h:29,
  264. from /home/sdcafe/Kompajlirani_programi/KERNEL/linux-3.10-rc1/include/linux/time.h:5,
  265. from /home/sdcafe/Kompajlirani_programi/KERNEL/linux-3.10-rc1/include/uapi/linux/timex.h:56,
  266. from /home/sdcafe/Kompajlirani_programi/KERNEL/linux-3.10-rc1/include/linux/timex.h:56,
  267. from /home/sdcafe/Kompajlirani_programi/KERNEL/linux-3.10-rc1/include/linux/sched.h:17,
  268. from /home/sdcafe/Kompajlirani_programi/KERNEL/linux-3.10-rc1/include/linux/utsname.h:5,
  269. from /home/sdcafe/Desktop/NVIDIA-Linux-x86_64-319.17/kernel/nv-linux.h:44,
  270. from /home/sdcafe/Desktop/NVIDIA-Linux-x86_64-319.17/kernel/nv-i2c.c:15:
  271. /home/sdcafe/Kompajlirani_programi/KERNEL/linux-3.10-rc1/include/linux/cpumask.h: In function ‘cpumask_parse’:
  272. /home/sdcafe/Kompajlirani_programi/KERNEL/linux-3.10-rc1/include/linux/cpumask.h:603:26: warning: signed and unsigned type in conditional expression [-Wsign-compare]
  273. In file included from /home/sdcafe/Kompajlirani_programi/KERNEL/linux-3.10-rc1/arch/x86/include/asm/uaccess.h:539:0,
  274. from /home/sdcafe/Kompajlirani_programi/KERNEL/linux-3.10-rc1/include/linux/poll.h:11,
  275. from /home/sdcafe/Desktop/NVIDIA-Linux-x86_64-319.17/kernel/nv-linux.h:115,
  276. from /home/sdcafe/Desktop/NVIDIA-Linux-x86_64-319.17/kernel/nv-i2c.c:15:
  277. /home/sdcafe/Kompajlirani_programi/KERNEL/linux-3.10-rc1/arch/x86/include/asm/uaccess_64.h: In function ‘copy_from_user’:
  278. /home/sdcafe/Kompajlirani_programi/KERNEL/linux-3.10-rc1/arch/x86/include/asm/uaccess_64.h:62:6: warning: comparison between signed and unsigned integer expressions [-Wsign-compare]
  279. cc -Wp,-MD,/home/sdcafe/Desktop/NVIDIA-Linux-x86_64-319.17/kernel/.nv-mempool.o.d -nostdinc -isystem /usr/lib/gcc/x86_64-linux-gnu/4.7/include -I/home/sdcafe/Kompajlirani_programi/KERNEL/linux-3.10-rc1/arch/x86/include -Iarch/x86/include/generated -I/home/sdcafe/Kompajlirani_programi/KERNEL/linux-3.10-rc1/include -Iinclude -I/home/sdcafe/Kompajlirani_programi/KERNEL/linux-3.10-rc1/arch/x86/include/uapi -Iarch/x86/include/generated/uapi -I/home/sdcafe/Kompajlirani_programi/KERNEL/linux-3.10-rc1/include/uapi -Iinclude/generated/uapi -include /home/sdcafe/Kompajlirani_programi/KERNEL/linux-3.10-rc1/include/linux/kconfig.h -I/home/sdcafe/Desktop/NVIDIA-Linux-x86_64-319.17/kernel -D__KERNEL__ -Wall -Wundef -Wstrict-prototypes -Wno-trigraphs -fno-strict-aliasing -fno-common -Werror-implicit-function-declaration -Wno-format-security -fno-delete-null-pointer-checks -Os -Wno-maybe-uninitialized -m64 -mno-sse -mpreferred-stack-boundary=3 -march=core2 -mno-red-zone -mcmodel=kernel -funit-at-a-time -maccumulate-outgoing-args -fstack-protector -DCONFIG_AS_CFI=1 -DCONFIG_AS_CFI_SIGNAL_FRAME=1 -DCONFIG_AS_CFI_SECTIONS=1 -DCONFIG_AS_FXSAVEQ=1 -DCONFIG_AS_AVX=1 -DCONFIG_AS_AVX2=1 -pipe -Wno-sign-compare -fno-asynchronou
  280. s-unwind-tables -mno-sse -mno-mmx -mno-sse2 -mno-3dnow -mno-avx -Wframe-larger-than=1024 -Wno-unused-but-set-variable -fno-omit-frame-pointer -fno-optimize-sibling-calls -Wdeclaration-after-statement -Wno-pointer-sign -fno-strict-overflow -fconserve-stack -DCC_HAVE_ASM_GOTO -I/home/sdcafe/Desktop/NVIDIA-Linux-x86_64-319.17/kernel -Wall -MD -Wsign-compare -Wno-cast-qual -Wno-error -D__KERNEL__ -DMODULE -DNVRM -DNV_VERSION_STRING=\"319.17\" -Wno-unused-function -Wuninitialized -mno-red-zone -mcmodel=kernel -UDEBUG -U_DEBUG -DNDEBUG -D__linux__ -DMODULE -D"KBUILD_STR(s)=#s" -D"KBUILD_BASENAME=KBUILD_STR(nv_mempool)" -D"KBUILD_MODNAME=KBUILD_STR(nvidia)" -c -o /home/sdcafe/Desktop/NVIDIA-Linux-x86_64-319.17/kernel/.tmp_nv-mempool.o /home/sdcafe/Desktop/NVIDIA-Linux-x86_64-319.17/kernel/nv-mempool.c
  281. In file included from /home/sdcafe/Kompajlirani_programi/KERNEL/linux-3.10-rc1/include/linux/kernel.h:10:0,
  282. from /home/sdcafe/Kompajlirani_programi/KERNEL/linux-3.10-rc1/include/linux/sched.h:15,
  283. from /home/sdcafe/Kompajlirani_programi/KERNEL/linux-3.10-rc1/include/linux/utsname.h:5,
  284. from /home/sdcafe/Desktop/NVIDIA-Linux-x86_64-319.17/kernel/nv-linux.h:44,
  285. from /home/sdcafe/Desktop/NVIDIA-Linux-x86_64-319.17/kernel/nv-mempool.c:15:
  286. /home/sdcafe/Kompajlirani_programi/KERNEL/linux-3.10-rc1/include/linux/bitops.h: In function ‘hweight_long’:
  287. /home/sdcafe/Kompajlirani_programi/KERNEL/linux-3.10-rc1/include/linux/bitops.h:66:41: warning: signed and unsigned type in conditional expression [-Wsign-compare]
  288. In file included from /home/sdcafe/Kompajlirani_programi/KERNEL/linux-3.10-rc1/arch/x86/include/asm/cpumask.h:4:0,
  289. from /home/sdcafe/Kompajlirani_programi/KERNEL/linux-3.10-rc1/arch/x86/include/asm/msr.h:10,
  290. from /home/sdcafe/Kompajlirani_programi/KERNEL/linux-3.10-rc1/arch/x86/include/asm/processor.h:20,
  291. from /home/sdcafe/Kompajlirani_programi/KERNEL/linux-3.10-rc1/arch/x86/include/asm/thread_info.h:22,
  292. from /home/sdcafe/Kompajlirani_programi/KERNEL/linux-3.10-rc1/include/linux/thread_info.h:54,
  293. from /home/sdcafe/Kompajlirani_programi/KERNEL/linux-3.10-rc1/include/linux/preempt.h:9,
  294. from /home/sdcafe/Kompajlirani_programi/KERNEL/linux-3.10-rc1/include/linux/spinlock.h:50,
  295. from /home/sdcafe/Kompajlirani_programi/KERNEL/linux-3.10-rc1/include/linux/seqlock.h:29,
  296. from /home/sdcafe/Kompajlirani_programi/KERNEL/linux-3.10-rc1/include/linux/time.h:5,
  297. from /home/sdcafe/Kompajlirani_programi/KERNEL/linux-3.10-rc1/include/uapi/linux/timex.h:56,
  298. from /home/sdcafe/Kompajlirani_programi/KERNEL/linux-3.10-rc1/include/linux/timex.h:56,
  299. from /home/sdcafe/Kompajlirani_programi/KERNEL/linux-3.10-rc1/include/linux/sched.h:17,
  300. from /home/sdcafe/Kompajlirani_programi/KERNEL/linux-3.10-rc1/include/linux/utsname.h:5,
  301. from /home/sdcafe/Desktop/NVIDIA-Linux-x86_64-319.17/kernel/nv-linux.h:44,
  302. from /home/sdcafe/Desktop/NVIDIA-Linux-x86_64-319.17/kernel/nv-mempool.c:15:
  303. /home/sdcafe/Kompajlirani_programi/KERNEL/linux-3.10-rc1/include/linux/cpumask.h: In function ‘cpumask_parse’:
  304. /home/sdcafe/Kompajlirani_programi/KERNEL/linux-3.10-rc1/include/linux/cpumask.h:603:26: warning: signed and unsigned type in conditional expression [-Wsign-compare]
  305. In file included from /home/sdcafe/Kompajlirani_programi/KERNEL/linux-3.10-rc1/arch/x86/include/asm/uaccess.h:539:0,
  306. from /home/sdcafe/Kompajlirani_programi/KERNEL/linux-3.10-rc1/include/linux/poll.h:11,
  307. from /home/sdcafe/Desktop/NVIDIA-Linux-x86_64-319.17/kernel/nv-linux.h:115,
  308. from /home/sdcafe/Desktop/NVIDIA-Linux-x86_64-319.17/kernel/nv-mempool.c:15:
  309. /home/sdcafe/Kompajlirani_programi/KERNEL/linux-3.10-rc1/arch/x86/include/asm/uaccess_64.h: In function ‘copy_from_user’:
  310. /home/sdcafe/Kompajlirani_programi/KERNEL/linux-3.10-rc1/arch/x86/include/asm/uaccess_64.h:62:6: warning: comparison between signed and unsigned integer expressions [-Wsign-compare]
  311. cc -Wp,-MD,/home/sdcafe/Desktop/NVIDIA-Linux-x86_64-319.17/kernel/.nv-mlock.o.d -nostdinc -isystem /usr/lib/gcc/x86_64-linux-gnu/4.7/include -I/home/sdcafe/Kompajlirani_programi/KERNEL/linux-3.10-rc1/arch/x86/include -Iarch/x86/include/generated -I/home/sdcafe/Kompajlirani_programi/KERNEL/linux-3.10-rc1/include -Iinclude -I/home/sdcafe/Kompajlirani_programi/KERNEL/linux-3.10-rc1/arch/x86/include/uapi -Iarch/x86/include/generated/uapi -I/home/sdcafe/Kompajlirani_programi/KERNEL/linux-3.10-rc1/include/uapi -Iinclude/generated/uapi -include /home/sdcafe/Kompajlirani_programi/KERNEL/linux-3.10-rc1/include/linux/kconfig.h -I/home/sdcafe/Desktop/NVIDIA-Linux-x86_64-319.17/kernel -D__KERNEL__ -Wall -Wundef -Wstrict-prototypes -Wno-trigraphs -fno-strict-aliasing -fno-common -Werror-implicit-function-declaration -Wno-format-security -fno-delete-null-pointer-checks -Os -Wno-maybe-uninitialized -m64 -mno-sse -mprefe
  312. rred-stack-boundary=3 -march=core2 -mno-red-zone -mcmodel=kernel -funit-at-a-time -maccumulate-outgoing-args -fstack-protector -DCONFIG_AS_CFI=1 -DCONFIG_AS_CFI_SIGNAL_FRAME=1 -DCONFIG_AS_CFI_SECTIONS=1 -DCONFIG_AS_FXSAVEQ=1 -DCONFIG_AS_AVX=1 -DCONFIG_AS_AVX2=1 -pipe -Wno-sign-compare -fno-asynchronous-unwind-tables -mno-sse -mno-mmx -mno-sse2 -mno-3dnow -mno-avx -Wframe-larger-than=1024 -Wno-unused-but-set-variable -fno-omit-frame-pointer -fno-optimize-sibling-calls -Wdeclaration-after-statement -Wno-pointer-sign -fno-strict-overflow -fconserve-stack -DCC_HAVE_ASM_GOTO -I/home/sdcafe/Desktop/NVIDIA-Linux-x86_64-319.17/kernel -Wall -MD -Wsign-compare -Wno-cast-qual -Wno-error -D__KERNEL__ -DMODULE -DNVRM -DNV_VERSION_STRING=\"319.17\" -Wno-unused-function -Wuninitialized -mno-red-zone -mcmodel=kernel -UDEBUG -U_DEBUG -DNDEBUG -D__linux__ -DMODULE -D"KBUILD_STR(s)=#s" -D"KBUILD_BASENAME=KBUILD_STR(nv_mlock)" -D"KBUILD_MODNAME=KBUILD_STR(nvidia)" -c -o /home/sdcafe/Desktop/NVIDIA-Linux-x86_64-319.17/kernel
  313. /.tmp_nv-mlock.o /home/sdcafe/Desktop/NVIDIA-Linux-x86_64-319.17/kernel/nv-mlock.c
  314. In file included from /home/sdcafe/Kompajlirani_programi/KERNEL/linux-3.10-rc1/include/linux/kernel.h:10:0,
  315. from /home/sdcafe/Kompajlirani_programi/KERNEL/linux-3.10-rc1/include/linux/sched.h:15,
  316. from /home/sdcafe/Kompajlirani_programi/KERNEL/linux-3.10-rc1/include/linux/utsname.h:5,
  317. from /home/sdcafe/Desktop/NVIDIA-Linux-x86_64-319.17/kernel/nv-linux.h:44,
  318. from /home/sdcafe/Desktop/NVIDIA-Linux-x86_64-319.17/kernel/nv-mlock.c:15:
  319. /home/sdcafe/Kompajlirani_programi/KERNEL/linux-3.10-rc1/include/linux/bitops.h: In function ‘hweight_long’:
  320. /home/sdcafe/Kompajlirani_programi/KERNEL/linux-3.10-rc1/include/linux/bitops.h:66:41: warning: signed and unsigned type in conditional expression [-Wsign-compare]
  321. In file included from /home/sdcafe/Kompajlirani_programi/KERNEL/linux-3.10-rc1/arch/x86/include/asm/cpumask.h:4:0,
  322. from /home/sdcafe/Kompajlirani_programi/KERNEL/linux-3.10-rc1/arch/x86/include/asm/msr.h:10,
  323. from /home/sdcafe/Kompajlirani_programi/KERNEL/linux-3.10-rc1/arch/x86/include/asm/processor.h:20,
  324. from /home/sdcafe/Kompajlirani_programi/KERNEL/linux-3.10-rc1/arch/x86/include/asm/thread_info.h:22,
  325. from /home/sdcafe/Kompajlirani_programi/KERNEL/linux-3.10-rc1/include/linux/thread_info.h:54,
  326. from /home/sdcafe/Kompajlirani_programi/KERNEL/linux-3.10-rc1/include/linux/preempt.h:9,
  327. from /home/sdcafe/Kompajlirani_programi/KERNEL/linux-3.10-rc1/include/linux/spinlock.h:50,
  328. from /home/sdcafe/Kompajlirani_programi/KERNEL/linux-3.10-rc1/include/linux/seqlock.h:29,
  329. from /home/sdcafe/Kompajlirani_programi/KERNEL/linux-3.10-rc1/include/linux/time.h:5,
  330. from /home/sdcafe/Kompajlirani_programi/KERNEL/linux-3.10-rc1/include/uapi/linux/timex.h:56,
  331. from /home/sdcafe/Kompajlirani_programi/KERNEL/linux-3.10-rc1/include/linux/timex.h:56,
  332. from /home/sdcafe/Kompajlirani_programi/KERNEL/linux-3.10-rc1/include/linux/sched.h:17,
  333. from /home/sdcafe/Kompajlirani_programi/KERNEL/linux-3.10-rc1/include/linux/utsname.h:5,
  334. from /home/sdcafe/Desktop/NVIDIA-Linux-x86_64-319.17/kernel/nv-linux.h:44,
  335. from /home/sdcafe/Desktop/NVIDIA-Linux-x86_64-319.17/kernel/nv-mlock.c:15:
  336. /home/sdcafe/Kompajlirani_programi/KERNEL/linux-3.10-rc1/include/linux/cpumask.h: In function ‘cpumask_parse’:
  337. /home/sdcafe/Kompajlirani_programi/KERNEL/linux-3.10-rc1/include/linux/cpumask.h:603:26: warning: signed and unsigned type in conditional expression [-Wsign-compare]
  338. In file included from /home/sdcafe/Kompajlirani_programi/KERNEL/linux-3.10-rc1/arch/x86/include/asm/uaccess.h:539:0,
  339. from /home/sdcafe/Kompajlirani_programi/KERNEL/linux-3.10-rc1/include/linux/poll.h:11,
  340. from /home/sdcafe/Desktop/NVIDIA-Linux-x86_64-319.17/kernel/nv-linux.h:115,
  341. from /home/sdcafe/Desktop/NVIDIA-Linux-x86_64-319.17/kernel/nv-mlock.c:15:
  342. /home/sdcafe/Kompajlirani_programi/KERNEL/linux-3.10-rc1/arch/x86/include/asm/uaccess_64.h: In function ‘copy_from_user’:
  343. /home/sdcafe/Kompajlirani_programi/KERNEL/linux-3.10-rc1/arch/x86/include/asm/uaccess_64.h:62:6: warning: comparison between signed and unsigned integer expressions [-Wsign-compare]
  344. cc -Wp,-MD,/home/sdcafe/Desktop/NVIDIA-Linux-x86_64-319.17/kernel/.nv-mmap.o.d -nostdinc -isystem /usr/lib/gcc/x86_64-linux-gnu/4.7/include -I/home/sdcafe/Kompajlirani_programi/KERNEL/linux-3.10-rc1/arch/x86/include -Iarch/x86/include/generated -I/home/sdcafe/Kompajlirani_programi/KERNEL/linux-3.10-rc1/include -Iinclude -I/home/sdcafe/Kompajlirani_programi/KERNEL/linux-3.10-rc1/arch/x86/include/uapi -Iarch/x86/include/generated/uapi -I/home/sdcafe/Kompajlirani_programi/KERNEL/linux-3.10-rc1/include/uapi -Iinclude/generated/uapi -include /home/sdcafe/Kompajlirani_programi/KERNEL/linux-3.10-rc1/include/linux/kconfig.h -I/h
  345. ome/sdcafe/Desktop/NVIDIA-Linux-x86_64-319.17/kernel -D__KERNEL__ -Wall -Wundef -Wstrict-prototypes -Wno-trigraphs -fno-strict-aliasing -fno-common -Werror-implicit-function-declaration -Wno-format-security -fno-delete-null-pointer-checks -Os -Wno-maybe-uninitialized -m64 -mno-sse -mpreferred-stack-boundary=3 -march=core2 -mno-red-zone -mcmodel=kernel -funit-at-a-time -maccumulate-outgoing-args -fstack-protector -DCONFIG_AS_CFI=1 -DCONFIG_AS_CFI_SIGNAL_FRAME=1 -DCONFIG_AS_CFI_SECTIONS=1 -DCONFIG_AS_FXSAVEQ=1 -DCONFIG_AS_AVX=1 -DCONFIG_AS_AVX2=1 -pipe -Wno-sign-compare -fno-asynchronous-unwind-tables -mno-sse -mno-mmx -mno-sse2 -mno-3dnow -mno-avx -Wframe-larger-than=1024 -Wno-unused-but-set-variable -fno-omit-frame-pointer -fno-optimize-sibling-calls -Wdeclaration-after-statement -Wno-pointer-sign -fno-strict-overflow -fconserve-stack -DCC_HAVE_ASM_GOTO -I/home/sdcafe/Desktop/NVIDIA-Linux-x86_64-319.17/kernel -Wall -MD -Wsign-compare -Wno-cast-qual -Wno-error -D__KERNEL__ -DMODULE -DNVRM -DNV_VERSION_STRING
  346. =\"319.17\" -Wno-unused-function -Wuninitialized -mno-red-zone -mcmodel=kernel -UDEBUG -U_DEBUG -DNDEBUG -D__linux__ -DMODULE -D"KBUILD_STR(s)=#s" -D"KBUILD_BASENAME=KBUILD_STR(nv_mmap)" -D"KBUILD_MODNAME=KBUILD_STR(nvidia)" -c -o /home/sdcafe/Desktop/NVIDIA-Linux-x86_64-319.17/kernel/.tmp_nv-mmap.o /home/sdcafe/Desktop/NVIDIA-Linux-x86_64-319.17/kernel/nv-mmap.c
  347. In file included from /home/sdcafe/Kompajlirani_programi/KERNEL/linux-3.10-rc1/include/linux/kernel.h:10:0,
  348. from /home/sdcafe/Kompajlirani_programi/KERNEL/linux-3.10-rc1/include/linux/sched.h:15,
  349. from /home/sdcafe/Kompajlirani_programi/KERNEL/linux-3.10-rc1/include/linux/utsname.h:5,
  350. from /home/sdcafe/Desktop/NVIDIA-Linux-x86_64-319.17/kernel/nv-linux.h:44,
  351. from /home/sdcafe/Desktop/NVIDIA-Linux-x86_64-319.17/kernel/nv-mmap.c:15:
  352. /home/sdcafe/Kompajlirani_programi/KERNEL/linux-3.10-rc1/include/linux/bitops.h: In function ‘hweight_long’:
  353. /home/sdcafe/Kompajlirani_programi/KERNEL/linux-3.10-rc1/include/linux/bitops.h:66:41: warning: signed and unsigned type in conditional expression [-Wsign-compare]
  354. In file included from /home/sdcafe/Kompajlirani_programi/KERNEL/linux-3.10-rc1/arch/x86/include/asm/cpumask.h:4:0,
  355. from /home/sdcafe/Kompajlirani_programi/KERNEL/linux-3.10-rc1/arch/x86/include/asm/msr.h:10,
  356. from /home/sdcafe/Kompajlirani_programi/KERNEL/linux-3.10-rc1/arch/x86/include/asm/processor.h:20,
  357. from /home/sdcafe/Kompajlirani_programi/KERNEL/linux-3.10-rc1/arch/x86/include/asm/thread_info.h:22,
  358. from /home/sdcafe/Kompajlirani_programi/KERNEL/linux-3.10-rc1/include/linux/thread_info.h:54,
  359. from /home/sdcafe/Kompajlirani_programi/KERNEL/linux-3.10-rc1/include/linux/preempt.h:9,
  360. from /home/sdcafe/Kompajlirani_programi/KERNEL/linux-3.10-rc1/include/linux/spinlock.h:50,
  361. from /home/sdcafe/Kompajlirani_programi/KERNEL/linux-3.10-rc1/include/linux/seqlock.h:29,
  362. from /home/sdcafe/Kompajlirani_programi/KERNEL/linux-3.10-rc1/include/linux/time.h:5,
  363. from /home/sdcafe/Kompajlirani_programi/KERNEL/linux-3.10-rc1/include/uapi/linux/timex.h:56,
  364. from /home/sdcafe/Kompajlirani_programi/KERNEL/linux-3.10-rc1/include/linux/timex.h:56,
  365. from /home/sdcafe/Kompajlirani_programi/KERNEL/linux-3.10-rc1/include/linux/sched.h:17,
  366. from /home/sdcafe/Kompajlirani_programi/KERNEL/linux-3.10-rc1/include/linux/utsname.h:5,
  367. from /home/sdcafe/Desktop/NVIDIA-Linux-x86_64-319.17/kernel/nv-linux.h:44,
  368. from /home/sdcafe/Desktop/NVIDIA-Linux-x86_64-319.17/kernel/nv-mmap.c:15:
  369. /home/sdcafe/Kompajlirani_programi/KERNEL/linux-3.10-rc1/include/linux/cpumask.h: In function ‘cpumask_parse’:
  370. /home/sdcafe/Kompajlirani_programi/KERNEL/linux-3.10-rc1/include/linux/cpumask.h:603:26: warning: signed and unsigned type in conditional expression [-Wsign-compare]
  371. In file included from /home/sdcafe/Kompajlirani_programi/KERNEL/linux-3.10-rc1/arch/x86/include/asm/uaccess.h:539:0,
  372. from /home/sdcafe/Kompajlirani_programi/KERNEL/linux-3.10-rc1/include/linux/poll.h:11,
  373. from /home/sdcafe/Desktop/NVIDIA-Linux-x86_64-319.17/kernel/nv-linux.h:115,
  374. from /home/sdcafe/Desktop/NVIDIA-Linux-x86_64-319.17/kernel/nv-mmap.c:15:
  375. /home/sdcafe/Kompajlirani_programi/KERNEL/linux-3.10-rc1/arch/x86/include/asm/uaccess_64.h: In function ‘copy_from_user’:
  376. /home/sdcafe/Kompajlirani_programi/KERNEL/linux-3.10-rc1/arch/x86/include/asm/uaccess_64.h:62:6: warning: comparison between signed and unsigned integer expressions [-Wsign-compare]
  377. cc -Wp,-MD,/home/sdcafe/Desktop/NVIDIA-Linux-x86_64-319.17/kernel/.nv-p2p.o.d -nostdinc -isystem /usr/lib/gcc/x86_64-linux-gnu/4.7/include -I/home/sdcafe/Kompajlirani_programi/KERNEL/linux-3.10-rc1/arch/x86/include -Iarch/x86/include/generated -I/home/sdcafe/Kompajlirani_programi/KERNEL/linux-3.10-rc1/include -Iinclude -I/home/sdcafe/Kompajliran
  378. i_programi/KERNEL/linux-3.10-rc1/arch/x86/include/uapi -Iarch/x86/include/generated/uapi -I/home/sdcafe/Kompajlirani_programi/KERNEL/linux-3.10-rc1/include/uapi -Iinclude/generated/uapi -include /home/sdcafe/Kompajlirani_programi/KERNEL/linux-3.10-rc1/include/linux/kconfig.h -I/home/sdcafe/Desktop/NVIDIA-Linux-x86_64-319.17/kernel -D__KERNEL__ -Wall -Wundef -Wstrict-prototypes -Wno-trigraphs -fno-strict-aliasing -fno-common -Werror-implicit-function-declaration -Wno-format-security -fno-delete-null-pointer-checks -Os -Wno-maybe-uninitialized -m64 -mno-sse -mpreferred-stack-boundary=3 -march=core2 -mno-red-zone -mcmodel=kernel -funit-at-a-time -maccumulate-outgoing-args -fstack-protector -DCONFIG_AS_CFI=1 -DCONFIG_AS_CFI_SIGNAL_FRAME=1 -DCONFIG_AS_CFI_SECTIONS=1 -DCONFIG_AS_FXSAVEQ=1 -DCONFIG_AS_AVX=1 -DCONFIG_AS_AVX2=1 -pipe -Wno-sign-compare -fno-asynchronous-unwind-tables -mno-sse -mno-mmx -mno-sse2 -mno-3dnow -mno-avx -Wframe-larger-than=1024 -Wno-unused-but-set-variable -fno-omit-frame-pointer -fno-opti
  379. mize-sibling-calls -Wdeclaration-after-statement -Wno-pointer-sign -fno-strict-overflow -fconserve-stack -DCC_HAVE_ASM_GOTO -I/home/sdcafe/Desktop/NVIDIA-Linux-x86_64-319.17/kernel -Wall -MD -Wsign-compare -Wno-cast-qual -Wno-error -D__KERNEL__ -DMODULE -DNVRM -DNV_VERSION_STRING=\"319.17\" -Wno-unused-function -Wuninitialized -mno-red-zone -mcmodel=kernel -UDEBUG -U_DEBUG -DNDEBUG -D__linux__ -DMODULE -D"KBUILD_STR(s)=#s" -D"KBUILD_BASENAME=KBUILD_STR(nv_p2p)" -D"KBUILD_MODNAME=KBUILD_STR(nvidia)" -c -o /home/sdcafe/Desktop/NVIDIA-Linux-x86_64-319.17/kernel/.tmp_nv-p2p.o /home/sdcafe/Desktop/NVIDIA-Linux-x86_64-319.17/kernel/nv-p2p.c
  380. In file included from /home/sdcafe/Kompajlirani_programi/KERNEL/linux-3.10-rc1/include/linux/kernel.h:10:0,
  381. from /home/sdcafe/Kompajlirani_programi/KERNEL/linux-3.10-rc1/include/linux/sched.h:15,
  382. from /home/sdcafe/Kompajlirani_programi/KERNEL/linux-3.10-rc1/include/linux/utsname.h:5,
  383. from /home/sdcafe/Desktop/NVIDIA-Linux-x86_64-319.17/kernel/nv-linux.h:44,
  384. from /home/sdcafe/Desktop/NVIDIA-Linux-x86_64-319.17/kernel/nv-p2p.c:15:
  385. /home/sdcafe/Kompajlirani_programi/KERNEL/linux-3.10-rc1/include/linux/bitops.h: In function ‘hweight_long’:
  386. /home/sdcafe/Kompajlirani_programi/KERNEL/linux-3.10-rc1/include/linux/bitops.h:66:41: warning: signed and unsigned type in conditional expression [-Wsign-compare]
  387. In file included from /home/sdcafe/Kompajlirani_programi/KERNEL/linux-3.10-rc1/arch/x86/include/asm/cpumask.h:4:0,
  388. from /home/sdcafe/Kompajlirani_programi/KERNEL/linux-3.10-rc1/arch/x86/include/asm/msr.h:10,
  389. from /home/sdcafe/Kompajlirani_programi/KERNEL/linux-3.10-rc1/arch/x86/include/asm/processor.h:20,
  390. from /home/sdcafe/Kompajlirani_programi/KERNEL/linux-3.10-rc1/arch/x86/include/asm/thread_info.h:22,
  391. from /home/sdcafe/Kompajlirani_programi/KERNEL/linux-3.10-rc1/include/linux/thread_info.h:54,
  392. from /home/sdcafe/Kompajlirani_programi/KERNEL/linux-3.10-rc1/include/linux/preempt.h:9,
  393. from /home/sdcafe/Kompajlirani_programi/KERNEL/linux-3.10-rc1/include/linux/spinlock.h:50,
  394. from /home/sdcafe/Kompajlirani_programi/KERNEL/linux-3.10-rc1/include/linux/seqlock.h:29,
  395. from /home/sdcafe/Kompajlirani_programi/KERNEL/linux-3.10-rc1/include/linux/time.h:5,
  396. from /home/sdcafe/Kompajlirani_programi/KERNEL/linux-3.10-rc1/include/uapi/linux/timex.h:56,
  397. from /home/sdcafe/Kompajlirani_programi/KERNEL/linux-3.10-rc1/include/linux/timex.h:56,
  398. from /home/sdcafe/Kompajlirani_programi/KERNEL/linux-3.10-rc1/include/linux/sched.h:17,
  399. from /home/sdcafe/Kompajlirani_programi/KERNEL/linux-3.10-rc1/include/linux/utsname.h:5,
  400. from /home/sdcafe/Desktop/NVIDIA-Linux-x86_64-319.17/kernel/nv-linux.h:44,
  401. from /home/sdcafe/Desktop/NVIDIA-Linux-x86_64-319.17/kernel/nv-p2p.c:15:
  402. /home/sdcafe/Kompajlirani_programi/KERNEL/linux-3.10-rc1/include/linux/cpumask.h: In function ‘cpumask_parse’:
  403. /home/sdcafe/Kompajlirani_programi/KERNEL/linux-3.10-rc1/include/linux/cpumask.h:603:26: warning: signed and unsigned type in conditional expression [-Wsign-compare]
  404. In file included from /home/sdcafe/Kompajlirani_programi/KERNEL/linux-3.10-rc1/arch/x86/include/asm/uaccess.h:539:0,
  405. from /home/sdcafe/Kompajlirani_programi/KERNEL/linux-3.10-rc1/include/linux/poll.h:11,
  406. from /home/sdcafe/Desktop/NVIDIA-Linux-x86_64-319.17/kernel/nv-linux.h:115,
  407. from /home/sdcafe/Desktop/NVIDIA-Linux-x86_64-319.17/kernel/nv-p2p.c:15:
  408. /home/sdcafe/Kompajlirani_programi/KERNEL/linux-3.10-rc1/arch/x86/include/asm/uaccess_64.h: In function ‘copy_from_user’:
  409. /home/sdcafe/Kompajlirani_programi/KERNEL/linux-3.10-rc1/arch/x86/include/asm/uaccess_64.h:62:6: warning: comparison between signed and unsigned integer expressions [-Wsign-compare]
  410. cc -Wp,-MD,/home/sdcafe/Desktop/NVIDIA-Linux-x86_64-319.17/kernel/.nv-pat.o.d -nostdinc -isystem /usr/lib/gcc/x86_64-linux-gnu/4.7/include -I/home/sdcafe/Kompajlirani_programi/KERNEL/linux-3.10-rc1/arch/x86/include -Iarch/x86/include/generated -I/home/sdcafe/Kompajlirani_programi/KERNEL/linux-3.10-rc1/include -Iinclude -I/home/sdcafe/Kompajlirani_programi/KERNEL/linux-3.10-rc1/arch/x86/include/uapi -Iarch/x86/include/generated/uapi -I/home/sdcafe/Kompajlirani_programi/KERNEL/linux-3.10-rc1/include/uapi -Iinclude/generated/uapi -include /home/sdcafe/Kompajlirani_programi/KERNEL/linux-3.10-rc1/include/linux/kconfig.h -I/home/sdcafe/Desktop/NVIDIA-Linux-x86_64-319.17/kernel -D__KERNEL__ -Wall -Wundef -Wstrict-prototypes -Wno-trigraphs -fno-strict-aliasing -fno-common -Werror-implicit-function-declaration -Wno-format-security -fno-delete-null-pointer-checks -Os -Wno-maybe-uninitialized -m64 -mno-sse -mpreferred-stack-boundary=3 -march=core2 -mno-red-zone -mcmodel=kernel -funit-at-a-time -maccumulate-outgoing-args -fstack-protector -DCONFIG_AS_CFI=1 -DCONFIG_AS_CFI_SIGNAL_FRAME=1 -
  411. DCONFIG_AS_CFI_SECTIONS=1 -DCONFIG_AS_FXSAVEQ=1 -DCONFIG_AS_AVX=1 -DCONFIG_AS_AVX2=1 -pipe -Wno-sign-compare -fno-asynchronous-unwind-tables -mno-sse -mno-mmx -mno-sse2 -mno-3dnow -mno-avx -Wframe-larger-than=1024 -Wno-unused-but-set-variable -fno-omit-frame-pointer -fno-optimize-sibling-calls -Wdeclaration-after-statement -Wno-pointer-sign -fno-strict-overflow -fconserve-stack -DCC_HAVE_ASM_GOTO -I/home/sdcafe/Desktop/NVIDIA-Linux-x86_64-319.17/kernel -Wall -MD -Wsign-compare -Wno-cast-qual -Wno-error -D__KERNEL__ -DMODULE -DNVRM -DNV_VERSION_STRING=\"319.17\" -Wno-unused-function -Wuninitialized -mno-red-zone -mcmodel=kernel -UDEBUG -U_DEBUG -DNDEBUG -D__linux__ -DMODULE -D"KBUILD_STR(s)=#s" -D"KBUILD_BASENAME=KBUILD_STR(nv_pat)" -D"KBUILD_MODNAME=KBUILD_STR(nvidia)" -c -o /home/sdcafe/Desktop/NVIDIA-Linux-x86_64-319.17/kernel/.tmp_nv-pat.o /home/sdcafe/Desktop/NVIDIA-Linux-x86_64-319.17/kernel/nv-pat.c
  412. In file included from /home/sdcafe/Kompajlirani_programi/KERNEL/linux-3.10-rc1/include/linux/kernel.h:10:0,
  413. from /home/sdcafe/Kompajlirani_programi/KERNEL/linux-3.10-rc1/include/linux/sched.h:15,
  414. from /home/sdcafe/Kompajlirani_programi/KERNEL/linux-3.10-rc1/include/linux/utsname.h:5,
  415. from /home/sdcafe/Desktop/NVIDIA-Linux-x86_64-319.17/kernel/nv-linux.h:44,
  416. from /home/sdcafe/Desktop/NVIDIA-Linux-x86_64-319.17/kernel/nv-pat.c:15:
  417. /home/sdcafe/Kompajlirani_programi/KERNEL/linux-3.10-rc1/include/linux/bitops.h: In function ‘hweight_long’:
  418. /home/sdcafe/Kompajlirani_programi/KERNEL/linux-3.10-rc1/include/linux/bitops.h:66:41: warning: signed and unsigned type in conditional expression [-Wsign-compare]
  419. In file included from /home/sdcafe/Kompajlirani_programi/KERNEL/linux-3.10-rc1/arch/x86/include/asm/cpumask.h:4:0,
  420. from /home/sdcafe/Kompajlirani_programi/KERNEL/linux-3.10-rc1/arch/x86/include/asm/msr.h:10,
  421. from /home/sdcafe/Kompajlirani_programi/KERNEL/linux-3.10-rc1/arch/x86/include/asm/processor.h:20,
  422. from /home/sdcafe/Kompajlirani_programi/KERNEL/linux-3.10-rc1/arch/x86/include/asm/thread_info.h:22,
  423. from /home/sdcafe/Kompajlirani_programi/KERNEL/linux-3.10-rc1/include/linux/thread_info.h:54,
  424. from /home/sdcafe/Kompajlirani_programi/KERNEL/linux-3.10-rc1/include/linux/preempt.h:9,
  425. from /home/sdcafe/Kompajlirani_programi/KERNEL/linux-3.10-rc1/include/linux/spinlock.h:50,
  426. from /home/sdcafe/Kompajlirani_programi/KERNEL/linux-3.10-rc1/include/linux/seqlock.h:29,
  427. from /home/sdcafe/Kompajlirani_programi/KERNEL/linux-3.10-rc1/include/linux/time.h:5,
  428. from /home/sdcafe/Kompajlirani_programi/KERNEL/linux-3.10-rc1/include/uapi/linux/timex.h:56,
  429. from /home/sdcafe/Kompajlirani_programi/KERNEL/linux-3.10-rc1/include/linux/timex.h:56,
  430. from /home/sdcafe/Kompajlirani_programi/KERNEL/linux-3.10-rc1/include/linux/sched.h:17,
  431. from /home/sdcafe/Kompajlirani_programi/KERNEL/linux-3.10-rc1/include/linux/utsname.h:5,
  432. from /home/sdcafe/Desktop/NVIDIA-Linux-x86_64-319.17/kernel/nv-linux.h:44,
  433. from /home/sdcafe/Desktop/NVIDIA-Linux-x86_64-319.17/kernel/nv-pat.c:15:
  434. /home/sdcafe/Kompajlirani_programi/KERNEL/linux-3.10-rc1/include/linux/cpumask.h: In function ‘cpumask_parse’:
  435. /home/sdcafe/Kompajlirani_programi/KERNEL/linux-3.10-rc1/include/linux/cpumask.h:603:26: warning: signed and unsigned type in conditional expression [-Wsign-compare]
  436. In file included from /home/sdcafe/Kompajlirani_programi/KERNEL/linux-3.10-rc1/arch/x86/include/asm/uaccess.h:539:0,
  437. from /home/sdcafe/Kompajlirani_programi/KERNEL/linux-3.10-rc1/include/linux/poll.h:11,
  438. from /home/sdcafe/Desktop/NVIDIA-Linux-x86_64-319.17/kernel/nv-linux.h:115,
  439. from /home/sdcafe/Desktop/NVIDIA-Linux-x86_64-319.17/kernel/nv-pat.c:15:
  440. /home/sdcafe/Kompajlirani_programi/KERNEL/linux-3.10-rc1/arch/x86/include/asm/uaccess_64.h: In function ‘copy_from_user’:
  441. /home/sdcafe/Kompajlirani_programi/KERNEL/linux-3.10-rc1/arch/x86/include/asm/uaccess_64.h:62:6: warning: comparison between signed and unsigned integer expressions [-Wsign-compare]
  442. cc -Wp,-MD,/home/sdcafe/Desktop/NVIDIA-Linux-x86_64-319.17/kernel/.nv-procfs.o.d -nostdinc -isystem /usr/lib/gcc/x86_64-linux-gnu/4.7/include -I/home/sdcafe/Kompajlirani_programi/KERNEL/linux-3.10-rc1/arch/x86/include -Iarch/x86/include/generated -I/home/sdcafe/Kompajlirani_programi/KERNEL/linux-3.10-rc1/include -Iinclude -I/home/sdcafe/Kompajlirani_programi/KERNEL/linux-3.10-rc1/arch/x86/include/uapi -Iarch/x86/include/generated/uapi -I/home/sdcafe/Kompajlirani_programi/KERNEL/linux-3.10-rc1/include/uapi -Iinclude/generated/uapi -include /home/sdcafe/Kompajlirani_programi/KERNEL/linux-3.10-rc1/include/linux/kconfig.h -I/home/sdcafe/Desktop/NVIDIA-Linux-x86_64-319.17/kernel -D__KERNEL__ -Wall -Wundef -Wstrict-prototypes -Wno-trigraphs -fno-strict-aliasing -fno-common -Werror-implicit-function-declaration -
  443. Wno-format-security -fno-delete-null-pointer-checks -Os -Wno-maybe-uninitialized -m64 -mno-sse -mpreferred-stack-boundary=3 -march=core2 -mno-red-zone -mcmodel=kernel -funit-at-a-time -maccumulate-outgoing-args -fstack-protector -DCONFIG_AS_CFI=1 -DCONFIG_AS_CFI_SIGNAL_FRAME=1 -DCONFIG_AS_CFI_SECTIONS=1 -DCONFIG_AS_FXSAVEQ=1 -DCONFIG_AS_AVX=1 -DCONFIG_AS_AVX2=1 -pipe -Wno-sign-compare -fno-asynchronous-unwind-tables -mno-sse -mno-mmx -mno-sse2 -mno-3dnow -mno-avx -Wframe-larger-than=1024 -Wno-unused-but-set-variable -fno-omit-frame-pointer -fno-optimize-sibling-calls -Wdeclaration-after-statement -Wno-pointer-sign -fno-strict-overflow -fconserve-stack -DCC_HAVE_ASM_GOTO -I/home/sdcafe/Desktop/NVIDIA-Linux-x86_64-319.17/kernel -Wall -MD -Wsign-compare -Wno-cast-qual -Wno-error -D__KERNEL__ -DMODULE -DNVRM -DNV_VERSION_STRING=\"319.17\" -Wno-unused-function -Wuninitialized -mno-red-zone -mcmodel=kernel -UDEBUG -U_DEBUG -DNDEBUG -D__linux__ -DMODULE -D"KBUILD_STR(s)=#s" -D"KBUILD_BASENAME=KBUILD_STR(nv_procf
  444. s)" -D"KBUILD_MODNAME=KBUILD_STR(nvidia)" -c -o /home/sdcafe/Desktop/NVIDIA-Linux-x86_64-319.17/kernel/.tmp_nv-procfs.o /home/sdcafe/Desktop/NVIDIA-Linux-x86_64-319.17/kernel/nv-procfs.c
  445. In file included from /home/sdcafe/Kompajlirani_programi/KERNEL/linux-3.10-rc1/include/linux/kernel.h:10:0,
  446. from /home/sdcafe/Kompajlirani_programi/KERNEL/linux-3.10-rc1/include/linux/sched.h:15,
  447. from /home/sdcafe/Kompajlirani_programi/KERNEL/linux-3.10-rc1/include/linux/utsname.h:5,
  448. from /home/sdcafe/Desktop/NVIDIA-Linux-x86_64-319.17/kernel/nv-linux.h:44,
  449. from /home/sdcafe/Desktop/NVIDIA-Linux-x86_64-319.17/kernel/nv-procfs.c:15:
  450. /home/sdcafe/Kompajlirani_programi/KERNEL/linux-3.10-rc1/include/linux/bitops.h: In function ‘hweight_long’:
  451. /home/sdcafe/Kompajlirani_programi/KERNEL/linux-3.10-rc1/include/linux/bitops.h:66:41: warning: signed and unsigned type in conditional expression [-Wsign-compare]
  452. In file included from /home/sdcafe/Kompajlirani_programi/KERNEL/linux-3.10-rc1/arch/x86/include/asm/cpumask.h:4:0,
  453. from /home/sdcafe/Kompajlirani_programi/KERNEL/linux-3.10-rc1/arch/x86/include/asm/msr.h:10,
  454. from /home/sdcafe/Kompajlirani_programi/KERNEL/linux-3.10-rc1/arch/x86/include/asm/processor.h:20,
  455. from /home/sdcafe/Kompajlirani_programi/KERNEL/linux-3.10-rc1/arch/x86/include/asm/thread_info.h:22,
  456. from /home/sdcafe/Kompajlirani_programi/KERNEL/linux-3.10-rc1/include/linux/thread_info.h:54,
  457. from /home/sdcafe/Kompajlirani_programi/KERNEL/linux-3.10-rc1/include/linux/preempt.h:9,
  458. from /home/sdcafe/Kompajlirani_programi/KERNEL/linux-3.10-rc1/include/linux/spinlock.h:50,
  459. from /home/sdcafe/Kompajlirani_programi/KERNEL/linux-3.10-rc1/include/linux/seqlock.h:29,
  460. from /home/sdcafe/Kompajlirani_programi/KERNEL/linux-3.10-rc1/include/linux/time.h:5,
  461. from /home/sdcafe/Kompajlirani_programi/KERNEL/linux-3.10-rc1/include/uapi/linux/timex.h:56,
  462. from /home/sdcafe/Kompajlirani_programi/KERNEL/linux-3.10-rc1/include/linux/timex.h:56,
  463. from /home/sdcafe/Kompajlirani_programi/KERNEL/linux-3.10-rc1/include/linux/sched.h:17,
  464. from /home/sdcafe/Kompajlirani_programi/KERNEL/linux-3.10-rc1/include/linux/utsname.h:5,
  465. from /home/sdcafe/Desktop/NVIDIA-Linux-x86_64-319.17/kernel/nv-linux.h:44,
  466. from /home/sdcafe/Desktop/NVIDIA-Linux-x86_64-319.17/kernel/nv-procfs.c:15:
  467. /home/sdcafe/Kompajlirani_programi/KERNEL/linux-3.10-rc1/include/linux/cpumask.h: In function ‘cpumask_parse’:
  468. /home/sdcafe/Kompajlirani_programi/KERNEL/linux-3.10-rc1/include/linux/cpumask.h:603:26: warning: signed and unsigned type in conditional expression [-Wsign-compare]
  469. In file included from /home/sdcafe/Kompajlirani_programi/KERNEL/linux-3.10-rc1/arch/x86/include/asm/uaccess.h:539:0,
  470. from /home/sdcafe/Kompajlirani_programi/KERNEL/linux-3.10-rc1/include/linux/poll.h:11,
  471. from /home/sdcafe/Desktop/NVIDIA-Linux-x86_64-319.17/kernel/nv-linux.h:115,
  472. from /home/sdcafe/Desktop/NVIDIA-Linux-x86_64-319.17/kernel/nv-procfs.c:15:
  473. /home/sdcafe/Kompajlirani_programi/KERNEL/linux-3.10-rc1/arch/x86/include/asm/uaccess_64.h: In function ‘copy_from_user’:
  474. /home/sdcafe/Kompajlirani_programi/KERNEL/linux-3.10-rc1/arch/x86/include/asm/uaccess_64.h:62:6: warning: comparison between signed and unsigned integer expressions [-Wsign-compare]
  475. /home/sdcafe/Desktop/NVIDIA-Linux-x86_64-319.17/kernel/nv-procfs.c: At top level:
  476. /home/sdcafe/Desktop/NVIDIA-Linux-x86_64-319.17/kernel/nv-procfs.c:50:13: error: ‘open_callback’ undeclared here (not in a function)
  477. /home/sdcafe/Desktop/NVIDIA-Linux-x86_64-319.17/kernel/nv-procfs.c:51:13: error: ‘read_callback’ undeclared here (not in a function)
  478. /home/sdcafe/Desktop/NVIDIA-Linux-x86_64-319.17/kernel/nv-procfs.c: In function ‘nv_procfs_add_text_file’:
  479. /home/sdcafe/Desktop/NVIDIA-Linux-x86_64-319.17/kernel/nv-procfs.c:477:5: error: lvalue required as unary ‘&’ operand
  480. /home/sdcafe/Desktop/NVIDIA-Linux-x86_64-319.17/kernel/nv-procfs.c:477:5: error: dereferencing pointer to incomplete type
  481. /home/sdcafe/Desktop/NVIDIA-Linux-x86_64-319.17/kernel/nv-procfs.c:477:5: error: dereferencing pointer to incomplete type
  482. /home/sdcafe/Desktop/NVIDIA-Linux-x86_64-319.17/kernel/nv-procfs.c:477:5: error: dereferencing pointer to incomplete type
  483. /home/sdcafe/Desktop/NVIDIA-Linux-x86_64-319.17/kernel/nv-procfs.c:477:5: error: dereferencing pointer to incomplete type
  484. /home/sdcafe/Desktop/NVIDIA-Linux-x86_64-319.17/kernel/nv-procfs.c: In function ‘nv_procfs_unregister_all’:
  485. /home/sdcafe/Desktop/NVIDIA-Linux-x86_64-319.17/kernel/nv-procfs.c:485:44: error: dereferencing pointer to incomplete type
  486. /home/sdcafe/Desktop/NVIDIA-Linux-x86_64-319.17/kernel/nv-procfs.c:486:18: error: dereferencing pointer to incomplete type
  487. /home/sdcafe/Desktop/NVIDIA-Linux-x86_64-319.17/kernel/nv-procfs.c:487:43: error: dereferencing pointer to incomplete type
  488. /home/sdcafe/Desktop/NVIDIA-Linux-x86_64-319.17/kernel/nv-procfs.c:488:32: error: dereferencing pointer to incomplete type
  489. /home/sdcafe/Desktop/NVIDIA-Linux-x86_64-319.17/kernel/nv-procfs.c:488:45: error: dereferencing pointer to incomplete type
  490. /home/sdcafe/Desktop/NVIDIA-Linux-x86_64-319.17/kernel/nv-procfs.c: In function ‘nv_register_procfs’:
  491. /home/sdcafe/Desktop/NVIDIA-Linux-x86_64-319.17/kernel/nv-procfs.c:517:19: error: lvalue required as unary ‘&’ operand
  492. /home/sdcafe/Desktop/NVIDIA-Linux-x86_64-319.17/kernel/nv-procfs.c:521:13: error: lvalue required as unary ‘&’ operand
  493. /home/sdcafe/Desktop/NVIDIA-Linux-x86_64-319.17/kernel/nv-procfs.c:521:13: error: dereferencing pointer to incomplete type
  494. /home/sdcafe/Desktop/NVIDIA-Linux-x86_64-319.17/kernel/nv-procfs.c:521:13: error: dereferencing pointer to incomplete type
  495. /home/sdcafe/Desktop/NVIDIA-Linux-x86_64-319.17/kernel/nv-procfs.c:521:13: error: dereferencing pointer to incomplete type
  496. /home/sdcafe/Desktop/NVIDIA-Linux-x86_64-319.17/kernel/nv-procfs.c:521:13: error: dereferencing pointer to incomplete type
  497. /home/sdcafe/Desktop/NVIDIA-Linux-x86_64-319.17/kernel/nv-procfs.c:534:41: error: dereferencing pointer to incomplete type
  498. /home/sdcafe/Desktop/NVIDIA-Linux-x86_64-319.17/kernel/nv-procfs.c:535:42: error: dereferencing pointer to incomplete type
  499. /home/sdcafe/Desktop/NVIDIA-Linux-x86_64-319.17/kernel/nv-procfs.c:537:13: error: lvalue required as unary ‘&’ operand
  500. /home/sdcafe/Desktop/NVIDIA-Linux-x86_64-319.17/kernel/nv-procfs.c:537:13: error: dereferencing pointer to incomplete type
  501. /home/sdcafe/Desktop/NVIDIA-Linux-x86_64-319.17/kernel/nv-procfs.c:537:13: error: dereferencing pointer to incomplete type
  502. /home/sdcafe/Desktop/NVIDIA-Linux-x86_64-319.17/kernel/nv-procfs.c:537:13: error: dereferencing pointer to incomplete type
  503. /home/sdcafe/Desktop/NVIDIA-Linux-x86_64-319.17/kernel/nv-procfs.c:537:13: error: dereferencing pointer to incomplete type
  504. /home/sdcafe/Desktop/NVIDIA-Linux-x86_64-319.17/kernel/nv-procfs.c:544:28: error: lvalue required as unary ‘&’ operand
  505. /home/sdcafe/Desktop/NVIDIA-Linux-x86_64-319.17/kernel/nv-procfs.c:549:27: error: lvalue required as unary ‘&’ operand
  506. /home/sdcafe/Desktop/NVIDIA-Linux-x86_64-319.17/kernel/nv-procfs.c:561:13: error: lvalue required as unary ‘&’ operand
  507. /home/sdcafe/Desktop/NVIDIA-Linux-x86_64-319.17/kernel/nv-procfs.c:561:13: error: dereferencing pointer to incomplete type
  508. /home/sdcafe/Desktop/NVIDIA-Linux-x86_64-319.17/kernel/nv-procfs.c:561:13: error: dereferencing pointer to incomplete type
  509. /home/sdcafe/Desktop/NVIDIA-Linux-x86_64-319.17/kernel/nv-procfs.c:561:13: error: dereferencing pointer to incomplete type
  510. /home/sdcafe/Desktop/NVIDIA-Linux-x86_64-319.17/kernel/nv-procfs.c:561:13: error: dereferencing pointer to incomplete type
  511. /home/sdcafe/Desktop/NVIDIA-Linux-x86_64-319.17/kernel/nv-procfs.c:566:24: error: lvalue required as unary ‘&’ operand
  512. /home/sdcafe/Desktop/NVIDIA-Linux-x86_64-319.17/kernel/nv-procfs.c:575:27: error: lvalue required as unary ‘&’ operand
  513. /home/sdcafe/Desktop/NVIDIA-Linux-x86_64-319.17/kernel/nv-procfs.c:579:17: error: lvalue required as unary ‘&’ operand
  514. /home/sdcafe/Desktop/NVIDIA-Linux-x86_64-319.17/kernel/nv-procfs.c:579:17: error: dereferencing pointer to incomplete type
  515. /home/sdcafe/Desktop/NVIDIA-Linux-x86_64-319.17/kernel/nv-procfs.c:579:17: error: dereferencing pointer to incomplete type
  516. /home/sdcafe/Desktop/NVIDIA-Linux-x86_64-319.17/kernel/nv-procfs.c:579:17: error: dereferencing pointer to incomplete type
  517. /home/sdcafe/Desktop/NVIDIA-Linux-x86_64-319.17/kernel/nv-procfs.c:579:17: error: dereferencing pointer to incomplete type
  518. /home/sdcafe/Desktop/NVIDIA-Linux-x86_64-319.17/kernel/nv-procfs.c:584:17: error: lvalue required as unary ‘&’ operand
  519. /home/sdcafe/Desktop/NVIDIA-Linux-x86_64-319.17/kernel/nv-procfs.c:584:17: error: dereferencing pointer to incomplete type
  520. /home/sdcafe/Desktop/NVIDIA-Linux-x86_64-319.17/kernel/nv-procfs.c:584:17: error: dereferencing pointer to incomplete type
  521. /home/sdcafe/Desktop/NVIDIA-Linux-x86_64-319.17/kernel/nv-procfs.c:584:17: error: dereferencing pointer to incomplete type
  522. /home/sdcafe/Desktop/NVIDIA-Linux-x86_64-319.17/kernel/nv-procfs.c:584:17: error: dereferencing pointer to incomplete type
  523. make[4]: *** [/home/sdcafe/Desktop/NVIDIA-Linux-x86_64-319.17/kernel/nv-procfs.o] Error 1
  524. make[3]: *** [_module_/home/sdcafe/Desktop/NVIDIA-Linux-x86_64-319.17/kernel] Error 2
  525. make[2]: *** [sub-make] Error 2
  526. NVIDIA: left KBUILD.
  527. nvidia.ko failed to build!
  528. make[1]: *** [module] Error 1
  529. make: *** [module] Error 2
  530. -> Error.
  531. ERROR: Unable to build the NVIDIA kernel module.
  532. ERROR: Installation has failed. Please see the file '/var/log/nvidia-installer.log' for details. You may find suggestions on fixing installation problems in the README available on the Linux driver download page at www.nvidia.com.
RAW Paste Data