SHARE
TWEET

Untitled

a guest May 21st, 2019 79 Never
Not a member of Pastebin yet? Sign Up, it unlocks many cool features!
  1. [   +1 ms] D8: Program type already present: android.support.v4.app.INotificationSideChannel
  2. [   +3 ms] FAILURE: Build failed with an exception.
  3. [        ] * What went wrong:
  4. [        ] Execution failed for task ':app:transformDexArchiveWithExternalLibsDexMergerForDebug'.
  5. [        ] 68 actionable tasks: 6 executed, 62 up-to-date
  6. [        ]          *********************************************************
  7. [        ] WARNING: This version of firebase_messaging will break your Android build if it or its dependencies aren't compatible with AndroidX.
  8. [        ]          See https://goo.gl/CP92wY for more information on the problem and how to fix it.
  9. [   +1 ms]          This warning prints for all Android build failures. The real root cause of the error may be unrelated.
  10. [        ]          *********************************************************
  11. [        ] > com.android.builder.dexing.DexArchiveMergerException: Error while merging dex archives:
  12. C:\Users\herrm\Documents\Flutter\refereepro_fans\build\app\intermediates\transforms\dexBuilder\debug\2.jar,
  13. C:\Users\herrm\Documents\Flutter\refereepro_fans\build\app\intermediates\transforms\dexBuilder\debug\3.jar,
  14. C:\Users\herrm\Documents\Flutter\refereepro_fans\build\app\intermediates\transforms\dexBuilder\debug\4.jar,
  15. C:\Users\herrm\Documents\Flutter\refereepro_fans\build\app\intermediates\transforms\dexBuilder\debug\5.jar,
  16. C:\Users\herrm\Documents\Flutter\refereepro_fans\build\app\intermediates\transforms\dexBuilder\debug\6.jar,
  17. C:\Users\herrm\Documents\Flutter\refereepro_fans\build\app\intermediates\transforms\dexBuilder\debug\7.jar,
  18. C:\Users\herrm\Documents\Flutter\refereepro_fans\build\app\intermediates\transforms\dexBuilder\debug\8.jar,
  19. C:\Users\herrm\Documents\Flutter\refereepro_fans\build\app\intermediates\transforms\dexBuilder\debug\9.jar,
  20. C:\Users\herrm\Documents\Flutter\refereepro_fans\build\app\intermediates\transforms\dexBuilder\debug\10.jar,
  21. C:\Users\herrm\Documents\Flutter\refereepro_fans\build\app\intermediates\transforms\dexBuilder\debug\11.jar,
  22. C:\Users\herrm\Documents\Flutter\refereepro_fans\build\app\intermediates\transforms\dexBuilder\debug\12.jar,
  23. C:\Users\herrm\Documents\Flutter\refereepro_fans\build\app\intermediates\transforms\dexBuilder\debug\13.jar,
  24. C:\Users\herrm\Documents\Flutter\refereepro_fans\build\app\intermediates\transforms\dexBuilder\debug\14.jar,
  25. C:\Users\herrm\Documents\Flutter\refereepro_fans\build\app\intermediates\transforms\dexBuilder\debug\15.jar,
  26. C:\Users\herrm\Documents\Flutter\refereepro_fans\build\app\intermediates\transforms\dexBuilder\debug\16.jar,
  27. C:\Users\herrm\Documents\Flutter\refereepro_fans\build\app\intermediates\transforms\dexBuilder\debug\17.jar,
  28. C:\Users\herrm\Documents\Flutter\refereepro_fans\build\app\intermediates\transforms\dexBuilder\debug\18.jar,
  29. C:\Users\herrm\Documents\Flutter\refereepro_fans\build\app\intermediates\transforms\dexBuilder\debug\19.jar,
  30. C:\Users\herrm\Documents\Flutter\refereepro_fans\build\app\intermediates\transforms\dexBuilder\debug\20.jar,
  31. C:\Users\herrm\Documents\Flutter\refereepro_fans\build\app\intermediates\transforms\dexBuilder\debug\21.jar,
  32. C:\Users\herrm\Documents\Flutter\refereepro_fans\build\app\intermediates\transforms\dexBuilder\debug\22.jar,
  33. C:\Users\herrm\Documents\Flutter\refereepro_fans\build\app\intermediates\transforms\dexBuilder\debug\23.jar,
  34. C:\Users\herrm\Documents\Flutter\refereepro_fans\build\app\intermediates\transforms\dexBuilder\debug\24.jar,
  35. C:\Users\herrm\Documents\Flutter\refereepro_fans\build\app\intermediates\transforms\dexBuilder\debug\25.jar,
  36. C:\Users\herrm\Documents\Flutter\refereepro_fans\build\app\intermediates\transforms\dexBuilder\debug\26.jar,
  37. C:\Users\herrm\Documents\Flutter\refereepro_fans\build\app\intermediates\transforms\dexBuilder\debug\27.jar,
  38. C:\Users\herrm\Documents\Flutter\refereepro_fans\build\app\intermediates\transforms\dexBuilder\debug\28.jar,
  39. C:\Users\herrm\Documents\Flutter\refereepro_fans\build\app\intermediates\transforms\dexBuilder\debug\29.jar,
  40. C:\Users\herrm\Documents\Flutter\refereepro_fans\build\app\intermediates\transforms\dexBuilder\debug\30.jar,
  41. C:\Users\herrm\Documents\Flutter\refereepro_fans\build\app\intermediates\transforms\dexBuilder\debug\31.jar,
  42. C:\Users\herrm\Documents\Flutter\refereepro_fans\build\app\intermediates\transforms\dexBuilder\debug\32.jar,
  43. C:\Users\herrm\Documents\Flutter\refereepro_fans\build\app\intermediates\transforms\dexBuilder\debug\33.jar,
  44. C:\Users\herrm\Documents\Flutter\refereepro_fans\build\app\intermediates\transforms\dexBuilder\debug\34.jar,
  45. C:\Users\herrm\Documents\Flutter\refereepro_fans\build\app\intermediates\transforms\dexBuilder\debug\35.jar,
  46. C:\Users\herrm\Documents\Flutter\refereepro_fans\build\app\intermediates\transforms\dexBuilder\debug\42.jar,
  47. C:\Users\herrm\Documents\Flutter\refereepro_fans\build\app\intermediates\transforms\dexBuilder\debug\43.jar,
  48. C:\Users\herrm\Documents\Flutter\refereepro_fans\build\app\intermediates\transforms\dexBuilder\debug\45.jar,
  49. C:\Users\herrm\Documents\Flutter\refereepro_fans\build\app\intermediates\transforms\dexBuilder\debug\46.jar,
  50. C:\Users\herrm\Documents\Flutter\refereepro_fans\build\app\intermediates\transforms\dexBuilder\debug\50.jar,
  51. C:\Users\herrm\Documents\Flutter\refereepro_fans\build\app\intermediates\transforms\dexBuilder\debug\53.jar,
  52. C:\Users\herrm\Documents\Flutter\refereepro_fans\build\app\intermediates\transforms\dexBuilder\debug\54.jar,
  53. C:\Users\herrm\Documents\Flutter\refereepro_fans\build\app\intermediates\transforms\dexBuilder\debug\55.jar,
  54. C:\Users\herrm\Documents\Flutter\refereepro_fans\build\app\intermediates\transforms\dexBuilder\debug\57.jar,
  55. C:\Users\herrm\Documents\Flutter\refereepro_fans\build\app\intermediates\transforms\dexBuilder\debug\58.jar,
  56. C:\Users\herrm\Documents\Flutter\refereepro_fans\build\app\intermediates\transforms\dexBuilder\debug\62.jar,
  57. C:\Users\herrm\Documents\Flutter\refereepro_fans\build\app\intermediates\transforms\dexBuilder\debug\63.jar,
  58. C:\Users\herrm\Documents\Flutter\refereepro_fans\build\app\intermediates\transforms\dexBuilder\debug\64.jar,
  59. C:\Users\herrm\Documents\Flutter\refereepro_fans\build\app\intermediates\transforms\dexBuilder\debug\65.jar,
  60. C:\Users\herrm\Documents\Flutter\refereepro_fans\build\app\intermediates\transforms\dexBuilder\debug\66.jar
  61. [   +5 ms]   Learn how to resolve the issue at https://developer.android.com/studio/build/dependencies#duplicate_classes.
  62. [   +5 ms]   Program type already present: android.support.v4.app.INotificationSideChannel
  63. [   +5 ms] * Try:
  64. [   +1 ms] Run with --stacktrace option to get the stack trace. Run with --info or --debug option to get more log output. Run with --scan to get full insights.
  65. [   +1 ms] * Get more help at https://help.gradle.org
  66. [        ] BUILD FAILED in 13s
  67. [ +326 ms] Running Gradle task 'assembleDebug'... (completed in 14.4s)
  68. [   +1 ms] *******************************************************************************************
  69. [   +1 ms] The Gradle failure may have been because of AndroidX incompatibilities in this Flutter app.
  70. [   +1 ms] See https://goo.gl/CP92wY for more information on the problem and how to fix it.
  71. [        ] *******************************************************************************************
  72. [   +2 ms] "flutter run" took 22,916ms.
  73. [        ] "flutter run" took 22,916ms.
  74. Gradle task assembleDebug failed with exit code 1
  75.  
  76. #0      throwToolExit (package:flutter_tools/src/base/common.dart:24:3)
  77. #1      _buildGradleProjectV2 (package:flutter_tools/src/android/gradle.dart:478:5)
  78. <asynchronous suspension>
  79. #2      buildGradleProject (package:flutter_tools/src/android/gradle.dart:346:14)
  80. <asynchronous suspension>
  81. #3      buildApk (package:flutter_tools/src/android/apk.dart:34:9)
  82. <asynchronous suspension>
  83. #4      AndroidDevice.startApp (package:flutter_tools/src/android/android_device.dart:377:13)
  84. <asynchronous suspension>
  85. #5      FlutterDevice.runHot (package:flutter_tools/src/resident_runner.dart:364:54)
  86. <asynchronous suspension>
  87. #6      HotRunner.run (package:flutter_tools/src/run_hot.dart:253:39)
  88. <asynchronous suspension>
  89. #7      RunCommand.runCommand (package:flutter_tools/src/commands/run.dart:428:37)
  90. <asynchronous suspension>
  91. #8      FlutterCommand.verifyThenRunCommand (package:flutter_tools/src/runner/flutter_command.dart:559:18)
  92. #9      _asyncThenWrapperHelper.<anonymous closure> (dart:async-patch/async_patch.dart:77:64)
  93. #10     _rootRunUnary (dart:async/zone.dart:1132:38)
  94. #11     _CustomZone.runUnary (dart:async/zone.dart:1029:19)
  95. #12     _FutureListener.handleValue (dart:async/future_impl.dart:126:18)
  96. #13     Future._propagateToListeners.handleValueCallback (dart:async/future_impl.dart:639:45)
  97. #14     Future._propagateToListeners (dart:async/future_impl.dart:668:32)
  98. #15     Future._complete (dart:async/future_impl.dart:473:7)
  99. #16     _SyncCompleter.complete (dart:async/future_impl.dart:51:12)
  100. #17     _AsyncAwaitCompleter.complete (dart:async-patch/async_patch.dart:28:18)
  101. #18     _completeOnAsyncReturn (dart:async-patch/async_patch.dart:294:13)
  102. #19     RunCommand.usageValues (package:flutter_tools/src/commands/run.dart)
  103. #20     _asyncThenWrapperHelper.<anonymous closure> (dart:async-patch/async_patch.dart:77:64)
  104. #21     _rootRunUnary (dart:async/zone.dart:1132:38)
  105. #22     _CustomZone.runUnary (dart:async/zone.dart:1029:19)
  106. #23     _FutureListener.handleValue (dart:async/future_impl.dart:126:18)
  107. #24     Future._propagateToListeners.handleValueCallback (dart:async/future_impl.dart:639:45)
  108. #25     Future._propagateToListeners (dart:async/future_impl.dart:668:32)
  109. #26     Future._complete (dart:async/future_impl.dart:473:7)
  110. #27     _SyncCompleter.complete (dart:async/future_impl.dart:51:12)
  111. #28     _AsyncAwaitCompleter.complete.<anonymous closure> (dart:async-patch/async_patch.dart:33:20)
  112. #29     _rootRun (dart:async/zone.dart:1124:13)
  113. #30     _CustomZone.run (dart:async/zone.dart:1021:19)
  114. #31     _CustomZone.bindCallback.<anonymous closure> (dart:async/zone.dart:947:23)
  115. #32     _microtaskLoop (dart:async/schedule_microtask.dart:41:21)
  116. #33     _startMicrotaskLoop (dart:async/schedule_microtask.dart:50:5)
  117. #34     _runPendingImmediateCallback (dart:isolate-patch/isolate_patch.dart:115:13)
  118. #35     _RawReceivePortImpl._handleMessage (dart:isolate-patch/isolate_patch.dart:172:5)
RAW Paste Data
We use cookies for various purposes including analytics. By continuing to use Pastebin, you agree to our use of cookies as described in the Cookies Policy. OK, I Understand
 
Top