SHARE
TWEET

Untitled

a guest Oct 12th, 2019 103 Never
Not a member of Pastebin yet? Sign Up, it unlocks many cool features!
  1. make[1]: *** [bindings.target.mk:110: Release/obj.target/bindings/src/node_ext2fs.o] Error 1
  2. make[1]: Leaving directory '/var/tmp/pamac-build-alex/balena-etcher/src/etcher/node_modules/ext2fs/build'
  3. gyp ERR! build error
  4. gyp ERR! stack Error: `make` failed with exit code: 2
  5. gyp ERR! stack     at ChildProcess.onExit (/home/alex/.npm/_npx/16138/lib/node_modules/npm/node_modules/node-gyp/lib/build.js:196:23)
  6. gyp ERR! stack     at ChildProcess.emit (events.js:210:5)
  7. gyp ERR! stack     at Process.ChildProcess._handle.onexit (internal/child_process.js:272:12)
  8. gyp ERR! System Linux 5.2.20-1-MANJARO
  9. gyp ERR! command "/usr/bin/node" "/home/alex/.npm/_npx/16138/lib/node_modules/npm/node_modules/node-gyp/bin/node-gyp.js" "rebuild"
  10. gyp ERR! cwd /var/tmp/pamac-build-alex/balena-etcher/src/etcher/node_modules/ext2fs
  11. gyp ERR! node -v v12.11.1
  12. gyp ERR! node-gyp -v v5.0.3
  13. gyp ERR! not ok
  14. npm ERR! code ELIFECYCLE
  15. npm ERR! errno 1
  16. npm ERR! ext2fs@1.0.29 install: `prebuild-install || node-gyp rebuild`
  17. npm ERR! Exit status 1
  18. npm ERR!
  19. npm ERR! Failed at the ext2fs@1.0.29 install script.
  20. npm ERR! This is probably not a problem with npm. There is likely additional logging output above.
  21.  
  22. npm ERR! A complete log of this run can be found in:
  23. npm ERR!     /home/alex/.npm/_logs/2019-10-13T01_17_26_778Z-debug.log
  24. make: *** [Makefile:97: electron-develop] Error 1
  25. ==> ERROR: A failure occurred in build().
  26.     Aborting...
RAW Paste Data
We use cookies for various purposes including analytics. By continuing to use Pastebin, you agree to our use of cookies as described in the Cookies Policy. OK, I Understand
 
Top