Guest User

Untitled

a guest
Nov 4th, 2014
201
Never
Not a member of Pastebin yet? Sign Up, it unlocks many cool features!
  1. cd /usr/ports/lang/gcc48/ && make install clean
  2. ===> gcc-4.8.2.s20130808 depends on file: /usr/local/bin/as - not found
  3. ===> Verifying install for /usr/local/bin/as in /usr/ports/devel/binutils
  4. ===> binutils-2.24_1 depends on file: /usr/local/lib/libgmp.so - not found
  5. ===> Verifying install for /usr/local/lib/libgmp.so in /usr/ports/math/gmp
  6. ===> Building for gmp-5.1.3_2
  7. cc -std=gnu99 `test -f 'gen-fac.c' || echo './'`gen-fac.c -o gen-fac
  8. cc -std=gnu99 `test -f 'gen-fib.c' || echo './'`gen-fib.c -o gen-fib
  9. cc -std=gnu99 `test -f 'gen-bases.c' || echo './'`gen-bases.c -o gen-bases -lm
  10. cc -std=gnu99 `test -f 'gen-trialdivtab.c' || echo './'`gen-trialdivtab.c -o gen-trialdivtab -lm
  11. cc -std=gnu99 `test -f 'gen-jacobitab.c' || echo './'`gen-jacobitab.c -o gen-jacobitab
  12. cc -std=gnu99 `test -f 'gen-psqr.c' || echo './'`gen-psqr.c -o gen-psqr -lm
  13. cd . && /bin/sh ./config.status gmp.h
  14. cd . && /bin/sh ./config.status config.h
  15. /tmp//cc0NmiyK.o: file not recognized: File format not recognized
  16. *** [gen-jacobitab] Error code 1
  17. config.status: creating config.h
  18. config.status: creating gmp.h
  19. config.status: config.h is unchanged
  20. /tmp//ccMHwVpj.o: file not recognized: File format not recognized
  21. *** [gen-psqr] Error code 1
  22. /tmp//ccreFIuM.o: file not recognized: File format not recognized
  23. *** [gen-fib] Error code 1
  24. /tmp//cc9f9X4s.o: file not recognized: File format not recognized
  25. *** [gen-fac] Error code 1
  26. /tmp//ccrQLqTk.o: file not recognized: File format not recognized
  27. *** [gen-trialdivtab] Error code 1
  28. /tmp//ccPpJSFA.o: file not recognized: File format not recognized
  29. *** [gen-bases] Error code 1
  30. 6 errors
  31. ===> Compilation failed unexpectedly.
  32. Try to set MAKE_JOBS_UNSAFE=yes and rebuild before reporting the failure to
  33. the maintainer.
  34. *** [do-build] Error code 1
  35.  
  36. Stop in /usr/ports/math/gmp.
  37. *** [install] Error code 1
  38.  
  39. Stop in /usr/ports/math/gmp.
  40. *** [build-depends] Error code 1
  41.  
  42. Stop in /usr/ports/devel/binutils.
  43. *** [install] Error code 1
  44.  
  45. Stop in /usr/ports/devel/binutils.
  46. *** [build-depends] Error code 1
  47.  
  48. Stop in /usr/ports/lang/gcc48.
  49. *** [install] Error code 1
  50.  
  51. Stop in /usr/ports/lang/gcc48.
RAW Paste Data