Advertisement
colin-stephane

Untitled

Jul 6th, 2022
787
Never
Not a member of Pastebin yet? Sign Up, it unlocks many cool features!
Bash 1.63 KB | None
  1. libtool: link: gcc -fvisibility=hidden -DUNITDIR=\"./unit/\" -DCERTDIR=\"./unit/\" -DJSMN_PARENT_LINKS -DJSMN_STRICT -g -O2 -ffile-prefix-map=/home/bigbob/tmp/Building/iwd/iwd=. -flto=auto -ffat-lto-objects -fstack-protector-strong -Wformat -Werror=format-security -Wl,-Bsymbolic-functions -flto=auto -Wl,-z -Wl,relro -Wl,-z -Wl,now -o unit/test-ssid-security unit/test-ssid-security.o src/ie.o src/common.o  -lell
  2. /usr/bin/ld: /tmp/ccZZNPWh.ltrans0.ltrans.o: in function `sae_choose_next_group':
  3. ./src/sae.c:144: undefined reference to `__wrap_l_ecc_supported_ike_groups'
  4. /usr/bin/ld: /tmp/ccZZNPWh.ltrans0.ltrans.o: in function `sae_rx_authenticate':
  5. ./src/sae.c:186: undefined reference to `__wrap_l_ecc_supported_ike_groups'
  6. /usr/bin/ld: /tmp/ccZZNPWh.ltrans0.ltrans.o: in function `handshake_state_free':
  7. ./src/handshake.c:49: undefined reference to `__wrap_l_ecc_supported_ike_groups'
  8. /usr/bin/ld: /tmp/ccZZNPWh.ltrans0.ltrans.o:./src/handshake.c:49: undefined reference to `__wrap_l_ecc_supported_ike_groups'
  9. collect2: error: ld returned 1 exit status
  10. make[5]: *** [Makefile:2145: unit/test-sae] Error 1
  11. make[5]: *** Waiting for unfinished jobs....
  12. make[4]: *** [Makefile:2884: check-TESTS] Error 2
  13. make[3]: *** [Makefile:3241: check-am] Error 2
  14. make[2]: *** [Makefile:3243: check] Error 2
  15. make[2]: Leaving directory '/home/bigbob/tmp/Building/iwd/iwd'
  16. make[1]: *** [debian/rules:21: override_dh_auto_test] Error 2
  17. make[1]: Leaving directory '/home/bigbob/tmp/Building/iwd/iwd'
  18. make: *** [debian/rules:15: binary] Error 2
  19. dpkg-buildpackage: error: debian/rules binary subprocess returned exit status 2
  20. bigbob@bigbob-UX331UN:~/tmp/Building/iwd/iwd$
Advertisement
RAW Paste Data Copied
Advertisement