Guest User

asdfk

a guest
Mar 24th, 2014
105
Never
Not a member of Pastebin yet? Sign Up, it unlocks many cool features!
  1. /home/centoslive/Downloads/minetest-master/src/nodedef.h:87: error: ‘aabb3f’ does not name a type
  2. /home/centoslive/Downloads/minetest-master/src/nodedef.h:93: error: ‘u16’ has not been declared
  3. /home/centoslive/Downloads/minetest-master/src/nodedef.h:128: error: ‘u16’ has not been declared
  4. /home/centoslive/Downloads/minetest-master/src/nodedef.h:188: error: ‘u8’ does not name a type
  5. /home/centoslive/Downloads/minetest-master/src/nodedef.h:191: error: ‘video’ has not been declared
  6. /home/centoslive/Downloads/minetest-master/src/nodedef.h:191: error: ISO C++ forbids declaration of ‘SColor’ with no type
  7. /home/centoslive/Downloads/minetest-master/src/nodedef.h:191: error: expected ‘;’ before ‘post_effect_color’
  8. /home/centoslive/Downloads/minetest-master/src/nodedef.h:214: error: ‘u8’ does not name a type
  9. /home/centoslive/Downloads/minetest-master/src/nodedef.h:224: error: ‘u8’ does not name a type
  10. /home/centoslive/Downloads/minetest-master/src/nodedef.h:230: error: ‘u8’ does not name a type
  11. /home/centoslive/Downloads/minetest-master/src/nodedef.h:231: error: ‘u8’ does not name a type
  12. /home/centoslive/Downloads/minetest-master/src/nodedef.h:233: error: ‘u8’ does not name a type
  13. /home/centoslive/Downloads/minetest-master/src/nodedef.h:234: error: ‘u32’ does not name a type
  14. /home/centoslive/Downloads/minetest-master/src/nodedef.h:238: error: ‘u8’ does not name a type
  15. /home/centoslive/Downloads/minetest-master/src/nodedef.h:257: error: ‘u16’ has not been declared
  16. /home/centoslive/Downloads/minetest-master/src/nodedef.h:259: error: ‘u16’ has not been declared
  17. /home/centoslive/Downloads/minetest-master/src/nodedef.h:280: error: ‘get’ declared as a ‘virtual’ field
  18. /home/centoslive/Downloads/minetest-master/src/nodedef.h:280: error: expected ‘;’ before ‘(’ token
  19. /home/centoslive/Downloads/minetest-master/src/nodedef.h:282: error: ‘content_t’ has not been declared
  20. /home/centoslive/Downloads/minetest-master/src/nodedef.h:283: error: ‘content_t’ does not name a type
  21. /home/centoslive/Downloads/minetest-master/src/nodedef.h:285: error: ‘content_t’ was not declared in this scope
  22. /home/centoslive/Downloads/minetest-master/src/nodedef.h:285: error: template argument 1 is invalid
  23. /home/centoslive/Downloads/minetest-master/src/nodedef.h:285: error: template argument 2 is invalid
  24. /home/centoslive/Downloads/minetest-master/src/nodedef.h:285: error: template argument 3 is invalid
  25. /home/centoslive/Downloads/minetest-master/src/nodedef.h:289: error: ‘u16’ has not been declared
  26. /home/centoslive/Downloads/minetest-master/src/nodedef.h:299: error: ‘get’ declared as a ‘virtual’ field
  27. /home/centoslive/Downloads/minetest-master/src/nodedef.h:299: error: expected ‘;’ before ‘(’ token
  28. /home/centoslive/Downloads/minetest-master/src/nodedef.h:301: error: ‘content_t’ has not been declared
  29. /home/centoslive/Downloads/minetest-master/src/nodedef.h:303: error: ‘content_t’ does not name a type
  30. /home/centoslive/Downloads/minetest-master/src/nodedef.h:305: error: ‘content_t’ was not declared in this scope
  31. /home/centoslive/Downloads/minetest-master/src/nodedef.h:305: error: template argument 1 is invalid
  32. /home/centoslive/Downloads/minetest-master/src/nodedef.h:305: error: template argument 2 is invalid
  33. /home/centoslive/Downloads/minetest-master/src/nodedef.h:305: error: template argument 3 is invalid
  34. /home/centoslive/Downloads/minetest-master/src/nodedef.h:312: error: ‘content_t’ does not name a type
  35. /home/centoslive/Downloads/minetest-master/src/nodedef.h:315: error: ‘content_t’ does not name a type
  36. /home/centoslive/Downloads/minetest-master/src/nodedef.h:328: error: ‘u16’ has not been declared
  37. In file included from /home/centoslive/Downloads/minetest-master/src/script/common/c_content.cpp:23:
  38. /home/centoslive/Downloads/minetest-master/src/itemdef.h:59: error: ‘v3f’ does not name a type
  39. /home/centoslive/Downloads/minetest-master/src/itemdef.h:64: error: ‘s16’ does not name a type
  40. /home/centoslive/Downloads/minetest-master/src/itemdef.h:71: error: ‘f32’ does not name a type
  41. /home/centoslive/Downloads/minetest-master/src/itemdef.h:86: error: ‘u16’ has not been declared
  42. /home/centoslive/Downloads/minetest-master/src/itemdef.h:115: error: ‘u16’ has not been declared
  43. /home/centoslive/Downloads/minetest-master/src/itemdef.h:152: error: ‘u16’ has not been declared
  44. In file included from /home/centoslive/Downloads/minetest-master/src/script/common/c_content.cpp:24:
  45. /home/centoslive/Downloads/minetest-master/src/object_properties.h:32: error: ‘s16’ does not name a type
  46. /home/centoslive/Downloads/minetest-master/src/object_properties.h:36: error: ‘core’ has not been declared
  47. /home/centoslive/Downloads/minetest-master/src/object_properties.h:36: error: ISO C++ forbids declaration of ‘aabbox3d’ with no type
  48. /home/centoslive/Downloads/minetest-master/src/object_properties.h:36: error: expected ‘;’ before ‘<’ token
  49. /home/centoslive/Downloads/minetest-master/src/object_properties.h:39: error: ‘v2f’ does not name a type
  50. /home/centoslive/Downloads/minetest-master/src/object_properties.h:41: error: ‘video’ was not declared in this scope
  51. /home/centoslive/Downloads/minetest-master/src/object_properties.h:41: error: template argument 1 is invalid
  52. /home/centoslive/Downloads/minetest-master/src/object_properties.h:41: error: template argument 2 is invalid
  53. /home/centoslive/Downloads/minetest-master/src/object_properties.h:42: error: ‘v2s16’ does not name a type
  54. /home/centoslive/Downloads/minetest-master/src/object_properties.h:43: error: ‘v2s16’ does not name a type
  55. /home/centoslive/Downloads/minetest-master/src/object_properties.h:47: error: ‘f32’ does not name a type
  56. /home/centoslive/Downloads/minetest-master/src/object_properties.h:49: error: ‘f32’ does not name a type
  57. In file included from /home/centoslive/Downloads/minetest-master/src/script/cpp_api/s_node.h:26,
  58. from /home/centoslive/Downloads/minetest-master/src/script/common/c_content.cpp:25:
  59. /home/centoslive/Downloads/minetest-master/src/script/cpp_api/s_base.h:82: error: ‘u16’ has not been declared
  60. In file included from /home/centoslive/Downloads/minetest-master/src/script/cpp_api/s_nodemeta.h:24,
  61. from /home/centoslive/Downloads/minetest-master/src/script/cpp_api/s_node.h:27,
  62. from /home/centoslive/Downloads/minetest-master/src/script/common/c_content.cpp:25:
  63. /home/centoslive/Downloads/minetest-master/src/script/cpp_api/s_item.h:40: error: ‘v3f’ has not been declared
  64. In file included from /home/centoslive/Downloads/minetest-master/src/script/cpp_api/s_node.h:27,
  65. from /home/centoslive/Downloads/minetest-master/src/script/common/c_content.cpp:25:
  66. /home/centoslive/Downloads/minetest-master/src/script/cpp_api/s_nodemeta.h:38: error: ‘v3s16’ has not been declared
  67. /home/centoslive/Downloads/minetest-master/src/script/cpp_api/s_nodemeta.h:43: error: ‘v3s16’ has not been declared
  68. /home/centoslive/Downloads/minetest-master/src/script/cpp_api/s_nodemeta.h:47: error: ‘v3s16’ has not been declared
  69. /home/centoslive/Downloads/minetest-master/src/script/cpp_api/s_nodemeta.h:51: error: ‘v3s16’ has not been declared
  70. /home/centoslive/Downloads/minetest-master/src/script/cpp_api/s_nodemeta.h:56: error: ‘v3s16’ has not been declared
  71. /home/centoslive/Downloads/minetest-master/src/script/cpp_api/s_nodemeta.h:60: error: ‘v3s16’ has not been declared
  72. In file included from /home/centoslive/Downloads/minetest-master/src/script/common/c_content.cpp:25:
  73. /home/centoslive/Downloads/minetest-master/src/script/cpp_api/s_node.h:40: error: ‘v3s16’ has not been declared
  74. /home/centoslive/Downloads/minetest-master/src/script/cpp_api/s_node.h:42: error: ‘v3s16’ has not been declared
  75. /home/centoslive/Downloads/minetest-master/src/script/cpp_api/s_node.h:44: error: ‘v3s16’ has not been declared
  76. /home/centoslive/Downloads/minetest-master/src/script/cpp_api/s_node.h:45: error: ‘v3s16’ has not been declared
  77. /home/centoslive/Downloads/minetest-master/src/script/cpp_api/s_node.h:46: error: ‘v3s16’ has not been declared
  78. /home/centoslive/Downloads/minetest-master/src/script/cpp_api/s_node.h:47: error: ‘v3s16’ has not been declared
  79. /home/centoslive/Downloads/minetest-master/src/script/cpp_api/s_node.h:47: error: ‘f32’ has not been declared
  80. /home/centoslive/Downloads/minetest-master/src/script/cpp_api/s_node.h:48: error: ‘v3s16’ has not been declared
  81. /home/centoslive/Downloads/minetest-master/src/script/cpp_api/s_node.h:52: error: ‘v3s16’ has not been declared
  82. /home/centoslive/Downloads/minetest-master/src/script/cpp_api/s_node.h:53: error: ‘v3s16’ has not been declared
  83. In file included from /home/centoslive/Downloads/minetest-master/src/script/common/c_content.cpp:26:
  84. /home/centoslive/Downloads/minetest-master/src/script/lua_api/l_object.h:211: error: ‘u32’ does not name a type
  85. In file included from /home/centoslive/Downloads/minetest-master/src/debug.h:25,
  86. from /home/centoslive/Downloads/minetest-master/src/inventory.h:27,
  87. from /home/centoslive/Downloads/minetest-master/src/script/lua_api/l_item.h:24,
  88. from /home/centoslive/Downloads/minetest-master/src/script/common/c_content.cpp:27:
  89. /home/centoslive/Downloads/minetest-master/src/gettime.h:41: error: ‘u32’ does not name a type
  90. /home/centoslive/Downloads/minetest-master/src/gettime.h:42: error: ‘u32’ does not name a type
  91. In file included from /home/centoslive/Downloads/minetest-master/src/script/lua_api/l_item.h:24,
  92. from /home/centoslive/Downloads/minetest-master/src/script/common/c_content.cpp:27:
  93. /home/centoslive/Downloads/minetest-master/src/inventory.h:35: error: ‘u16’ has not been declared
  94. /home/centoslive/Downloads/minetest-master/src/inventory.h:36: error: ‘u16’ has not been declared
  95. /home/centoslive/Downloads/minetest-master/src/inventory.h:65: error: ‘u16’ has not been declared
  96. /home/centoslive/Downloads/minetest-master/src/inventory.h:70: error: ‘u16’ has not been declared
  97. /home/centoslive/Downloads/minetest-master/src/inventory.h:79: error: ‘u16’ does not name a type
  98. /home/centoslive/Downloads/minetest-master/src/inventory.h:86: error: ‘u16’ does not name a type
  99. /home/centoslive/Downloads/minetest-master/src/inventory.h:122: error: ‘s32’ has not been declared
  100. /home/centoslive/Downloads/minetest-master/src/inventory.h:157: error: ‘u32’ has not been declared
  101. /home/centoslive/Downloads/minetest-master/src/inventory.h:160: error: ‘u32’ has not been declared
  102. /home/centoslive/Downloads/minetest-master/src/inventory.h:166: error: ‘u16’ does not name a type
  103. /home/centoslive/Downloads/minetest-master/src/inventory.h:167: error: ‘u16’ does not name a type
  104. /home/centoslive/Downloads/minetest-master/src/inventory.h: In constructor ‘ItemStack::ItemStack()’:
  105. /home/centoslive/Downloads/minetest-master/src/inventory.h:34: error: class ‘ItemStack’ does not have any field named ‘count’
  106. /home/centoslive/Downloads/minetest-master/src/inventory.h:34: error: class ‘ItemStack’ does not have any field named ‘wear’
  107. /home/centoslive/Downloads/minetest-master/src/inventory.h: In member function ‘bool ItemStack::empty() const’:
  108. /home/centoslive/Downloads/minetest-master/src/inventory.h:54: error: ‘count’ was not declared in this scope
  109. /home/centoslive/Downloads/minetest-master/src/inventory.h: In member function ‘void ItemStack::clear()’:
  110. /home/centoslive/Downloads/minetest-master/src/inventory.h:60: error: ‘count’ was not declared in this scope
  111. /home/centoslive/Downloads/minetest-master/src/inventory.h:61: error: ‘wear’ was not declared in this scope
  112. /home/centoslive/Downloads/minetest-master/src/inventory.h: In member function ‘void ItemStack::add(int)’:
  113. /home/centoslive/Downloads/minetest-master/src/inventory.h:67: error: ‘count’ was not declared in this scope
  114. /home/centoslive/Downloads/minetest-master/src/inventory.h: In member function ‘void ItemStack::remove(int)’:
  115. /home/centoslive/Downloads/minetest-master/src/inventory.h:72: error: ‘count’ was not declared in this scope
  116. /home/centoslive/Downloads/minetest-master/src/inventory.h: In member function ‘bool ItemStack::addWear(int, IItemDefManager*)’:
  117. /home/centoslive/Downloads/minetest-master/src/inventory.h:126: error: ‘wear’ was not declared in this scope
  118. /home/centoslive/Downloads/minetest-master/src/inventory.h: At global scope:
  119. /home/centoslive/Downloads/minetest-master/src/inventory.h:174: error: ‘u32’ has not been declared
  120. /home/centoslive/Downloads/minetest-master/src/inventory.h:177: error: ‘u32’ has not been declared
  121. /home/centoslive/Downloads/minetest-master/src/inventory.h:178: error: ‘u32’ has not been declared
  122. /home/centoslive/Downloads/minetest-master/src/inventory.h:192: error: ‘u32’ does not name a type
  123. /home/centoslive/Downloads/minetest-master/src/inventory.h:193: error: ‘u32’ does not name a type
  124. /home/centoslive/Downloads/minetest-master/src/inventory.h:195: error: ‘u32’ does not name a type
  125. /home/centoslive/Downloads/minetest-master/src/inventory.h:196: error: ‘u32’ does not name a type
  126. /home/centoslive/Downloads/minetest-master/src/inventory.h:199: error: expected ‘;’ before ‘(’ token
  127. /home/centoslive/Downloads/minetest-master/src/inventory.h:200: error: expected ‘;’ before ‘(’ token
  128. /home/centoslive/Downloads/minetest-master/src/inventory.h:202: error: ‘u32’ has not been declared
  129. /home/centoslive/Downloads/minetest-master/src/inventory.h:204: error: ‘u32’ has not been declared
  130. /home/centoslive/Downloads/minetest-master/src/inventory.h:213: error: ‘u32’ has not been declared
  131. /home/centoslive/Downloads/minetest-master/src/inventory.h:218: error: ISO C++ forbids declaration of ‘u32’ with no type
  132. /home/centoslive/Downloads/minetest-master/src/inventory.h:218: error: expected ‘,’ or ‘...’ before ‘i’
  133. /home/centoslive/Downloads/minetest-master/src/inventory.h:238: error: ‘u32’ has not been declared
  134. /home/centoslive/Downloads/minetest-master/src/inventory.h:238: error: ‘u32’ has not been declared
  135. /home/centoslive/Downloads/minetest-master/src/inventory.h:241: error: ‘u32’ has not been declared
  136. /home/centoslive/Downloads/minetest-master/src/inventory.h:241: error: ‘u32’ has not been declared
  137. /home/centoslive/Downloads/minetest-master/src/inventory.h:245: error: ‘u32’ has not been declared
  138. /home/centoslive/Downloads/minetest-master/src/inventory.h:245: error: ‘u32’ has not been declared
  139. /home/centoslive/Downloads/minetest-master/src/inventory.h:245: error: ‘u32’ has not been declared
  140. /home/centoslive/Downloads/minetest-master/src/inventory.h:249: error: ‘u32’ does not name a type
  141. /home/centoslive/Downloads/minetest-master/src/inventory.h:274: error: ‘u32’ has not been declared
  142. /home/centoslive/Downloads/minetest-master/src/inventory.h:290: error: ‘s32’ does not name a type
  143. In file included from /home/centoslive/Downloads/minetest-master/src/connection.h:24,
  144. from /home/centoslive/Downloads/minetest-master/src/server.h:23,
  145. from /home/centoslive/Downloads/minetest-master/src/script/common/c_content.cpp:29:
  146. /home/centoslive/Downloads/minetest-master/src/socket.h:78: error: ‘u8’ does not name a type
  147. /home/centoslive/Downloads/minetest-master/src/socket.h: In constructor ‘IPv6AddressBytes::IPv6AddressBytes()’:
  148. /home/centoslive/Downloads/minetest-master/src/socket.h:79: error: ‘bytes’ was not declared in this scope
  149. /home/centoslive/Downloads/minetest-master/src/socket.h: At global scope:
  150. /home/centoslive/Downloads/minetest-master/src/socket.h:86: error: expected ‘)’ before ‘address’
  151. /home/centoslive/Downloads/minetest-master/src/socket.h:87: error: expected ‘)’ before ‘a’
  152. /home/centoslive/Downloads/minetest-master/src/socket.h:88: error: ‘u16’ has not been declared
  153. /home/centoslive/Downloads/minetest-master/src/socket.h:94: error: ‘u32’ has not been declared
  154. /home/centoslive/Downloads/minetest-master/src/socket.h:95: error: ‘u8’ has not been declared
  155. /home/centoslive/Downloads/minetest-master/src/socket.h:95: error: ‘u8’ has not been declared
  156. /home/centoslive/Downloads/minetest-master/src/socket.h:95: error: ‘u8’ has not been declared
  157. /home/centoslive/Downloads/minetest-master/src/socket.h:95: error: ‘u8’ has not been declared
  158. /home/centoslive/Downloads/minetest-master/src/socket.h:110: error: ‘u16’ does not name a type
  159. In file included from /home/centoslive/Downloads/minetest-master/src/connection.h:27,
  160. from /home/centoslive/Downloads/minetest-master/src/server.h:23,
  161. from /home/centoslive/Downloads/minetest-master/src/script/common/c_content.cpp:29:
  162. /home/centoslive/Downloads/minetest-master/src/util/pointer.h:293: error: ‘u8’ was not declared in this scope
  163. /home/centoslive/Downloads/minetest-master/src/util/pointer.h:293: error: template argument 1 is invalid
  164. /home/centoslive/Downloads/minetest-master/src/util/pointer.h: In function ‘int SharedBufferFromString(const char*)’:
  165. /home/centoslive/Downloads/minetest-master/src/util/pointer.h:295: error: ‘u8’ was not declared in this scope
  166. /home/centoslive/Downloads/minetest-master/src/util/pointer.h:295: error: template argument 1 is invalid
  167. /home/centoslive/Downloads/minetest-master/src/util/pointer.h:295: error: invalid type in declaration before ‘(’ token
  168. /home/centoslive/Downloads/minetest-master/src/util/pointer.h:295: error: expected primary-expression before ‘)’ token
  169. /home/centoslive/Downloads/minetest-master/src/util/pointer.h:295: error: initializer expression list treated as compound expression
  170. In file included from /home/centoslive/Downloads/minetest-master/src/connection.h:28,
  171. from /home/centoslive/Downloads/minetest-master/src/server.h:23,
  172. from /home/centoslive/Downloads/minetest-master/src/script/common/c_content.cpp:29:
  173. /home/centoslive/Downloads/minetest-master/src/util/container.h: At global scope:
  174. /home/centoslive/Downloads/minetest-master/src/util/container.h:69: error: ‘u32’ does not name a type
  175. /home/centoslive/Downloads/minetest-master/src/util/container.h:75: error: ‘u8’ was not declared in this scope
  176. /home/centoslive/Downloads/minetest-master/src/util/container.h:75: error: template argument 2 is invalid
  177. /home/centoslive/Downloads/minetest-master/src/util/container.h:75: error: template argument 4 is invalid
  178. /home/centoslive/Downloads/minetest-master/src/util/container.h: In member function ‘bool UniqueQueue<Value>::push_back(Value)’:
  179. /home/centoslive/Downloads/minetest-master/src/util/container.h:50: error: request for member ‘find’ in ‘((UniqueQueue<Value>*)this)->UniqueQueue<Value>::m_map’, which is of non-class type ‘int’
  180. /home/centoslive/Downloads/minetest-master/src/util/container.h:50: error: request for member ‘end’ in ‘((UniqueQueue<Value>*)this)->UniqueQueue<Value>::m_map’, which is of non-class type ‘int’
  181. /home/centoslive/Downloads/minetest-master/src/util/container.h: In member function ‘Value UniqueQueue<Value>::pop_front()’:
  182. /home/centoslive/Downloads/minetest-master/src/util/container.h:64: error: request for member ‘erase’ in ‘((UniqueQueue<Value>*)this)->UniqueQueue<Value>::m_map’, which is of non-class type ‘int’
  183. /home/centoslive/Downloads/minetest-master/src/util/container.h: At global scope:
  184. /home/centoslive/Downloads/minetest-master/src/util/container.h:154: error: ‘u32’ has not been declared
  185. /home/centoslive/Downloads/minetest-master/src/util/container.h:167: error: ‘u32’ does not name a type
  186. /home/centoslive/Downloads/minetest-master/src/util/container.h:184: error: ‘u32’ was not declared in this scope
  187. /home/centoslive/Downloads/minetest-master/src/util/container.h:184: error: template argument 2 is invalid
  188. /home/centoslive/Downloads/minetest-master/src/util/container.h:184: error: template argument 4 is invalid
  189. /home/centoslive/Downloads/minetest-master/src/util/container.h:233: error: ‘u32’ does not name a type
  190. /home/centoslive/Downloads/minetest-master/src/util/container.h:245: error: ‘u32’ does not name a type
  191. /home/centoslive/Downloads/minetest-master/src/util/container.h: In constructor ‘Queue<T>::Queue()’:
  192. /home/centoslive/Downloads/minetest-master/src/util/container.h:195: error: class ‘Queue<T>’ does not have any field named ‘m_list_size’
  193. /home/centoslive/Downloads/minetest-master/src/util/container.h: In member function ‘void Queue<T>::push_back(T)’:
  194. /home/centoslive/Downloads/minetest-master/src/util/container.h:201: error: ‘m_list_size’ was not declared in this scope
  195. /home/centoslive/Downloads/minetest-master/src/util/container.h: In member function ‘void Queue<T>::push_front(T)’:
  196. /home/centoslive/Downloads/minetest-master/src/util/container.h:207: error: ‘m_list_size’ was not declared in this scope
  197. /home/centoslive/Downloads/minetest-master/src/util/container.h: In member function ‘T Queue<T>::pop_front()’:
  198. /home/centoslive/Downloads/minetest-master/src/util/container.h:218: error: ‘m_list_size’ was not declared in this scope
  199. /home/centoslive/Downloads/minetest-master/src/util/container.h: In member function ‘T Queue<T>::pop_back()’:
  200. /home/centoslive/Downloads/minetest-master/src/util/container.h:229: error: ‘m_list_size’ was not declared in this scope
  201. /home/centoslive/Downloads/minetest-master/src/util/container.h: At global scope:
  202. /home/centoslive/Downloads/minetest-master/src/util/container.h:277: error: ‘u32’ has not been declared
  203. /home/centoslive/Downloads/minetest-master/src/util/container.h:294: error: ‘u32’ has not been declared
  204. /home/centoslive/Downloads/minetest-master/src/util/container.h:323: error: ‘u32’ has not been declared
  205. /home/centoslive/Downloads/minetest-master/src/util/container.h:344: error: ‘u32’ has not been declared
  206. In file included from /home/centoslive/Downloads/minetest-master/src/util/thread.h:27,
  207. from /home/centoslive/Downloads/minetest-master/src/connection.h:29,
  208. from /home/centoslive/Downloads/minetest-master/src/server.h:23,
  209. from /home/centoslive/Downloads/minetest-master/src/script/common/c_content.cpp:29:
  210. /home/centoslive/Downloads/minetest-master/src/porting.h:217: error: ‘u32’ does not name a type
  211. /home/centoslive/Downloads/minetest-master/src/porting.h:224: error: ‘u32’ does not name a type
  212. /home/centoslive/Downloads/minetest-master/src/porting.h:231: error: ‘u32’ does not name a type
  213. /home/centoslive/Downloads/minetest-master/src/porting.h:238: error: ‘u32’ does not name a type
  214. /home/centoslive/Downloads/minetest-master/src/porting.h:254: error: ‘u32’ does not name a type
  215. In file included from /home/centoslive/Downloads/minetest-master/src/connection.h:30,
  216. from /home/centoslive/Downloads/minetest-master/src/server.h:23,
  217. from /home/centoslive/Downloads/minetest-master/src/script/common/c_content.cpp:29:
  218. /home/centoslive/Downloads/minetest-master/src/util/numeric.h:30: error: ‘v3s16’ was not declared in this scope
  219. /home/centoslive/Downloads/minetest-master/src/util/numeric.h:30: error: template argument 1 is invalid
  220. /home/centoslive/Downloads/minetest-master/src/util/numeric.h:30: error: template argument 2 is invalid
  221. /home/centoslive/Downloads/minetest-master/src/util/numeric.h:30: error: ‘u16’ has not been declared
  222. /home/centoslive/Downloads/minetest-master/src/util/numeric.h:35: error: expected ‘)’ before ‘*’ token
  223. /home/centoslive/Downloads/minetest-master/src/util/numeric.h:45: error: ISO C++ forbids declaration of ‘u16’ with no type
  224. /home/centoslive/Downloads/minetest-master/src/util/numeric.h:45: error: expected ‘;’ before ‘*’ token
  225. /home/centoslive/Downloads/minetest-master/src/util/numeric.h: In destructor ‘IndentationRaiser::~IndentationRaiser()’:
  226. /home/centoslive/Downloads/minetest-master/src/util/numeric.h:42: error: ‘m_indentation’ was not declared in this scope
  227. /home/centoslive/Downloads/minetest-master/src/util/numeric.h: At global scope:
  228. /home/centoslive/Downloads/minetest-master/src/util/numeric.h:48: error: ‘s16’ does not name a type
  229. /home/centoslive/Downloads/minetest-master/src/util/numeric.h:53: error: ‘v2s16’ does not name a type
  230. /home/centoslive/Downloads/minetest-master/src/util/numeric.h:61: error: ‘v3s16’ does not name a type
  231. /home/centoslive/Downloads/minetest-master/src/util/numeric.h:70: error: ‘v2s16’ does not name a type
  232. /home/centoslive/Downloads/minetest-master/src/util/numeric.h:78: error: ‘v3s16’ does not name a type
  233. /home/centoslive/Downloads/minetest-master/src/util/numeric.h:87: error: ‘isInArea’ declared as an ‘inline’ variable
  234. /home/centoslive/Downloads/minetest-master/src/util/numeric.h:87: error: ‘v3s16’ was not declared in this scope
  235. /home/centoslive/Downloads/minetest-master/src/util/numeric.h:87: error: ‘s16’ was not declared in this scope
  236. /home/centoslive/Downloads/minetest-master/src/util/numeric.h:87: error: initializer expression list treated as compound expression
  237. /home/centoslive/Downloads/minetest-master/src/util/numeric.h:88: error: expected ‘,’ or ‘;’ before ‘{’ token
  238. /home/centoslive/Downloads/minetest-master/src/util/numeric.h:96: error: ‘isInArea’ declared as an ‘inline’ variable
  239. /home/centoslive/Downloads/minetest-master/src/util/numeric.h:96: error: redefinition of ‘bool isInArea’
  240. /home/centoslive/Downloads/minetest-master/src/util/numeric.h:87: error: ‘bool isInArea’ previously defined here
  241. /home/centoslive/Downloads/minetest-master/src/util/numeric.h:96: error: ‘v2s16’ was not declared in this scope
  242. /home/centoslive/Downloads/minetest-master/src/util/numeric.h:96: error: ‘s16’ was not declared in this scope
  243. /home/centoslive/Downloads/minetest-master/src/util/numeric.h:104: error: ‘isInArea’ declared as an ‘inline’ variable
  244. /home/centoslive/Downloads/minetest-master/src/util/numeric.h:104: error: redefinition of ‘bool isInArea’
  245. /home/centoslive/Downloads/minetest-master/src/util/numeric.h:87: error: ‘bool isInArea’ previously defined here
  246. /home/centoslive/Downloads/minetest-master/src/util/numeric.h:104: error: ‘v3s16’ was not declared in this scope
  247. /home/centoslive/Downloads/minetest-master/src/util/numeric.h:104: error: ‘v3s16’ was not declared in this scope
  248. /home/centoslive/Downloads/minetest-master/src/util/numeric.h:113: error: ‘s16’ does not name a type
  249. /home/centoslive/Downloads/minetest-master/src/util/numeric.h:125: error: ‘v3s16’ does not name a type
  250. /home/centoslive/Downloads/minetest-master/src/util/numeric.h:149: error: variable or field ‘sortBoxVerticies’ declared void
  251. /home/centoslive/Downloads/minetest-master/src/util/numeric.h:149: error: ‘v3s16’ was not declared in this scope
  252. /home/centoslive/Downloads/minetest-master/src/util/numeric.h:149: error: ‘p1’ was not declared in this scope
  253. /home/centoslive/Downloads/minetest-master/src/util/numeric.h:149: error: ‘v3s16’ was not declared in this scope
  254. /home/centoslive/Downloads/minetest-master/src/util/numeric.h:149: error: ‘p2’ was not declared in this scope
  255. make[2]: *** [src/CMakeFiles/minetestserver.dir/script/common/c_content.cpp.o] Error 1
  256. make[1]: *** [src/CMakeFiles/minetestserver.dir/all] Error 2
  257. make: *** [all] Error 2
  258. [centoslive@livecd minetest-master]$ clear
  259.  
  260. [centoslive@livecd minetest-master]$ make -j4
  261. [ 1%] [ 2%] Built target sqlite3
  262. Built target jsoncpp
  263. [ 22%] Built target lua
  264. [ 22%] Built target GenerateVersion
  265. [ 23%] [ 24%] [ 24%] [ 25%] Building CXX object src/CMakeFiles/minetestserver.dir/script/common/c_content.cpp.o
  266. Building CXX object src/CMakeFiles/minetestserver.dir/script/common/c_converter.cpp.o
  267. Building CXX object src/CMakeFiles/minetestserver.dir/script/common/c_internal.cpp.o
  268. Building CXX object src/CMakeFiles/minetestserver.dir/script/common/c_types.cpp.o
  269. In file included from /home/centoslive/Downloads/minetest-master/src/util/numeric.h:23,
  270. from /home/centoslive/Downloads/minetest-master/src/script/common/c_converter.cpp:25:
  271. /home/centoslive/Downloads/minetest-master/src/util/../irrlichttypes.h:23:22: error: irrTypes.h: No such file or directory
  272. In file included from /home/centoslive/Downloads/minetest-master/src/util/numeric.h:24,
  273. from /home/centoslive/Downloads/minetest-master/src/script/common/c_converter.cpp:25:
  274. /home/centoslive/Downloads/minetest-master/src/util/../irr_v2d.h:25:22: error: vector2d.h: No such file or directory
  275. In file included from /home/centoslive/Downloads/minetest-master/src/util/numeric.h:25,
  276. from /home/centoslive/Downloads/minetest-master/src/script/common/c_converter.cpp:25:
  277. /home/centoslive/Downloads/minetest-master/src/util/../irr_v3d.h:25:22: error: vector3d.h: No such file or directory
  278. In file included from /home/centoslive/Downloads/minetest-master/src/util/numeric.h:26,
  279. from /home/centoslive/Downloads/minetest-master/src/script/common/c_converter.cpp:25:
  280. /home/centoslive/Downloads/minetest-master/src/util/../irr_aabb3d.h:25:22: error: aabbox3d.h: No such file or directory
  281. In file included from /home/centoslive/Downloads/minetest-master/src/script/common/c_converter.h:33,
  282. from /home/centoslive/Downloads/minetest-master/src/script/common/c_converter.cpp:26:
  283. /home/centoslive/Downloads/minetest-master/src/irrlichttypes_bloated.h:29:20: error: SColor.h: No such file or directory
  284. In file included from /home/centoslive/Downloads/minetest-master/src/irrlichttypes_bloated.h:23,
  285. from /home/centoslive/Downloads/minetest-master/src/script/common/c_content.h:39,
  286. from /home/centoslive/Downloads/minetest-master/src/script/common/c_content.cpp:19:
  287. /home/centoslive/Downloads/minetest-master/src/irrlichttypes.h:23:22: error: irrTypes.h: No such file or directory
  288. In file included from /home/centoslive/Downloads/minetest-master/src/irrlichttypes_bloated.h:25,
  289. from /home/centoslive/Downloads/minetest-master/src/script/common/c_content.h:39,
  290. from /home/centoslive/Downloads/minetest-master/src/script/common/c_content.cpp:19:
  291. /home/centoslive/Downloads/minetest-master/src/irr_v2d.h:25:22: error: vector2d.h: No such file or directory
  292. In file included from /home/centoslive/Downloads/minetest-master/src/irrlichttypes_bloated.h:26,
  293. from /home/centoslive/Downloads/minetest-master/src/script/common/c_content.h:39,
  294. from /home/centoslive/Downloads/minetest-master/src/script/common/c_content.cpp:19:
  295. /home/centoslive/Downloads/minetest-master/src/irr_v3d.h:25:22: error: vector3d.h: No such file or directory
  296. In file included from /home/centoslive/Downloads/minetest-master/src/irrlichttypes_bloated.h:27,
  297. from /home/centoslive/Downloads/minetest-master/src/script/common/c_content.h:39,
  298. from /home/centoslive/Downloads/minetest-master/src/script/common/c_content.cpp:19:
  299. /home/centoslive/Downloads/minetest-master/src/irr_aabb3d.h:25:22: error: aabbox3d.h: No such file or directory
  300. In file included from /home/centoslive/Downloads/minetest-master/src/script/common/c_content.h:39,
  301. from /home/centoslive/Downloads/minetest-master/src/script/common/c_content.cpp:19:
  302. /home/centoslive/Downloads/minetest-master/src/irrlichttypes_bloated.h:29:20: error: SColor.h: No such file or directory
  303. In file included from /home/centoslive/Downloads/minetest-master/src/irrlichttypes_bloated.h:23,
  304. from /home/centoslive/Downloads/minetest-master/src/irrlichttypes_extrabloated.h:23,
  305. from /home/centoslive/Downloads/minetest-master/src/itemdef.h:24,
  306. from /home/centoslive/Downloads/minetest-master/src/script/common/c_types.cpp:24:
  307. /home/centoslive/Downloads/minetest-master/src/irrlichttypes.h:23:22: error: irrTypes.h: No such file or directory
  308. In file included from /home/centoslive/Downloads/minetest-master/src/irrlichttypes_bloated.h:25,
  309. from /home/centoslive/Downloads/minetest-master/src/irrlichttypes_extrabloated.h:23,
  310. from /home/centoslive/Downloads/minetest-master/src/itemdef.h:24,
  311. from /home/centoslive/Downloads/minetest-master/src/script/common/c_types.cpp:24:
  312. /home/centoslive/Downloads/minetest-master/src/irr_v2d.h:25:22: error: vector2d.h: No such file or directory
  313. In file included from /home/centoslive/Downloads/minetest-master/src/irrlichttypes_bloated.h:26,
  314. from /home/centoslive/Downloads/minetest-master/src/irrlichttypes_extrabloated.h:23,
  315. from /home/centoslive/Downloads/minetest-master/src/itemdef.h:24,
  316. from /home/centoslive/Downloads/minetest-master/src/script/common/c_types.cpp:24:
  317. /home/centoslive/Downloads/minetest-master/src/irr_v3d.h:25:22: error: vector3d.h: No such file or directory
  318. In file included from /home/centoslive/Downloads/minetest-master/src/irrlichttypes_bloated.h:27,
  319. from /home/centoslive/Downloads/minetest-master/src/irrlichttypes_extrabloated.h:23,
  320. from /home/centoslive/Downloads/minetest-master/src/itemdef.h:24,
  321. from /home/centoslive/Downloads/minetest-master/src/script/common/c_types.cpp:24:
  322. /home/centoslive/Downloads/minetest-master/src/irr_aabb3d.h:25:22: error: aabbox3d.h: No such file or directory
  323. In file included from /home/centoslive/Downloads/minetest-master/src/irrlichttypes_extrabloated.h:23,
  324. from /home/centoslive/Downloads/minetest-master/src/itemdef.h:24,
  325. from /home/centoslive/Downloads/minetest-master/src/script/common/c_types.cpp:24:
  326. /home/centoslive/Downloads/minetest-master/src/irrlichttypes_bloated.h:29:20: error: SColor.h: No such file or directory
  327. In file included from /home/centoslive/Downloads/minetest-master/src/gettime.h:23,
  328. from /home/centoslive/Downloads/minetest-master/src/debug.h:25,
  329. from /home/centoslive/Downloads/minetest-master/src/script/common/c_internal.cpp:21:
  330. /home/centoslive/Downloads/minetest-master/src/irrlichttypes.h:23:22: error: irrTypes.h: No such file or directory
  331. In file included from /home/centoslive/Downloads/minetest-master/src/util/numeric.h:23,
  332. from /home/centoslive/Downloads/minetest-master/src/script/common/c_converter.cpp:25:
  333. /home/centoslive/Downloads/minetest-master/src/util/../irrlichttypes.h:25: error: ‘irr’ is not a namespace-name
  334. /home/centoslive/Downloads/minetest-master/src/util/../irrlichttypes.h:25: error: expected namespace-name before ‘;’ token
  335. In file included from /home/centoslive/Downloads/minetest-master/src/util/numeric.h:24,
  336. from /home/centoslive/Downloads/minetest-master/src/script/common/c_converter.cpp:25:
  337. /home/centoslive/Downloads/minetest-master/src/util/../irr_v2d.h:27: error: ‘core’ has not been declared
  338. /home/centoslive/Downloads/minetest-master/src/util/../irr_v2d.h:27: error: expected initializer before ‘<’ token
  339. /home/centoslive/Downloads/minetest-master/src/util/../irr_v2d.h:28: error: ‘core’ has not been declared
  340. /home/centoslive/Downloads/minetest-master/src/util/../irr_v2d.h:28: error: expected initializer before ‘<’ token
  341. /home/centoslive/Downloads/minetest-master/src/util/../irr_v2d.h:29: error: ‘core’ has not been declared
  342. /home/centoslive/Downloads/minetest-master/src/util/../irr_v2d.h:29: error: expected initializer before ‘<’ token
  343. /home/centoslive/Downloads/minetest-master/src/util/../irr_v2d.h:30: error: ‘core’ has not been declared
  344. /home/centoslive/Downloads/minetest-master/src/util/../irr_v2d.h:30: error: expected initializer before ‘<’ token
  345. /home/centoslive/Downloads/minetest-master/src/util/../irr_v2d.h:31: error: ‘core’ has not been declared
  346. /home/centoslive/Downloads/minetest-master/src/util/../irr_v2d.h:31: error: expected initializer before ‘<’ token
  347. In file included from /home/centoslive/Downloads/minetest-master/src/util/numeric.h:25,
  348. from /home/centoslive/Downloads/minetest-master/src/script/common/c_converter.cpp:25:
  349. /home/centoslive/Downloads/minetest-master/src/util/../irr_v3d.h:27: error: ‘core’ has not been declared
  350. /home/centoslive/Downloads/minetest-master/src/util/../irr_v3d.h:27: error: expected initializer before ‘v3f’
  351. /home/centoslive/Downloads/minetest-master/src/util/../irr_v3d.h:28: error: ‘core’ has not been declared
  352. /home/centoslive/Downloads/minetest-master/src/util/../irr_v3d.h:28: error: expected initializer before ‘<’ token
  353. /home/centoslive/Downloads/minetest-master/src/util/../irr_v3d.h:29: error: ‘core’ has not been declared
  354. /home/centoslive/Downloads/minetest-master/src/util/../irr_v3d.h:29: error: expected initializer before ‘<’ token
  355. In file included from /home/centoslive/Downloads/minetest-master/src/util/numeric.h:26,
  356. from /home/centoslive/Downloads/minetest-master/src/script/common/c_converter.cpp:25:
  357. /home/centoslive/Downloads/minetest-master/src/util/../irr_aabb3d.h:27: error: ‘core’ has not been declared
  358. /home/centoslive/Downloads/minetest-master/src/util/../irr_aabb3d.h:27: error: expected initializer before ‘<’ token
  359. In file included from /home/centoslive/Downloads/minetest-master/src/script/common/c_converter.cpp:25:
  360. /home/centoslive/Downloads/minetest-master/src/util/numeric.h:30: error: ‘v3s16’ was not declared in this scope
  361. /home/centoslive/Downloads/minetest-master/src/util/numeric.h:30: error: template argument 1 is invalid
  362. /home/centoslive/Downloads/minetest-master/src/util/numeric.h:30: error: template argument 2 is invalid
  363. /home/centoslive/Downloads/minetest-master/src/util/numeric.h:30: error: ‘u16’ has not been declared
  364. /home/centoslive/Downloads/minetest-master/src/util/numeric.h:35: error: expected ‘)’ before ‘*’ token
  365. /home/centoslive/Downloads/minetest-master/src/util/numeric.h:45: error: ISO C++ forbids declaration of ‘u16’ with no type
  366. /home/centoslive/Downloads/minetest-master/src/util/numeric.h:45: error: expected ‘;’ before ‘*’ token
  367. /home/centoslive/Downloads/minetest-master/src/util/numeric.h: In destructor ‘IndentationRaiser::~IndentationRaiser()’:
  368. /home/centoslive/Downloads/minetest-master/src/util/numeric.h:42: error: ‘m_indentation’ was not declared in this scope
  369. /home/centoslive/Downloads/minetest-master/src/util/numeric.h: At global scope:
  370. /home/centoslive/Downloads/minetest-master/src/util/numeric.h:48: error: ‘s16’ does not name a type
  371. /home/centoslive/Downloads/minetest-master/src/util/numeric.h:53: error: ‘v2s16’ does not name a type
  372. /home/centoslive/Downloads/minetest-master/src/util/numeric.h:61: error: ‘v3s16’ does not name a type
  373. /home/centoslive/Downloads/minetest-master/src/util/numeric.h:70: error: ‘v2s16’ does not name a type
  374. /home/centoslive/Downloads/minetest-master/src/util/numeric.h:78: error: ‘v3s16’ does not name a type
  375. /home/centoslive/Downloads/minetest-master/src/util/numeric.h:87: error: ‘isInArea’ declared as an ‘inline’ variable
  376. /home/centoslive/Downloads/minetest-master/src/util/numeric.h:87: error: ‘v3s16’ was not declared in this scope
  377. /home/centoslive/Downloads/minetest-master/src/util/numeric.h:87: error: ‘s16’ was not declared in this scope
  378. /home/centoslive/Downloads/minetest-master/src/util/numeric.h:87: error: initializer expression list treated as compound expression
  379. /home/centoslive/Downloads/minetest-master/src/util/numeric.h:88: error: expected ‘,’ or ‘;’ before ‘{’ token
  380. /home/centoslive/Downloads/minetest-master/src/util/numeric.h:96: error: ‘isInArea’ declared as an ‘inline’ variable
  381. /home/centoslive/Downloads/minetest-master/src/util/numeric.h:96: error: redefinition of ‘bool isInArea’
  382. /home/centoslive/Downloads/minetest-master/src/util/numeric.h:87: error: ‘bool isInArea’ previously defined here
  383. /home/centoslive/Downloads/minetest-master/src/util/numeric.h:96: error: ‘v2s16’ was not declared in this scope
  384. /home/centoslive/Downloads/minetest-master/src/util/numeric.h:96: error: ‘s16’ was not declared in this scope
  385. /home/centoslive/Downloads/minetest-master/src/util/numeric.h:104: error: ‘isInArea’ declared as an ‘inline’ variable
  386. /home/centoslive/Downloads/minetest-master/src/util/numeric.h:104: error: redefinition of ‘bool isInArea’
  387. /home/centoslive/Downloads/minetest-master/src/util/numeric.h:87: error: ‘bool isInArea’ previously defined here
  388. /home/centoslive/Downloads/minetest-master/src/util/numeric.h:104: error: ‘v3s16’ was not declared in this scope
  389. /home/centoslive/Downloads/minetest-master/src/util/numeric.h:104: error: ‘v3s16’ was not declared in this scope
  390. /home/centoslive/Downloads/minetest-master/src/util/numeric.h:113: error: ‘s16’ does not name a type
  391. /home/centoslive/Downloads/minetest-master/src/util/numeric.h:125: error: ‘v3s16’ does not name a type
  392. /home/centoslive/Downloads/minetest-master/src/util/numeric.h:149: error: variable or field ‘sortBoxVerticies’ declared void
  393. /home/centoslive/Downloads/minetest-master/src/util/numeric.h:149: error: ‘v3s16’ was not declared in this scope
  394. /home/centoslive/Downloads/minetest-master/src/util/numeric.h:149: error: ‘p1’ was not declared in this scope
  395. /home/centoslive/Downloads/minetest-master/src/util/numeric.h:149: error: ‘v3s16’ was not declared in this scope
  396. /home/centoslive/Downloads/minetest-master/src/util/numeric.h:149: error: ‘p2’ was not declared in this scope
  397. In file included from /usr/lib/gcc/i686-redhat-linux/4.4.7/../../../../include/c++/4.4.7/ext/atomicity.h:34,
  398. from /usr/lib/gcc/i686-redhat-linux/4.4.7/../../../../include/c++/4.4.7/bits/ios_base.h:41,
  399. from /usr/lib/gcc/i686-redhat-linux/4.4.7/../../../../include/c++/4.4.7/ios:43,
  400. from /usr/lib/gcc/i686-redhat-linux/4.4.7/../../../../include/c++/4.4.7/ostream:40,
  401. from /usr/lib/gcc/i686-redhat-linux/4.4.7/../../../../include/c++/4.4.7/iostream:40,
  402. from /home/centoslive/Downloads/minetest-master/src/script/common/c_types.h:27,
  403. from /home/centoslive/Downloads/minetest-master/src/script/common/c_converter.h:34,
  404. from /home/centoslive/Downloads/minetest-master/src/script/common/c_converter.cpp:26:
  405. /usr/lib/gcc/i686-redhat-linux/4.4.7/../../../../include/c++/4.4.7/i686-redhat-linux/bits/gthr.h:30: error: expected declaration before end of line
  406. make[2]: *** [src/CMakeFiles/minetestserver.dir/script/common/c_converter.cpp.o] Error 1
  407. make[2]: *** Waiting for unfinished jobs....
  408. In file included from /home/centoslive/Downloads/minetest-master/src/gettime.h:23,
  409. from /home/centoslive/Downloads/minetest-master/src/debug.h:25,
  410. from /home/centoslive/Downloads/minetest-master/src/script/common/c_internal.cpp:21:
  411. /home/centoslive/Downloads/minetest-master/src/irrlichttypes.h:25: error: ‘irr’ is not a namespace-name
  412. /home/centoslive/Downloads/minetest-master/src/irrlichttypes.h:25: error: expected namespace-name before ‘;’ token
  413. In file included from /home/centoslive/Downloads/minetest-master/src/debug.h:25,
  414. from /home/centoslive/Downloads/minetest-master/src/script/common/c_internal.cpp:21:
  415. /home/centoslive/Downloads/minetest-master/src/gettime.h:41: error: ‘u32’ does not name a type
  416. /home/centoslive/Downloads/minetest-master/src/gettime.h:42: error: ‘u32’ does not name a type
  417. make[2]: *** [src/CMakeFiles/minetestserver.dir/script/common/c_internal.cpp.o] Error 1
  418. In file included from /home/centoslive/Downloads/minetest-master/src/irrlichttypes_bloated.h:23,
  419. from /home/centoslive/Downloads/minetest-master/src/irrlichttypes_extrabloated.h:23,
  420. from /home/centoslive/Downloads/minetest-master/src/itemdef.h:24,
  421. from /home/centoslive/Downloads/minetest-master/src/script/common/c_types.cpp:24:
  422. /home/centoslive/Downloads/minetest-master/src/irrlichttypes.h:25: error: ‘irr’ is not a namespace-name
  423. /home/centoslive/Downloads/minetest-master/src/irrlichttypes.h:25: error: expected namespace-name before ‘;’ token
  424. In file included from /home/centoslive/Downloads/minetest-master/src/irrlichttypes_bloated.h:25,
  425. from /home/centoslive/Downloads/minetest-master/src/irrlichttypes_extrabloated.h:23,
  426. from /home/centoslive/Downloads/minetest-master/src/itemdef.h:24,
  427. from /home/centoslive/Downloads/minetest-master/src/script/common/c_types.cpp:24:
  428. /home/centoslive/Downloads/minetest-master/src/irr_v2d.h:27: error: ‘core’ has not been declared
  429. /home/centoslive/Downloads/minetest-master/src/irr_v2d.h:27: error: expected initializer before ‘<’ token
  430. /home/centoslive/Downloads/minetest-master/src/irr_v2d.h:28: error: ‘core’ has not been declared
  431. /home/centoslive/Downloads/minetest-master/src/irr_v2d.h:28: error: expected initializer before ‘<’ token
  432. /home/centoslive/Downloads/minetest-master/src/irr_v2d.h:29: error: ‘core’ has not been declared
  433. /home/centoslive/Downloads/minetest-master/src/irr_v2d.h:29: error: expected initializer before ‘<’ token
  434. /home/centoslive/Downloads/minetest-master/src/irr_v2d.h:30: error: ‘core’ has not been declared
  435. /home/centoslive/Downloads/minetest-master/src/irr_v2d.h:30: error: expected initializer before ‘<’ token
  436. /home/centoslive/Downloads/minetest-master/src/irr_v2d.h:31: error: ‘core’ has not been declared
  437. /home/centoslive/Downloads/minetest-master/src/irr_v2d.h:31: error: expected initializer before ‘<’ token
  438. In file included from /home/centoslive/Downloads/minetest-master/src/irrlichttypes_bloated.h:26,
  439. from /home/centoslive/Downloads/minetest-master/src/irrlichttypes_extrabloated.h:23,
  440. from /home/centoslive/Downloads/minetest-master/src/itemdef.h:24,
  441. from /home/centoslive/Downloads/minetest-master/src/script/common/c_types.cpp:24:
  442. /home/centoslive/Downloads/minetest-master/src/irr_v3d.h:27: error: ‘core’ has not been declared
  443. /home/centoslive/Downloads/minetest-master/src/irr_v3d.h:27: error: expected initializer before ‘v3f’
  444. /home/centoslive/Downloads/minetest-master/src/irr_v3d.h:28: error: ‘core’ has not been declared
  445. /home/centoslive/Downloads/minetest-master/src/irr_v3d.h:28: error: expected initializer before ‘<’ token
  446. /home/centoslive/Downloads/minetest-master/src/irr_v3d.h:29: error: ‘core’ has not been declared
  447. /home/centoslive/Downloads/minetest-master/src/irr_v3d.h:29: error: expected initializer before ‘<’ token
  448. In file included from /home/centoslive/Downloads/minetest-master/src/irrlichttypes_bloated.h:27,
  449. from /home/centoslive/Downloads/minetest-master/src/irrlichttypes_extrabloated.h:23,
  450. from /home/centoslive/Downloads/minetest-master/src/itemdef.h:24,
  451. from /home/centoslive/Downloads/minetest-master/src/script/common/c_types.cpp:24:
  452. /home/centoslive/Downloads/minetest-master/src/irr_aabb3d.h:27: error: ‘core’ has not been declared
  453. /home/centoslive/Downloads/minetest-master/src/irr_aabb3d.h:27: error: expected initializer before ‘<’ token
  454. In file included from /home/centoslive/Downloads/minetest-master/src/itemdef.h:29,
  455. from /home/centoslive/Downloads/minetest-master/src/script/common/c_types.cpp:24:
  456. /home/centoslive/Downloads/minetest-master/src/sound.h:60: error: ‘v3f’ has not been declared
  457. /home/centoslive/Downloads/minetest-master/src/sound.h:60: error: ‘v3f’ has not been declared
  458. /home/centoslive/Downloads/minetest-master/src/sound.h:60: error: ‘v3f’ has not been declared
  459. /home/centoslive/Downloads/minetest-master/src/sound.h:60: error: ‘v3f’ has not been declared
  460. /home/centoslive/Downloads/minetest-master/src/sound.h:68: error: ‘v3f’ has not been declared
  461. /home/centoslive/Downloads/minetest-master/src/sound.h:71: error: ‘v3f’ has not been declared
  462. /home/centoslive/Downloads/minetest-master/src/sound.h:75: error: ‘v3f’ has not been declared
  463. /home/centoslive/Downloads/minetest-master/src/sound.h:86: error: ‘v3f’ has not been declared
  464. /home/centoslive/Downloads/minetest-master/src/sound.h:86: error: ‘v3f’ has not been declared
  465. /home/centoslive/Downloads/minetest-master/src/sound.h:86: error: ‘v3f’ has not been declared
  466. /home/centoslive/Downloads/minetest-master/src/sound.h:86: error: ‘v3f’ has not been declared
  467. /home/centoslive/Downloads/minetest-master/src/sound.h:91: error: ‘v3f’ has not been declared
  468. /home/centoslive/Downloads/minetest-master/src/sound.h:94: error: ‘v3f’ has not been declared
  469. In file included from /home/centoslive/Downloads/minetest-master/src/script/common/c_types.cpp:24:
  470. /home/centoslive/Downloads/minetest-master/src/itemdef.h:59: error: ‘v3f’ does not name a type
  471. /home/centoslive/Downloads/minetest-master/src/itemdef.h:64: error: ‘s16’ does not name a type
  472. /home/centoslive/Downloads/minetest-master/src/itemdef.h:71: error: ‘f32’ does not name a type
  473. /home/centoslive/Downloads/minetest-master/src/itemdef.h:86: error: ‘u16’ has not been declared
  474. /home/centoslive/Downloads/minetest-master/src/itemdef.h:115: error: ‘u16’ has not been declared
  475. /home/centoslive/Downloads/minetest-master/src/itemdef.h:152: error: ‘u16’ has not been declared
  476. make[2]: *** [src/CMakeFiles/minetestserver.dir/script/common/c_types.cpp.o] Error 1
  477. In file included from /home/centoslive/Downloads/minetest-master/src/irrlichttypes_bloated.h:23,
  478. from /home/centoslive/Downloads/minetest-master/src/script/common/c_content.h:39,
  479. from /home/centoslive/Downloads/minetest-master/src/script/common/c_content.cpp:19:
  480. /home/centoslive/Downloads/minetest-master/src/irrlichttypes.h:25: error: ‘irr’ is not a namespace-name
  481. /home/centoslive/Downloads/minetest-master/src/irrlichttypes.h:25: error: expected namespace-name before ‘;’ token
  482. In file included from /home/centoslive/Downloads/minetest-master/src/irrlichttypes_bloated.h:25,
  483. from /home/centoslive/Downloads/minetest-master/src/script/common/c_content.h:39,
  484. from /home/centoslive/Downloads/minetest-master/src/script/common/c_content.cpp:19:
  485. /home/centoslive/Downloads/minetest-master/src/irr_v2d.h:27: error: ‘core’ has not been declared
  486. /home/centoslive/Downloads/minetest-master/src/irr_v2d.h:27: error: expected initializer before ‘<’ token
  487. /home/centoslive/Downloads/minetest-master/src/irr_v2d.h:28: error: ‘core’ has not been declared
  488. /home/centoslive/Downloads/minetest-master/src/irr_v2d.h:28: error: expected initializer before ‘<’ token
  489. /home/centoslive/Downloads/minetest-master/src/irr_v2d.h:29: error: ‘core’ has not been declared
  490. /home/centoslive/Downloads/minetest-master/src/irr_v2d.h:29: error: expected initializer before ‘<’ token
  491. /home/centoslive/Downloads/minetest-master/src/irr_v2d.h:30: error: ‘core’ has not been declared
  492. /home/centoslive/Downloads/minetest-master/src/irr_v2d.h:30: error: expected initializer before ‘<’ token
  493. /home/centoslive/Downloads/minetest-master/src/irr_v2d.h:31: error: ‘core’ has not been declared
  494. /home/centoslive/Downloads/minetest-master/src/irr_v2d.h:31: error: expected initializer before ‘<’ token
  495. In file included from /home/centoslive/Downloads/minetest-master/src/irrlichttypes_bloated.h:26,
  496. from /home/centoslive/Downloads/minetest-master/src/script/common/c_content.h:39,
  497. from /home/centoslive/Downloads/minetest-master/src/script/common/c_content.cpp:19:
  498. /home/centoslive/Downloads/minetest-master/src/irr_v3d.h:27: error: ‘core’ has not been declared
  499. /home/centoslive/Downloads/minetest-master/src/irr_v3d.h:27: error: expected initializer before ‘v3f’
  500. /home/centoslive/Downloads/minetest-master/src/irr_v3d.h:28: error: ‘core’ has not been declared
  501. /home/centoslive/Downloads/minetest-master/src/irr_v3d.h:28: error: expected initializer before ‘<’ token
  502. /home/centoslive/Downloads/minetest-master/src/irr_v3d.h:29: error: ‘core’ has not been declared
  503. /home/centoslive/Downloads/minetest-master/src/irr_v3d.h:29: error: expected initializer before ‘<’ token
  504. In file included from /home/centoslive/Downloads/minetest-master/src/irrlichttypes_bloated.h:27,
  505. from /home/centoslive/Downloads/minetest-master/src/script/common/c_content.h:39,
  506. from /home/centoslive/Downloads/minetest-master/src/script/common/c_content.cpp:19:
  507. /home/centoslive/Downloads/minetest-master/src/irr_aabb3d.h:27: error: ‘core’ has not been declared
  508. /home/centoslive/Downloads/minetest-master/src/irr_aabb3d.h:27: error: expected initializer before ‘<’ token
  509. In file included from /home/centoslive/Downloads/minetest-master/src/script/common/c_content.h:40,
  510. from /home/centoslive/Downloads/minetest-master/src/script/common/c_content.cpp:19:
  511. /home/centoslive/Downloads/minetest-master/src/util/string.h:32: error: ‘u32’ does not name a type
  512. /home/centoslive/Downloads/minetest-master/src/util/string.h:156: error: ‘s32’ does not name a type
  513. /home/centoslive/Downloads/minetest-master/src/util/string.h:166: error: ‘s64’ does not name a type
  514. /home/centoslive/Downloads/minetest-master/src/util/string.h:176: error: ‘s32’ does not name a type
  515. /home/centoslive/Downloads/minetest-master/src/util/string.h:181: error: ‘s32’ does not name a type
  516. /home/centoslive/Downloads/minetest-master/src/util/string.h:202: error: ‘itos’ declared as an ‘inline’ variable
  517. /home/centoslive/Downloads/minetest-master/src/util/string.h:202: error: ‘s32’ was not declared in this scope
  518. /home/centoslive/Downloads/minetest-master/src/util/string.h:203: error: expected ‘,’ or ‘;’ before ‘{’ token
  519. /home/centoslive/Downloads/minetest-master/src/util/string.h:209: error: ‘i64tos’ declared as an ‘inline’ variable
  520. /home/centoslive/Downloads/minetest-master/src/util/string.h:209: error: ‘s64’ was not declared in this scope
  521. /home/centoslive/Downloads/minetest-master/src/util/string.h:209: error: expected ‘,’ or ‘;’ before ‘{’ token
  522. /home/centoslive/Downloads/minetest-master/src/util/string.h: In function ‘bool string_allowed(const std::string&, const std::string&)’:
  523. /home/centoslive/Downloads/minetest-master/src/util/string.h:247: error: ‘u32’ was not declared in this scope
  524. /home/centoslive/Downloads/minetest-master/src/util/string.h:247: error: expected ‘;’ before ‘i’
  525. /home/centoslive/Downloads/minetest-master/src/util/string.h:247: error: ‘i’ was not declared in this scope
  526. /home/centoslive/Downloads/minetest-master/src/util/string.h:250: error: expected ‘;’ before ‘j’
  527. /home/centoslive/Downloads/minetest-master/src/util/string.h:250: error: ‘j’ was not declared in this scope
  528. /home/centoslive/Downloads/minetest-master/src/util/string.h: At global scope:
  529. /home/centoslive/Downloads/minetest-master/src/util/string.h:291: error: ‘u32’ has not been declared
  530. /home/centoslive/Downloads/minetest-master/src/util/string.h: In function ‘std::string wrap_rows(const std::string&, int)’:
  531. /home/centoslive/Downloads/minetest-master/src/util/string.h:294: error: ‘u32’ was not declared in this scope
  532. /home/centoslive/Downloads/minetest-master/src/util/string.h:294: error: expected ‘;’ before ‘i’
  533. /home/centoslive/Downloads/minetest-master/src/util/string.h:294: error: ‘i’ was not declared in this scope
  534. /home/centoslive/Downloads/minetest-master/src/util/string.h: At global scope:
  535. /home/centoslive/Downloads/minetest-master/src/util/string.h:322: error: ‘u32’ does not name a type
  536. /home/centoslive/Downloads/minetest-master/src/util/string.h:323: error: ‘u32’ was not declared in this scope
  537. /home/centoslive/Downloads/minetest-master/src/util/string.h:323: error: expected primary-expression before ‘*’ token
  538. /home/centoslive/Downloads/minetest-master/src/util/string.h:323: error: ‘flagdesc’ was not declared in this scope
  539. /home/centoslive/Downloads/minetest-master/src/util/string.h:323: error: ‘u32’ was not declared in this scope
  540. /home/centoslive/Downloads/minetest-master/src/util/string.h:326: error: ‘u64’ does not name a type
  541. In file included from /home/centoslive/Downloads/minetest-master/src/script/common/c_content.cpp:19:
  542. /home/centoslive/Downloads/minetest-master/src/script/common/c_content.h:125: error: ‘u32’ has not been declared
  543. /home/centoslive/Downloads/minetest-master/src/script/common/c_content.h:125: error: ‘u32’ has not been declared
  544. /home/centoslive/Downloads/minetest-master/src/script/common/c_content.h:129: error: ‘u32’ has not been declared
  545. /home/centoslive/Downloads/minetest-master/src/script/common/c_content.h:129: error: ‘u32’ has not been declared
  546. /home/centoslive/Downloads/minetest-master/src/script/common/c_content.h:131: error: ‘u32’ does not name a type
  547. /home/centoslive/Downloads/minetest-master/src/script/common/c_content.h:159: error: ‘u16’ has not been declared
  548. /home/centoslive/Downloads/minetest-master/src/script/common/c_content.h:167: error: ‘u8’ has not been declared
  549. In file included from /home/centoslive/Downloads/minetest-master/src/script/common/c_content.cpp:20:
  550. /home/centoslive/Downloads/minetest-master/src/script/common/c_converter.h:71: error: ‘v3f’ does not name a type
  551. /home/centoslive/Downloads/minetest-master/src/script/common/c_converter.h:72: error: ‘v3f’ does not name a type
  552. /home/centoslive/Downloads/minetest-master/src/script/common/c_converter.h:73: error: ‘v3s16’ does not name a type
  553. /home/centoslive/Downloads/minetest-master/src/script/common/c_converter.h:75: error: ‘v3f’ does not name a type
  554. /home/centoslive/Downloads/minetest-master/src/script/common/c_converter.h:76: error: ‘v2f’ does not name a type
  555. /home/centoslive/Downloads/minetest-master/src/script/common/c_converter.h:77: error: ‘v2s16’ does not name a type
  556. /home/centoslive/Downloads/minetest-master/src/script/common/c_converter.h:78: error: ‘video’ has not been declared
  557. /home/centoslive/Downloads/minetest-master/src/script/common/c_converter.h:78: error: expected constructor, destructor, or type conversion before ‘readARGB8’
  558. /home/centoslive/Downloads/minetest-master/src/script/common/c_converter.h:79: error: ‘aabb3f’ does not name a type
  559. /home/centoslive/Downloads/minetest-master/src/script/common/c_converter.h:80: error: ‘v3s16’ does not name a type
  560. /home/centoslive/Downloads/minetest-master/src/script/common/c_converter.h:81: error: ‘aabb3f’ was not declared in this scope
  561. /home/centoslive/Downloads/minetest-master/src/script/common/c_converter.h:81: error: template argument 1 is invalid
  562. /home/centoslive/Downloads/minetest-master/src/script/common/c_converter.h:81: error: template argument 2 is invalid
  563. /home/centoslive/Downloads/minetest-master/src/script/common/c_converter.h:82: error: ‘f32’ has not been declared
  564. /home/centoslive/Downloads/minetest-master/src/script/common/c_converter.h:82: error: invalid type in declaration before ‘;’ token
  565. /home/centoslive/Downloads/minetest-master/src/script/common/c_converter.h:84: error: ‘v3s16’ has not been declared
  566. /home/centoslive/Downloads/minetest-master/src/script/common/c_converter.h:85: error: ‘v3f’ has not been declared
  567. /home/centoslive/Downloads/minetest-master/src/script/common/c_converter.h:86: error: ‘v3f’ has not been declared
  568. /home/centoslive/Downloads/minetest-master/src/script/common/c_converter.h:87: error: ‘v2f’ has not been declared
  569. In file included from /home/centoslive/Downloads/minetest-master/src/mapnode.h:26,
  570. from /home/centoslive/Downloads/minetest-master/src/nodedef.h:28,
  571. from /home/centoslive/Downloads/minetest-master/src/script/common/c_content.cpp:22:
  572. /home/centoslive/Downloads/minetest-master/src/light.h:37: error: ‘u8’ does not name a type
  573. /home/centoslive/Downloads/minetest-master/src/light.h:47: error: ‘u8’ does not name a type
  574. /home/centoslive/Downloads/minetest-master/src/light.h:54: error: ‘u8’ does not name a type
  575. /home/centoslive/Downloads/minetest-master/src/light.h:66: error: ‘u8’ does not name a type
  576. /home/centoslive/Downloads/minetest-master/src/light.h:70: error: ‘u8’ does not name a type
  577. /home/centoslive/Downloads/minetest-master/src/light.h: In function ‘float decode_light_f(float)’:
  578. /home/centoslive/Downloads/minetest-master/src/light.h:82: error: ‘s32’ was not declared in this scope
  579. /home/centoslive/Downloads/minetest-master/src/light.h:82: error: expected ‘;’ before ‘i’
  580. /home/centoslive/Downloads/minetest-master/src/light.h:84: error: ‘i’ was not declared in this scope
  581. /home/centoslive/Downloads/minetest-master/src/light.h:85: error: ‘light_decode_table’ was not declared in this scope
  582. /home/centoslive/Downloads/minetest-master/src/light.h:86: error: ‘i’ was not declared in this scope
  583. /home/centoslive/Downloads/minetest-master/src/light.h:87: error: ‘light_decode_table’ was not declared in this scope
  584. /home/centoslive/Downloads/minetest-master/src/light.h:89: error: ‘light_decode_table’ was not declared in this scope
  585. /home/centoslive/Downloads/minetest-master/src/light.h:89: error: ‘i’ was not declared in this scope
  586. /home/centoslive/Downloads/minetest-master/src/light.h: At global scope:
  587. /home/centoslive/Downloads/minetest-master/src/light.h:99: error: ‘u8’ does not name a type
  588. /home/centoslive/Downloads/minetest-master/src/light.h:111: error: ‘u8’ does not name a type
  589. In file included from /home/centoslive/Downloads/minetest-master/src/nodedef.h:28,
  590. from /home/centoslive/Downloads/minetest-master/src/script/common/c_content.cpp:22:
  591. /home/centoslive/Downloads/minetest-master/src/mapnode.h:38: error: ‘u16’ does not name a type
  592. /home/centoslive/Downloads/minetest-master/src/mapnode.h:121: error: ‘u16’ does not name a type
  593. /home/centoslive/Downloads/minetest-master/src/mapnode.h:131: error: ‘u8’ does not name a type
  594. /home/centoslive/Downloads/minetest-master/src/mapnode.h:137: error: ‘u8’ does not name a type
  595. /home/centoslive/Downloads/minetest-master/src/mapnode.h:144: error: expected ‘)’ before ‘content’
  596. /home/centoslive/Downloads/minetest-master/src/mapnode.h:154: error: ‘u8’ has not been declared
  597. /home/centoslive/Downloads/minetest-master/src/mapnode.h:154: error: ‘u8’ has not been declared
  598. /home/centoslive/Downloads/minetest-master/src/mapnode.h:164: error: ‘content_t’ does not name a type
  599. /home/centoslive/Downloads/minetest-master/src/mapnode.h:168: error: ‘content_t’ has not been declared
  600. /home/centoslive/Downloads/minetest-master/src/mapnode.h:172: error: ‘u8’ does not name a type
  601. /home/centoslive/Downloads/minetest-master/src/mapnode.h:176: error: ‘u8’ has not been declared
  602. /home/centoslive/Downloads/minetest-master/src/mapnode.h:180: error: ‘u8’ does not name a type
  603. /home/centoslive/Downloads/minetest-master/src/mapnode.h:184: error: ‘u8’ has not been declared
  604. /home/centoslive/Downloads/minetest-master/src/mapnode.h:189: error: ‘u8’ has not been declared
  605. /home/centoslive/Downloads/minetest-master/src/mapnode.h:190: error: ‘u8’ does not name a type
  606. /home/centoslive/Downloads/minetest-master/src/mapnode.h:191: error: ‘u8’ has not been declared
  607. /home/centoslive/Downloads/minetest-master/src/mapnode.h:191: error: ‘u8’ has not been declared
  608. /home/centoslive/Downloads/minetest-master/src/mapnode.h:195: error: ‘u8’ does not name a type
  609. /home/centoslive/Downloads/minetest-master/src/mapnode.h:205: error: ‘u8’ does not name a type
  610. /home/centoslive/Downloads/minetest-master/src/mapnode.h:213: error: ‘u8’ does not name a type
  611. /home/centoslive/Downloads/minetest-master/src/mapnode.h:214: error: ‘u8’ does not name a type
  612. /home/centoslive/Downloads/minetest-master/src/mapnode.h:215: error: ‘v3s16’ does not name a type
  613. /home/centoslive/Downloads/minetest-master/src/mapnode.h:223: error: ‘aabb3f’ was not declared in this scope
  614. /home/centoslive/Downloads/minetest-master/src/mapnode.h:223: error: template argument 1 is invalid
  615. /home/centoslive/Downloads/minetest-master/src/mapnode.h:223: error: template argument 2 is invalid
  616. /home/centoslive/Downloads/minetest-master/src/mapnode.h:228: error: ‘aabb3f’ was not declared in this scope
  617. /home/centoslive/Downloads/minetest-master/src/mapnode.h:228: error: template argument 1 is invalid
  618. /home/centoslive/Downloads/minetest-master/src/mapnode.h:228: error: template argument 2 is invalid
  619. /home/centoslive/Downloads/minetest-master/src/mapnode.h:231: error: ‘u8’ does not name a type
  620. /home/centoslive/Downloads/minetest-master/src/mapnode.h:232: error: ‘u8’ does not name a type
  621. /home/centoslive/Downloads/minetest-master/src/mapnode.h:233: error: ‘u8’ does not name a type
  622. /home/centoslive/Downloads/minetest-master/src/mapnode.h:234: error: ‘u8’ does not name a type
  623. /home/centoslive/Downloads/minetest-master/src/mapnode.h:241: error: ‘u32’ does not name a type
  624. /home/centoslive/Downloads/minetest-master/src/mapnode.h:242: error: ‘u8’ has not been declared
  625. /home/centoslive/Downloads/minetest-master/src/mapnode.h:242: error: ‘u8’ has not been declared
  626. /home/centoslive/Downloads/minetest-master/src/mapnode.h:243: error: ‘u8’ has not been declared
  627. /home/centoslive/Downloads/minetest-master/src/mapnode.h:243: error: ‘u8’ has not been declared
  628. /home/centoslive/Downloads/minetest-master/src/mapnode.h:253: error: ‘u32’ has not been declared
  629. /home/centoslive/Downloads/minetest-master/src/mapnode.h:254: error: ‘u8’ has not been declared
  630. /home/centoslive/Downloads/minetest-master/src/mapnode.h:254: error: ‘u8’ has not been declared
  631. /home/centoslive/Downloads/minetest-master/src/mapnode.h:256: error: ‘u32’ has not been declared
  632. /home/centoslive/Downloads/minetest-master/src/mapnode.h:257: error: ‘u8’ has not been declared
  633. /home/centoslive/Downloads/minetest-master/src/mapnode.h:257: error: ‘u8’ has not been declared
  634. /home/centoslive/Downloads/minetest-master/src/mapnode.h:261: error: ‘u8’ has not been declared
  635. /home/centoslive/Downloads/minetest-master/src/mapnode.h:261: error: ‘u8’ has not been declared
  636. /home/centoslive/Downloads/minetest-master/src/mapnode.h: In member function ‘bool MapNode::operator==(const MapNode&)’:
  637. /home/centoslive/Downloads/minetest-master/src/mapnode.h:158: error: ‘param0’ was not declared in this scope
  638. /home/centoslive/Downloads/minetest-master/src/mapnode.h:158: error: ‘const struct MapNode’ has no member named ‘param0’
  639. /home/centoslive/Downloads/minetest-master/src/mapnode.h:159: error: ‘param1’ was not declared in this scope
  640. /home/centoslive/Downloads/minetest-master/src/mapnode.h:159: error: ‘const struct MapNode’ has no member named ‘param1’
  641. /home/centoslive/Downloads/minetest-master/src/mapnode.h:160: error: ‘param2’ was not declared in this scope
  642. /home/centoslive/Downloads/minetest-master/src/mapnode.h:160: error: ‘const struct MapNode’ has no member named ‘param2’
  643. /home/centoslive/Downloads/minetest-master/src/mapnode.h: In member function ‘void MapNode::setContent(int)’:
  644. /home/centoslive/Downloads/minetest-master/src/mapnode.h:170: error: ‘param0’ was not declared in this scope
  645. /home/centoslive/Downloads/minetest-master/src/mapnode.h: In member function ‘void MapNode::setParam1(int)’:
  646. /home/centoslive/Downloads/minetest-master/src/mapnode.h:178: error: ‘param1’ was not declared in this scope
  647. /home/centoslive/Downloads/minetest-master/src/mapnode.h: In member function ‘void MapNode::setParam2(int)’:
  648. /home/centoslive/Downloads/minetest-master/src/mapnode.h:186: error: ‘param2’ was not declared in this scope
  649. In file included from /home/centoslive/Downloads/minetest-master/src/nodedef.h:33,
  650. from /home/centoslive/Downloads/minetest-master/src/script/common/c_content.cpp:22:
  651. /home/centoslive/Downloads/minetest-master/src/sound.h: At global scope:
  652. /home/centoslive/Downloads/minetest-master/src/sound.h:60: error: ‘v3f’ has not been declared
  653. /home/centoslive/Downloads/minetest-master/src/sound.h:60: error: ‘v3f’ has not been declared
  654. /home/centoslive/Downloads/minetest-master/src/sound.h:60: error: ‘v3f’ has not been declared
  655. /home/centoslive/Downloads/minetest-master/src/sound.h:60: error: ‘v3f’ has not been declared
  656. /home/centoslive/Downloads/minetest-master/src/sound.h:68: error: ‘v3f’ has not been declared
  657. /home/centoslive/Downloads/minetest-master/src/sound.h:71: error: ‘v3f’ has not been declared
  658. /home/centoslive/Downloads/minetest-master/src/sound.h:75: error: ‘v3f’ has not been declared
  659. /home/centoslive/Downloads/minetest-master/src/sound.h:86: error: ‘v3f’ has not been declared
  660. /home/centoslive/Downloads/minetest-master/src/sound.h:86: error: ‘v3f’ has not been declared
  661. /home/centoslive/Downloads/minetest-master/src/sound.h:86: error: ‘v3f’ has not been declared
  662. /home/centoslive/Downloads/minetest-master/src/sound.h:86: error: ‘v3f’ has not been declared
  663. /home/centoslive/Downloads/minetest-master/src/sound.h:91: error: ‘v3f’ has not been declared
  664. /home/centoslive/Downloads/minetest-master/src/sound.h:94: error: ‘v3f’ has not been declared
  665. In file included from /home/centoslive/Downloads/minetest-master/src/script/common/c_content.cpp:22:
  666. /home/centoslive/Downloads/minetest-master/src/nodedef.h:40: error: ‘content_t’ was not declared in this scope
  667. /home/centoslive/Downloads/minetest-master/src/nodedef.h:40: error: template argument 1 is invalid
  668. /home/centoslive/Downloads/minetest-master/src/nodedef.h:40: error: template argument 1 is invalid
  669. /home/centoslive/Downloads/minetest-master/src/nodedef.h:40: error: template argument 2 is invalid
  670. /home/centoslive/Downloads/minetest-master/src/nodedef.h:40: error: invalid type in declaration before ‘;’ token
  671. /home/centoslive/Downloads/minetest-master/src/nodedef.h:83: error: ‘aabb3f’ was not declared in this scope
  672. /home/centoslive/Downloads/minetest-master/src/nodedef.h:83: error: template argument 1 is invalid
  673. /home/centoslive/Downloads/minetest-master/src/nodedef.h:83: error: template argument 2 is invalid
  674. /home/centoslive/Downloads/minetest-master/src/nodedef.h:85: error: ‘aabb3f’ does not name a type
  675. /home/centoslive/Downloads/minetest-master/src/nodedef.h:86: error: ‘aabb3f’ does not name a type
  676. /home/centoslive/Downloads/minetest-master/src/nodedef.h:87: error: ‘aabb3f’ does not name a type
  677. /home/centoslive/Downloads/minetest-master/src/nodedef.h:93: error: ‘u16’ has not been declared
  678. /home/centoslive/Downloads/minetest-master/src/nodedef.h:128: error: ‘u16’ has not been declared
  679. /home/centoslive/Downloads/minetest-master/src/nodedef.h:188: error: ‘u8’ does not name a type
  680. /home/centoslive/Downloads/minetest-master/src/nodedef.h:191: error: ‘video’ has not been declared
  681. /home/centoslive/Downloads/minetest-master/src/nodedef.h:191: error: ISO C++ forbids declaration of ‘SColor’ with no type
  682. /home/centoslive/Downloads/minetest-master/src/nodedef.h:191: error: expected ‘;’ before ‘post_effect_color’
  683. /home/centoslive/Downloads/minetest-master/src/nodedef.h:214: error: ‘u8’ does not name a type
  684. /home/centoslive/Downloads/minetest-master/src/nodedef.h:224: error: ‘u8’ does not name a type
  685. /home/centoslive/Downloads/minetest-master/src/nodedef.h:230: error: ‘u8’ does not name a type
  686. /home/centoslive/Downloads/minetest-master/src/nodedef.h:231: error: ‘u8’ does not name a type
  687. /home/centoslive/Downloads/minetest-master/src/nodedef.h:233: error: ‘u8’ does not name a type
  688. /home/centoslive/Downloads/minetest-master/src/nodedef.h:234: error: ‘u32’ does not name a type
  689. /home/centoslive/Downloads/minetest-master/src/nodedef.h:238: error: ‘u8’ does not name a type
  690. /home/centoslive/Downloads/minetest-master/src/nodedef.h:257: error: ‘u16’ has not been declared
  691. /home/centoslive/Downloads/minetest-master/src/nodedef.h:259: error: ‘u16’ has not been declared
  692. /home/centoslive/Downloads/minetest-master/src/nodedef.h:280: error: ‘get’ declared as a ‘virtual’ field
  693. /home/centoslive/Downloads/minetest-master/src/nodedef.h:280: error: expected ‘;’ before ‘(’ token
  694. /home/centoslive/Downloads/minetest-master/src/nodedef.h:282: error: ‘content_t’ has not been declared
  695. /home/centoslive/Downloads/minetest-master/src/nodedef.h:283: error: ‘content_t’ does not name a type
  696. /home/centoslive/Downloads/minetest-master/src/nodedef.h:285: error: ‘content_t’ was not declared in this scope
  697. /home/centoslive/Downloads/minetest-master/src/nodedef.h:285: error: template argument 1 is invalid
  698. /home/centoslive/Downloads/minetest-master/src/nodedef.h:285: error: template argument 2 is invalid
  699. /home/centoslive/Downloads/minetest-master/src/nodedef.h:285: error: template argument 3 is invalid
  700. /home/centoslive/Downloads/minetest-master/src/nodedef.h:289: error: ‘u16’ has not been declared
  701. /home/centoslive/Downloads/minetest-master/src/nodedef.h:299: error: ‘get’ declared as a ‘virtual’ field
  702. /home/centoslive/Downloads/minetest-master/src/nodedef.h:299: error: expected ‘;’ before ‘(’ token
  703. /home/centoslive/Downloads/minetest-master/src/nodedef.h:301: error: ‘content_t’ has not been declared
  704. /home/centoslive/Downloads/minetest-master/src/nodedef.h:303: error: ‘content_t’ does not name a type
  705. /home/centoslive/Downloads/minetest-master/src/nodedef.h:305: error: ‘content_t’ was not declared in this scope
  706. /home/centoslive/Downloads/minetest-master/src/nodedef.h:305: error: template argument 1 is invalid
  707. /home/centoslive/Downloads/minetest-master/src/nodedef.h:305: error: template argument 2 is invalid
  708. /home/centoslive/Downloads/minetest-master/src/nodedef.h:305: error: template argument 3 is invalid
  709. /home/centoslive/Downloads/minetest-master/src/nodedef.h:312: error: ‘content_t’ does not name a type
  710. /home/centoslive/Downloads/minetest-master/src/nodedef.h:315: error: ‘content_t’ does not name a type
  711. /home/centoslive/Downloads/minetest-master/src/nodedef.h:328: error: ‘u16’ has not been declared
  712. In file included from /home/centoslive/Downloads/minetest-master/src/script/common/c_content.cpp:23:
  713. /home/centoslive/Downloads/minetest-master/src/itemdef.h:59: error: ‘v3f’ does not name a type
  714. /home/centoslive/Downloads/minetest-master/src/itemdef.h:64: error: ‘s16’ does not name a type
  715. /home/centoslive/Downloads/minetest-master/src/itemdef.h:71: error: ‘f32’ does not name a type
  716. /home/centoslive/Downloads/minetest-master/src/itemdef.h:86: error: ‘u16’ has not been declared
  717. /home/centoslive/Downloads/minetest-master/src/itemdef.h:115: error: ‘u16’ has not been declared
  718. /home/centoslive/Downloads/minetest-master/src/itemdef.h:152: error: ‘u16’ has not been declared
  719. In file included from /home/centoslive/Downloads/minetest-master/src/script/common/c_content.cpp:24:
  720. /home/centoslive/Downloads/minetest-master/src/object_properties.h:32: error: ‘s16’ does not name a type
  721. /home/centoslive/Downloads/minetest-master/src/object_properties.h:36: error: ‘core’ has not been declared
  722. /home/centoslive/Downloads/minetest-master/src/object_properties.h:36: error: ISO C++ forbids declaration of ‘aabbox3d’ with no type
  723. /home/centoslive/Downloads/minetest-master/src/object_properties.h:36: error: expected ‘;’ before ‘<’ token
  724. /home/centoslive/Downloads/minetest-master/src/object_properties.h:39: error: ‘v2f’ does not name a type
  725. /home/centoslive/Downloads/minetest-master/src/object_properties.h:41: error: ‘video’ was not declared in this scope
  726. /home/centoslive/Downloads/minetest-master/src/object_properties.h:41: error: template argument 1 is invalid
  727. /home/centoslive/Downloads/minetest-master/src/object_properties.h:41: error: template argument 2 is invalid
  728. /home/centoslive/Downloads/minetest-master/src/object_properties.h:42: error: ‘v2s16’ does not name a type
  729. /home/centoslive/Downloads/minetest-master/src/object_properties.h:43: error: ‘v2s16’ does not name a type
  730. /home/centoslive/Downloads/minetest-master/src/object_properties.h:47: error: ‘f32’ does not name a type
  731. /home/centoslive/Downloads/minetest-master/src/object_properties.h:49: error: ‘f32’ does not name a type
  732. In file included from /home/centoslive/Downloads/minetest-master/src/script/cpp_api/s_node.h:26,
  733. from /home/centoslive/Downloads/minetest-master/src/script/common/c_content.cpp:25:
  734. /home/centoslive/Downloads/minetest-master/src/script/cpp_api/s_base.h:82: error: ‘u16’ has not been declared
  735. In file included from /home/centoslive/Downloads/minetest-master/src/script/cpp_api/s_nodemeta.h:24,
  736. from /home/centoslive/Downloads/minetest-master/src/script/cpp_api/s_node.h:27,
  737. from /home/centoslive/Downloads/minetest-master/src/script/common/c_content.cpp:25:
  738. /home/centoslive/Downloads/minetest-master/src/script/cpp_api/s_item.h:40: error: ‘v3f’ has not been declared
  739. In file included from /home/centoslive/Downloads/minetest-master/src/script/cpp_api/s_node.h:27,
  740. from /home/centoslive/Downloads/minetest-master/src/script/common/c_content.cpp:25:
  741. /home/centoslive/Downloads/minetest-master/src/script/cpp_api/s_nodemeta.h:38: error: ‘v3s16’ has not been declared
  742. /home/centoslive/Downloads/minetest-master/src/script/cpp_api/s_nodemeta.h:43: error: ‘v3s16’ has not been declared
  743. /home/centoslive/Downloads/minetest-master/src/script/cpp_api/s_nodemeta.h:47: error: ‘v3s16’ has not been declared
  744. /home/centoslive/Downloads/minetest-master/src/script/cpp_api/s_nodemeta.h:51: error: ‘v3s16’ has not been declared
  745. /home/centoslive/Downloads/minetest-master/src/script/cpp_api/s_nodemeta.h:56: error: ‘v3s16’ has not been declared
  746. /home/centoslive/Downloads/minetest-master/src/script/cpp_api/s_nodemeta.h:60: error: ‘v3s16’ has not been declared
  747. In file included from /home/centoslive/Downloads/minetest-master/src/script/common/c_content.cpp:25:
  748. /home/centoslive/Downloads/minetest-master/src/script/cpp_api/s_node.h:40: error: ‘v3s16’ has not been declared
  749. /home/centoslive/Downloads/minetest-master/src/script/cpp_api/s_node.h:42: error: ‘v3s16’ has not been declared
  750. /home/centoslive/Downloads/minetest-master/src/script/cpp_api/s_node.h:44: error: ‘v3s16’ has not been declared
  751. /home/centoslive/Downloads/minetest-master/src/script/cpp_api/s_node.h:45: error: ‘v3s16’ has not been declared
  752. /home/centoslive/Downloads/minetest-master/src/script/cpp_api/s_node.h:46: error: ‘v3s16’ has not been declared
  753. /home/centoslive/Downloads/minetest-master/src/script/cpp_api/s_node.h:47: error: ‘v3s16’ has not been declared
  754. /home/centoslive/Downloads/minetest-master/src/script/cpp_api/s_node.h:47: error: ‘f32’ has not been declared
  755. /home/centoslive/Downloads/minetest-master/src/script/cpp_api/s_node.h:48: error: ‘v3s16’ has not been declared
  756. /home/centoslive/Downloads/minetest-master/src/script/cpp_api/s_node.h:52: error: ‘v3s16’ has not been declared
  757. /home/centoslive/Downloads/minetest-master/src/script/cpp_api/s_node.h:53: error: ‘v3s16’ has not been declared
  758. In file included from /home/centoslive/Downloads/minetest-master/src/script/common/c_content.cpp:26:
  759. /home/centoslive/Downloads/minetest-master/src/script/lua_api/l_object.h:211: error: ‘u32’ does not name a type
  760. In file included from /home/centoslive/Downloads/minetest-master/src/debug.h:25,
  761. from /home/centoslive/Downloads/minetest-master/src/inventory.h:27,
  762. from /home/centoslive/Downloads/minetest-master/src/script/lua_api/l_item.h:24,
  763. from /home/centoslive/Downloads/minetest-master/src/script/common/c_content.cpp:27:
  764. /home/centoslive/Downloads/minetest-master/src/gettime.h:41: error: ‘u32’ does not name a type
  765. /home/centoslive/Downloads/minetest-master/src/gettime.h:42: error: ‘u32’ does not name a type
  766. In file included from /home/centoslive/Downloads/minetest-master/src/script/lua_api/l_item.h:24,
  767. from /home/centoslive/Downloads/minetest-master/src/script/common/c_content.cpp:27:
  768. /home/centoslive/Downloads/minetest-master/src/inventory.h:35: error: ‘u16’ has not been declared
  769. /home/centoslive/Downloads/minetest-master/src/inventory.h:36: error: ‘u16’ has not been declared
  770. /home/centoslive/Downloads/minetest-master/src/inventory.h:65: error: ‘u16’ has not been declared
  771. /home/centoslive/Downloads/minetest-master/src/inventory.h:70: error: ‘u16’ has not been declared
  772. /home/centoslive/Downloads/minetest-master/src/inventory.h:79: error: ‘u16’ does not name a type
  773. /home/centoslive/Downloads/minetest-master/src/inventory.h:86: error: ‘u16’ does not name a type
  774. /home/centoslive/Downloads/minetest-master/src/inventory.h:122: error: ‘s32’ has not been declared
  775. /home/centoslive/Downloads/minetest-master/src/inventory.h:157: error: ‘u32’ has not been declared
  776. /home/centoslive/Downloads/minetest-master/src/inventory.h:160: error: ‘u32’ has not been declared
  777. /home/centoslive/Downloads/minetest-master/src/inventory.h:166: error: ‘u16’ does not name a type
  778. /home/centoslive/Downloads/minetest-master/src/inventory.h:167: error: ‘u16’ does not name a type
  779. /home/centoslive/Downloads/minetest-master/src/inventory.h: In constructor ‘ItemStack::ItemStack()’:
  780. /home/centoslive/Downloads/minetest-master/src/inventory.h:34: error: class ‘ItemStack’ does not have any field named ‘count’
  781. /home/centoslive/Downloads/minetest-master/src/inventory.h:34: error: class ‘ItemStack’ does not have any field named ‘wear’
  782. /home/centoslive/Downloads/minetest-master/src/inventory.h: In member function ‘bool ItemStack::empty() const’:
  783. /home/centoslive/Downloads/minetest-master/src/inventory.h:54: error: ‘count’ was not declared in this scope
  784. /home/centoslive/Downloads/minetest-master/src/inventory.h: In member function ‘void ItemStack::clear()’:
  785. /home/centoslive/Downloads/minetest-master/src/inventory.h:60: error: ‘count’ was not declared in this scope
  786. /home/centoslive/Downloads/minetest-master/src/inventory.h:61: error: ‘wear’ was not declared in this scope
  787. /home/centoslive/Downloads/minetest-master/src/inventory.h: In member function ‘void ItemStack::add(int)’:
  788. /home/centoslive/Downloads/minetest-master/src/inventory.h:67: error: ‘count’ was not declared in this scope
  789. /home/centoslive/Downloads/minetest-master/src/inventory.h: In member function ‘void ItemStack::remove(int)’:
  790. /home/centoslive/Downloads/minetest-master/src/inventory.h:72: error: ‘count’ was not declared in this scope
  791. /home/centoslive/Downloads/minetest-master/src/inventory.h: In member function ‘bool ItemStack::addWear(int, IItemDefManager*)’:
  792. /home/centoslive/Downloads/minetest-master/src/inventory.h:126: error: ‘wear’ was not declared in this scope
  793. /home/centoslive/Downloads/minetest-master/src/inventory.h: At global scope:
  794. /home/centoslive/Downloads/minetest-master/src/inventory.h:174: error: ‘u32’ has not been declared
  795. /home/centoslive/Downloads/minetest-master/src/inventory.h:177: error: ‘u32’ has not been declared
  796. /home/centoslive/Downloads/minetest-master/src/inventory.h:178: error: ‘u32’ has not been declared
  797. /home/centoslive/Downloads/minetest-master/src/inventory.h:192: error: ‘u32’ does not name a type
  798. /home/centoslive/Downloads/minetest-master/src/inventory.h:193: error: ‘u32’ does not name a type
  799. /home/centoslive/Downloads/minetest-master/src/inventory.h:195: error: ‘u32’ does not name a type
  800. /home/centoslive/Downloads/minetest-master/src/inventory.h:196: error: ‘u32’ does not name a type
  801. /home/centoslive/Downloads/minetest-master/src/inventory.h:199: error: expected ‘;’ before ‘(’ token
  802. /home/centoslive/Downloads/minetest-master/src/inventory.h:200: error: expected ‘;’ before ‘(’ token
  803. /home/centoslive/Downloads/minetest-master/src/inventory.h:202: error: ‘u32’ has not been declared
  804. /home/centoslive/Downloads/minetest-master/src/inventory.h:204: error: ‘u32’ has not been declared
  805. /home/centoslive/Downloads/minetest-master/src/inventory.h:213: error: ‘u32’ has not been declared
  806. /home/centoslive/Downloads/minetest-master/src/inventory.h:218: error: ISO C++ forbids declaration of ‘u32’ with no type
  807. /home/centoslive/Downloads/minetest-master/src/inventory.h:218: error: expected ‘,’ or ‘...’ before ‘i’
  808. /home/centoslive/Downloads/minetest-master/src/inventory.h:238: error: ‘u32’ has not been declared
  809. /home/centoslive/Downloads/minetest-master/src/inventory.h:238: error: ‘u32’ has not been declared
  810. /home/centoslive/Downloads/minetest-master/src/inventory.h:241: error: ‘u32’ has not been declared
  811. /home/centoslive/Downloads/minetest-master/src/inventory.h:241: error: ‘u32’ has not been declared
  812. /home/centoslive/Downloads/minetest-master/src/inventory.h:245: error: ‘u32’ has not been declared
  813. /home/centoslive/Downloads/minetest-master/src/inventory.h:245: error: ‘u32’ has not been declared
  814. /home/centoslive/Downloads/minetest-master/src/inventory.h:245: error: ‘u32’ has not been declared
  815. /home/centoslive/Downloads/minetest-master/src/inventory.h:249: error: ‘u32’ does not name a type
  816. /home/centoslive/Downloads/minetest-master/src/inventory.h:274: error: ‘u32’ has not been declared
  817. /home/centoslive/Downloads/minetest-master/src/inventory.h:290: error: ‘s32’ does not name a type
  818. In file included from /home/centoslive/Downloads/minetest-master/src/connection.h:24,
  819. from /home/centoslive/Downloads/minetest-master/src/server.h:23,
  820. from /home/centoslive/Downloads/minetest-master/src/script/common/c_content.cpp:29:
  821. /home/centoslive/Downloads/minetest-master/src/socket.h:78: error: ‘u8’ does not name a type
  822. /home/centoslive/Downloads/minetest-master/src/socket.h: In constructor ‘IPv6AddressBytes::IPv6AddressBytes()’:
  823. /home/centoslive/Downloads/minetest-master/src/socket.h:79: error: ‘bytes’ was not declared in this scope
  824. /home/centoslive/Downloads/minetest-master/src/socket.h: At global scope:
  825. /home/centoslive/Downloads/minetest-master/src/socket.h:86: error: expected ‘)’ before ‘address’
  826. /home/centoslive/Downloads/minetest-master/src/socket.h:87: error: expected ‘)’ before ‘a’
  827. /home/centoslive/Downloads/minetest-master/src/socket.h:88: error: ‘u16’ has not been declared
  828. /home/centoslive/Downloads/minetest-master/src/socket.h:94: error: ‘u32’ has not been declared
  829. /home/centoslive/Downloads/minetest-master/src/socket.h:95: error: ‘u8’ has not been declared
  830. /home/centoslive/Downloads/minetest-master/src/socket.h:95: error: ‘u8’ has not been declared
  831. /home/centoslive/Downloads/minetest-master/src/socket.h:95: error: ‘u8’ has not been declared
  832. /home/centoslive/Downloads/minetest-master/src/socket.h:95: error: ‘u8’ has not been declared
  833. /home/centoslive/Downloads/minetest-master/src/socket.h:110: error: ‘u16’ does not name a type
  834. In file included from /home/centoslive/Downloads/minetest-master/src/connection.h:27,
  835. from /home/centoslive/Downloads/minetest-master/src/server.h:23,
  836. from /home/centoslive/Downloads/minetest-master/src/script/common/c_content.cpp:29:
  837. /home/centoslive/Downloads/minetest-master/src/util/pointer.h:293: error: ‘u8’ was not declared in this scope
  838. /home/centoslive/Downloads/minetest-master/src/util/pointer.h:293: error: template argument 1 is invalid
  839. /home/centoslive/Downloads/minetest-master/src/util/pointer.h: In function ‘int SharedBufferFromString(const char*)’:
  840. /home/centoslive/Downloads/minetest-master/src/util/pointer.h:295: error: ‘u8’ was not declared in this scope
  841. /home/centoslive/Downloads/minetest-master/src/util/pointer.h:295: error: template argument 1 is invalid
  842. /home/centoslive/Downloads/minetest-master/src/util/pointer.h:295: error: invalid type in declaration before ‘(’ token
  843. /home/centoslive/Downloads/minetest-master/src/util/pointer.h:295: error: expected primary-expression before ‘)’ token
  844. /home/centoslive/Downloads/minetest-master/src/util/pointer.h:295: error: initializer expression list treated as compound expression
  845. In file included from /home/centoslive/Downloads/minetest-master/src/connection.h:28,
  846. from /home/centoslive/Downloads/minetest-master/src/server.h:23,
  847. from /home/centoslive/Downloads/minetest-master/src/script/common/c_content.cpp:29:
  848. /home/centoslive/Downloads/minetest-master/src/util/container.h: At global scope:
  849. /home/centoslive/Downloads/minetest-master/src/util/container.h:69: error: ‘u32’ does not name a type
  850. /home/centoslive/Downloads/minetest-master/src/util/container.h:75: error: ‘u8’ was not declared in this scope
  851. /home/centoslive/Downloads/minetest-master/src/util/container.h:75: error: template argument 2 is invalid
  852. /home/centoslive/Downloads/minetest-master/src/util/container.h:75: error: template argument 4 is invalid
  853. /home/centoslive/Downloads/minetest-master/src/util/container.h: In member function ‘bool UniqueQueue<Value>::push_back(Value)’:
  854. /home/centoslive/Downloads/minetest-master/src/util/container.h:50: error: request for member ‘find’ in ‘((UniqueQueue<Value>*)this)->UniqueQueue<Value>::m_map’, which is of non-class type ‘int’
  855. /home/centoslive/Downloads/minetest-master/src/util/container.h:50: error: request for member ‘end’ in ‘((UniqueQueue<Value>*)this)->UniqueQueue<Value>::m_map’, which is of non-class type ‘int’
  856. /home/centoslive/Downloads/minetest-master/src/util/container.h: In member function ‘Value UniqueQueue<Value>::pop_front()’:
  857. /home/centoslive/Downloads/minetest-master/src/util/container.h:64: error: request for member ‘erase’ in ‘((UniqueQueue<Value>*)this)->UniqueQueue<Value>::m_map’, which is of non-class type ‘int’
  858. /home/centoslive/Downloads/minetest-master/src/util/container.h: At global scope:
  859. /home/centoslive/Downloads/minetest-master/src/util/container.h:154: error: ‘u32’ has not been declared
  860. /home/centoslive/Downloads/minetest-master/src/util/container.h:167: error: ‘u32’ does not name a type
  861. /home/centoslive/Downloads/minetest-master/src/util/container.h:184: error: ‘u32’ was not declared in this scope
  862. /home/centoslive/Downloads/minetest-master/src/util/container.h:184: error: template argument 2 is invalid
  863. /home/centoslive/Downloads/minetest-master/src/util/container.h:184: error: template argument 4 is invalid
  864. /home/centoslive/Downloads/minetest-master/src/util/container.h:233: error: ‘u32’ does not name a type
  865. /home/centoslive/Downloads/minetest-master/src/util/container.h:245: error: ‘u32’ does not name a type
  866. /home/centoslive/Downloads/minetest-master/src/util/container.h: In constructor ‘Queue<T>::Queue()’:
  867. /home/centoslive/Downloads/minetest-master/src/util/container.h:195: error: class ‘Queue<T>’ does not have any field named ‘m_list_size’
  868. /home/centoslive/Downloads/minetest-master/src/util/container.h: In member function ‘void Queue<T>::push_back(T)’:
  869. /home/centoslive/Downloads/minetest-master/src/util/container.h:201: error: ‘m_list_size’ was not declared in this scope
  870. /home/centoslive/Downloads/minetest-master/src/util/container.h: In member function ‘void Queue<T>::push_front(T)’:
  871. /home/centoslive/Downloads/minetest-master/src/util/container.h:207: error: ‘m_list_size’ was not declared in this scope
  872. /home/centoslive/Downloads/minetest-master/src/util/container.h: In member function ‘T Queue<T>::pop_front()’:
  873. /home/centoslive/Downloads/minetest-master/src/util/container.h:218: error: ‘m_list_size’ was not declared in this scope
  874. /home/centoslive/Downloads/minetest-master/src/util/container.h: In member function ‘T Queue<T>::pop_back()’:
  875. /home/centoslive/Downloads/minetest-master/src/util/container.h:229: error: ‘m_list_size’ was not declared in this scope
  876. /home/centoslive/Downloads/minetest-master/src/util/container.h: At global scope:
  877. /home/centoslive/Downloads/minetest-master/src/util/container.h:277: error: ‘u32’ has not been declared
  878. /home/centoslive/Downloads/minetest-master/src/util/container.h:294: error: ‘u32’ has not been declared
  879. /home/centoslive/Downloads/minetest-master/src/util/container.h:323: error: ‘u32’ has not been declared
  880. /home/centoslive/Downloads/minetest-master/src/util/container.h:344: error: ‘u32’ has not been declared
  881. In file included from /home/centoslive/Downloads/minetest-master/src/util/thread.h:27,
  882. from /home/centoslive/Downloads/minetest-master/src/connection.h:29,
  883. from /home/centoslive/Downloads/minetest-master/src/server.h:23,
  884. from /home/centoslive/Downloads/minetest-master/src/script/common/c_content.cpp:29:
  885. /home/centoslive/Downloads/minetest-master/src/porting.h:217: error: ‘u32’ does not name a type
  886. /home/centoslive/Downloads/minetest-master/src/porting.h:224: error: ‘u32’ does not name a type
  887. /home/centoslive/Downloads/minetest-master/src/porting.h:231: error: ‘u32’ does not name a type
  888. /home/centoslive/Downloads/minetest-master/src/porting.h:238: error: ‘u32’ does not name a type
  889. /home/centoslive/Downloads/minetest-master/src/porting.h:254: error: ‘u32’ does not name a type
  890. In file included from /home/centoslive/Downloads/minetest-master/src/connection.h:30,
  891. from /home/centoslive/Downloads/minetest-master/src/server.h:23,
  892. from /home/centoslive/Downloads/minetest-master/src/script/common/c_content.cpp:29:
  893. /home/centoslive/Downloads/minetest-master/src/util/numeric.h:30: error: ‘v3s16’ was not declared in this scope
  894. /home/centoslive/Downloads/minetest-master/src/util/numeric.h:30: error: template argument 1 is invalid
  895. /home/centoslive/Downloads/minetest-master/src/util/numeric.h:30: error: template argument 2 is invalid
  896. /home/centoslive/Downloads/minetest-master/src/util/numeric.h:30: error: ‘u16’ has not been declared
  897. /home/centoslive/Downloads/minetest-master/src/util/numeric.h:35: error: expected ‘)’ before ‘*’ token
  898. /home/centoslive/Downloads/minetest-master/src/util/numeric.h:45: error: ISO C++ forbids declaration of ‘u16’ with no type
  899. /home/centoslive/Downloads/minetest-master/src/util/numeric.h:45: error: expected ‘;’ before ‘*’ token
  900. /home/centoslive/Downloads/minetest-master/src/util/numeric.h: In destructor ‘IndentationRaiser::~IndentationRaiser()’:
  901. /home/centoslive/Downloads/minetest-master/src/util/numeric.h:42: error: ‘m_indentation’ was not declared in this scope
  902. /home/centoslive/Downloads/minetest-master/src/util/numeric.h: At global scope:
  903. /home/centoslive/Downloads/minetest-master/src/util/numeric.h:48: error: ‘s16’ does not name a type
  904. /home/centoslive/Downloads/minetest-master/src/util/numeric.h:53: error: ‘v2s16’ does not name a type
  905. /home/centoslive/Downloads/minetest-master/src/util/numeric.h:61: error: ‘v3s16’ does not name a type
  906. /home/centoslive/Downloads/minetest-master/src/util/numeric.h:70: error: ‘v2s16’ does not name a type
  907. /home/centoslive/Downloads/minetest-master/src/util/numeric.h:78: error: ‘v3s16’ does not name a type
  908. /home/centoslive/Downloads/minetest-master/src/util/numeric.h:87: error: ‘isInArea’ declared as an ‘inline’ variable
  909. /home/centoslive/Downloads/minetest-master/src/util/numeric.h:87: error: ‘v3s16’ was not declared in this scope
  910. /home/centoslive/Downloads/minetest-master/src/util/numeric.h:87: error: ‘s16’ was not declared in this scope
  911. /home/centoslive/Downloads/minetest-master/src/util/numeric.h:87: error: initializer expression list treated as compound expression
  912. /home/centoslive/Downloads/minetest-master/src/util/numeric.h:88: error: expected ‘,’ or ‘;’ before ‘{’ token
  913. /home/centoslive/Downloads/minetest-master/src/util/numeric.h:96: error: ‘isInArea’ declared as an ‘inline’ variable
  914. /home/centoslive/Downloads/minetest-master/src/util/numeric.h:96: error: redefinition of ‘bool isInArea’
  915. /home/centoslive/Downloads/minetest-master/src/util/numeric.h:87: error: ‘bool isInArea’ previously defined here
  916. /home/centoslive/Downloads/minetest-master/src/util/numeric.h:96: error: ‘v2s16’ was not declared in this scope
  917. /home/centoslive/Downloads/minetest-master/src/util/numeric.h:96: error: ‘s16’ was not declared in this scope
  918. /home/centoslive/Downloads/minetest-master/src/util/numeric.h:104: error: ‘isInArea’ declared as an ‘inline’ variable
  919. /home/centoslive/Downloads/minetest-master/src/util/numeric.h:104: error: redefinition of ‘bool isInArea’
  920. /home/centoslive/Downloads/minetest-master/src/util/numeric.h:87: error: ‘bool isInArea’ previously defined here
  921. /home/centoslive/Downloads/minetest-master/src/util/numeric.h:104: error: ‘v3s16’ was not declared in this scope
  922. /home/centoslive/Downloads/minetest-master/src/util/numeric.h:104: error: ‘v3s16’ was not declared in this scope
  923. /home/centoslive/Downloads/minetest-master/src/util/numeric.h:113: error: ‘s16’ does not name a type
  924. /home/centoslive/Downloads/minetest-master/src/util/numeric.h:125: error: ‘v3s16’ does not name a type
  925. /home/centoslive/Downloads/minetest-master/src/util/numeric.h:149: error: variable or field ‘sortBoxVerticies’ declared void
  926. /home/centoslive/Downloads/minetest-master/src/util/numeric.h:149: error: ‘v3s16’ was not declared in this scope
  927. /home/centoslive/Downloads/minetest-master/src/util/numeric.h:149: error: ‘p1’ was not declared in this scope
  928. /home/centoslive/Downloads/minetest-master/src/util/numeric.h:149: error: ‘v3s16’ was not declared in this scope
  929. /home/centoslive/Downloads/minetest-master/src/util/numeric.h:149: error: ‘p2’ was not declared in this scope
  930. make[2]: *** [src/CMakeFiles/minetestserver.dir/script/common/c_content.cpp.o] Error 1
  931. make[1]: *** [src/CMakeFiles/minetestserver.dir/all] Error 2
  932. make: *** [all] Error 2
RAW Paste Data

Adblocker detected! Please consider disabling it...

We've detected AdBlock Plus or some other adblocking software preventing Pastebin.com from fully loading.

We don't have any obnoxious sound, or popup ads, we actively block these annoying types of ads!

Please add Pastebin.com to your ad blocker whitelist or disable your adblocking software.

×