Advertisement
Guest User

Untitled

a guest
Nov 3rd, 2016
82
Never
Not a member of Pastebin yet? Sign Up, it unlocks many cool features!
  1. 20:46:06.625 [DEBUG] [org.gradle.api.internal.artifacts.ivyservice.resolveengine.graph.DependencyGraphBuilder] Changed edges for org.scala-lang:scala-library:2.11.1(runtime) selects same versions as previous traversal. ignoring
  2. 20:46:06.660 [DEBUG] [org.gradle.api.internal.artifacts.ivyservice.resolveengine.oldresult.TransientConfigurationResultsBuilder] Flushing resolved configuration data in Binary store in /tmp/gradle1684928899982538822.bin. Wrote root com.minecolonies:minecolonies:1.10.2-0.4.25:forgeGradleMcDeps.
  3. 20:46:06.686 [DEBUG] [org.gradle.api.internal.artifacts.ivyservice.ivyresolve.CachingModuleComponentRepository] Found artifact 'jsr305.jar (com.google.code.findbugs:jsr305:3.0.1)' in resolver cache: /home/ray/.gradle/caches/modules-2/files-2.1/com.google.code.findbugs/jsr305/3.0.1/f7be08ec23c21485b9b5a1cf1654c2ec8c58168d/jsr305-3.0.1.jar
  4. 20:46:06.690 [DEBUG] [org.gradle.api.internal.artifacts.ivyservice.ivyresolve.CachingModuleComponentRepository] Found artifact 'netty.jar (com.mojang:netty:1.6)' in resolver cache: /home/ray/.gradle/caches/modules-2/files-2.1/com.mojang/netty/1.6/4b75825a06139752bd800d9e29c5fd55b8b1b1e4/netty-1.6.jar
  5. 20:46:06.693 [DEBUG] [org.gradle.api.internal.artifacts.ivyservice.ivyresolve.CachingModuleComponentRepository] Found artifact 'oshi-core.jar (oshi-project:oshi-core:1.1)' in resolver cache: /home/ray/.gradle/caches/modules-2/files-2.1/oshi-project/oshi-core/1.1/9ddf7b048a8d701be231c0f4f95fd986198fd2d8/oshi-core-1.1.jar
  6. 20:46:06.696 [DEBUG] [org.gradle.api.internal.artifacts.ivyservice.ivyresolve.CachingModuleComponentRepository] Found artifact 'jna.jar (net.java.dev.jna:jna:3.4.0)' in resolver cache: /home/ray/.gradle/caches/modules-2/files-2.1/net.java.dev.jna/jna/3.4.0/803ff252fedbd395baffd43b37341dc4a150a554/jna-3.4.0.jar
  7. 20:46:06.701 [DEBUG] [org.gradle.api.internal.artifacts.ivyservice.ivyresolve.CachingModuleComponentRepository] Found artifact 'platform.jar (net.java.dev.jna:platform:3.4.0)' in resolver cache: /home/ray/.gradle/caches/modules-2/files-2.1/net.java.dev.jna/platform/3.4.0/e3f70017be8100d3d6923f50b3d2ee17714e9c13/platform-3.4.0.jar
  8. 20:46:06.704 [DEBUG] [org.gradle.api.internal.artifacts.ivyservice.ivyresolve.CachingModuleComponentRepository] Found artifact 'icu4j-core-mojang.jar (com.ibm.icu:icu4j-core-mojang:51.2)' in resolver cache: /home/ray/.gradle/caches/modules-2/files-2.1/com.ibm.icu/icu4j-core-mojang/51.2/63d216a9311cca6be337c1e458e587f99d382b84/icu4j-core-mojang-51.2.jar
  9. 20:46:06.709 [DEBUG] [org.gradle.api.internal.artifacts.ivyservice.ivyresolve.CachingModuleComponentRepository] Found artifact 'jopt-simple.jar (net.sf.jopt-simple:jopt-simple:4.6)' in resolver cache: /home/ray/.gradle/caches/modules-2/files-2.1/net.sf.jopt-simple/jopt-simple/4.6/306816fb57cf94f108a43c95731b08934dcae15c/jopt-simple-4.6.jar
  10. 20:46:06.713 [DEBUG] [org.gradle.api.internal.artifacts.ivyservice.ivyresolve.CachingModuleComponentRepository] Found artifact 'netty-all.jar (io.netty:netty-all:4.0.23.Final)' in resolver cache: /home/ray/.gradle/caches/modules-2/files-2.1/io.netty/netty-all/4.0.23.Final/294104aaf1781d6a56a07d561e792c5d0c95f45/netty-all-4.0.23.Final.jar
  11. 20:46:06.714 [DEBUG] [org.gradle.api.internal.artifacts.ivyservice.ivyresolve.CachingModuleComponentRepository] Found artifact 'guava.jar (com.google.guava:guava:17.0)' in resolver cache: /home/ray/.gradle/caches/modules-2/files-2.1/com.google.guava/guava/17.0/9c6ef172e8de35fd8d4d8783e4821e57cdef7445/guava-17.0.jar
  12. 20:46:06.715 [DEBUG] [org.gradle.api.internal.artifacts.ivyservice.ivyresolve.CachingModuleComponentRepository] Found artifact 'commons-lang3.jar (org.apache.commons:commons-lang3:3.3.2)' in resolver cache: /home/ray/.gradle/caches/modules-2/files-2.1/org.apache.commons/commons-lang3/3.3.2/90a3822c38ec8c996e84c16a3477ef632cbc87a3/commons-lang3-3.3.2.jar
  13. 20:46:06.717 [DEBUG] [org.gradle.api.internal.artifacts.ivyservice.ivyresolve.CachingModuleComponentRepository] Found artifact 'commons-io.jar (commons-io:commons-io:2.4)' in resolver cache: /home/ray/.gradle/caches/modules-2/files-2.1/commons-io/commons-io/2.4/b1b6ea3b7e4aa4f492509a4952029cd8e48019ad/commons-io-2.4.jar
  14. 20:46:06.719 [DEBUG] [org.gradle.api.internal.artifacts.ivyservice.ivyresolve.CachingModuleComponentRepository] Found artifact 'commons-codec.jar (commons-codec:commons-codec:1.9)' in resolver cache: /home/ray/.gradle/caches/modules-2/files-2.1/commons-codec/commons-codec/1.9/9ce04e34240f674bc72680f8b843b1457383161a/commons-codec-1.9.jar
  15. 20:46:06.720 [DEBUG] [org.gradle.api.internal.artifacts.ivyservice.ivyresolve.CachingModuleComponentRepository] Found artifact 'jutils.jar (net.java.jutils:jutils:1.0.0)' in resolver cache: /home/ray/.gradle/caches/modules-2/files-2.1/net.java.jutils/jutils/1.0.0/e12fe1fda814bd348c1579329c86943d2cd3c6a6/jutils-1.0.0.jar
  16. 20:46:06.722 [DEBUG] [org.gradle.api.internal.artifacts.ivyservice.ivyresolve.CachingModuleComponentRepository] Found artifact 'gson.jar (com.google.code.gson:gson:2.2.4)' in resolver cache: /home/ray/.gradle/caches/modules-2/files-2.1/com.google.code.gson/gson/2.2.4/a60a5e993c98c864010053cb901b7eab25306568/gson-2.2.4.jar
  17. 20:46:06.723 [DEBUG] [org.gradle.api.internal.artifacts.ivyservice.ivyresolve.CachingModuleComponentRepository] Found artifact 'authlib.jar (com.mojang:authlib:1.5.22)' in resolver cache: /home/ray/.gradle/caches/modules-2/files-2.1/com.mojang/authlib/1.5.22/afaa8f6df976fcb5520e76ef1d5798c9e6b5c0b2/authlib-1.5.22.jar
  18. 20:46:06.725 [DEBUG] [org.gradle.api.internal.artifacts.ivyservice.ivyresolve.CachingModuleComponentRepository] Found artifact 'realms.jar (com.mojang:realms:1.9.8)' in resolver cache: /home/ray/.gradle/caches/modules-2/files-2.1/com.mojang/realms/1.9.8/c9609760e050cd7c369292252552c0cc81c54331/realms-1.9.8.jar
  19. 20:46:06.727 [DEBUG] [org.gradle.api.internal.artifacts.ivyservice.ivyresolve.CachingModuleComponentRepository] Found artifact 'commons-compress.jar (org.apache.commons:commons-compress:1.8.1)' in resolver cache: /home/ray/.gradle/caches/modules-2/files-2.1/org.apache.commons/commons-compress/1.8.1/a698750c16740fd5b3871425f4cb3bbaa87f529d/commons-compress-1.8.1.jar
  20. 20:46:06.728 [DEBUG] [org.gradle.api.internal.artifacts.ivyservice.ivyresolve.CachingModuleComponentRepository] Found artifact 'httpclient.jar (org.apache.httpcomponents:httpclient:4.3.3)' in resolver cache: /home/ray/.gradle/caches/modules-2/files-2.1/org.apache.httpcomponents/httpclient/4.3.3/18f4247ff4572a074444572cee34647c43e7c9c7/httpclient-4.3.3.jar
  21. 20:46:06.728 [DEBUG] [org.gradle.api.internal.artifacts.ivyservice.ivyresolve.CachingModuleComponentRepository] Found artifact 'commons-logging.jar (commons-logging:commons-logging:1.1.3)' in resolver cache: /home/ray/.gradle/caches/modules-2/files-2.1/commons-logging/commons-logging/1.1.3/f6f66e966c70a83ffbdb6f17a0919eaf7c8aca7f/commons-logging-1.1.3.jar
  22. 20:46:06.730 [DEBUG] [org.gradle.api.internal.artifacts.ivyservice.ivyresolve.CachingModuleComponentRepository] Found artifact 'httpcore.jar (org.apache.httpcomponents:httpcore:4.3.2)' in resolver cache: /home/ray/.gradle/caches/modules-2/files-2.1/org.apache.httpcomponents/httpcore/4.3.2/31fbbff1ddbf98f3aa7377c94d33b0447c646b6e/httpcore-4.3.2.jar
  23. 20:46:06.731 [DEBUG] [org.gradle.api.internal.artifacts.ivyservice.ivyresolve.CachingModuleComponentRepository] Found artifact 'fastutil.jar (it.unimi.dsi:fastutil:7.0.12_mojang)' in resolver cache: /home/ray/.gradle/caches/modules-2/files-2.1/it.unimi.dsi/fastutil/7.0.12_mojang/ba787e741efdc425fc5d2ea654b57c15fba27efa/fastutil-7.0.12_mojang.jar
  24. 20:46:06.732 [DEBUG] [org.gradle.api.internal.artifacts.ivyservice.ivyresolve.CachingModuleComponentRepository] Found artifact 'log4j-api.jar (org.apache.logging.log4j:log4j-api:2.0-beta9)' in resolver cache: /home/ray/.gradle/caches/modules-2/files-2.1/org.apache.logging.log4j/log4j-api/2.0-beta9/1dd66e68cccd907880229f9e2de1314bd13ff785/log4j-api-2.0-beta9.jar
  25. 20:46:06.742 [DEBUG] [org.gradle.api.internal.artifacts.ivyservice.ivyresolve.CachingModuleComponentRepository] Found artifact 'log4j-core.jar (org.apache.logging.log4j:log4j-core:2.0-beta9)' in resolver cache: /home/ray/.gradle/caches/modules-2/files-2.1/org.apache.logging.log4j/log4j-core/2.0-beta9/678861ba1b2e1fccb594bb0ca03114bb05da9695/log4j-core-2.0-beta9.jar
  26. 20:46:06.748 [DEBUG] [org.gradle.api.internal.artifacts.ivyservice.ivyresolve.CachingModuleComponentRepository] Found artifact 'launchwrapper.jar (net.minecraft:launchwrapper:1.12)' in resolver cache: /home/ray/.gradle/caches/modules-2/files-2.1/net.minecraft/launchwrapper/1.12/111e7bea9c968cdb3d06ef4632bf7ff0824d0f36/launchwrapper-1.12.jar
  27. 20:46:06.750 [DEBUG] [org.gradle.api.internal.artifacts.ivyservice.ivyresolve.CachingModuleComponentRepository] Found artifact 'jline.jar (jline:jline:2.13)' in resolver cache: /home/ray/.gradle/caches/modules-2/files-2.1/jline/jline/2.13/2d9530d0a25daffaffda7c35037b046b627bb171/jline-2.13.jar
  28. 20:46:06.750 [DEBUG] [org.gradle.api.internal.artifacts.ivyservice.ivyresolve.CachingModuleComponentRepository] Found artifact 'asm-debug-all.jar (org.ow2.asm:asm-debug-all:5.0.3)' in resolver cache: /home/ray/.gradle/caches/modules-2/files-2.1/org.ow2.asm/asm-debug-all/5.0.3/f9e364ae2a66ce2a543012a4668856e84e5dab74/asm-debug-all-5.0.3.jar
  29. 20:46:06.751 [DEBUG] [org.gradle.api.internal.artifacts.ivyservice.ivyresolve.CachingModuleComponentRepository] Found artifact 'akka-actor_2.11.jar (com.typesafe.akka:akka-actor_2.11:2.3.3)' in resolver cache: /home/ray/.gradle/caches/modules-2/files-2.1/com.typesafe.akka/akka-actor_2.11/2.3.3/ed62e9fc709ca0f2ff1a3220daa8b70a2870078e/akka-actor_2.11-2.3.3.jar
  30. 20:46:06.761 [DEBUG] [org.gradle.api.internal.artifacts.ivyservice.ivyresolve.CachingModuleComponentRepository] Found artifact 'config.jar (com.typesafe:config:1.2.1)' in resolver cache: /home/ray/.gradle/caches/modules-2/files-2.1/com.typesafe/config/1.2.1/f771f71fdae3df231bcd54d5ca2d57f0bf93f467/config-1.2.1.jar
  31. 20:46:06.764 [DEBUG] [org.gradle.api.internal.artifacts.ivyservice.ivyresolve.CachingModuleComponentRepository] Found artifact 'scala-actors-migration_2.11.jar (org.scala-lang:scala-actors-migration_2.11:1.1.0)' in resolver cache: /home/ray/.gradle/caches/modules-2/files-2.1/org.scala-lang/scala-actors-migration_2.11/1.1.0/dfa8bc42b181d5b9f1a5dd147f8ae308b893eb6f/scala-actors-migration_2.11-1.1.0.jar
  32. 20:46:06.767 [DEBUG] [org.gradle.api.internal.artifacts.ivyservice.ivyresolve.CachingModuleComponentRepository] Found artifact 'scala-compiler.jar (org.scala-lang:scala-compiler:2.11.1)' in resolver cache: /home/ray/.gradle/caches/modules-2/files-2.1/org.scala-lang/scala-compiler/2.11.1/56ea2e6c025e0821f28d73ca271218b8dd04926a/scala-compiler-2.11.1.jar
  33. 20:46:06.771 [DEBUG] [org.gradle.api.internal.artifacts.ivyservice.ivyresolve.CachingModuleComponentRepository] Found artifact 'scala-continuations-library_2.11.jar (org.scala-lang.plugins:scala-continuations-library_2.11:1.0.2)' in resolver cache: /home/ray/.gradle/caches/modules-2/files-2.1/org.scala-lang.plugins/scala-continuations-library_2.11/1.0.2/e517c53a7e9acd6b1668c5a35eccbaa3bab9aac/scala-continuations-library_2.11-1.0.2.jar
  34. 20:46:06.776 [DEBUG] [org.gradle.api.internal.artifacts.ivyservice.ivyresolve.CachingModuleComponentRepository] Found artifact 'scala-continuations-plugin_2.11.1.jar (org.scala-lang.plugins:scala-continuations-plugin_2.11.1:1.0.2)' in resolver cache: /home/ray/.gradle/caches/modules-2/files-2.1/org.scala-lang.plugins/scala-continuations-plugin_2.11.1/1.0.2/f361a3283452c57fa30c1ee69448995de23c60f7/scala-continuations-plugin_2.11.1-1.0.2.jar
  35. 20:46:06.780 [DEBUG] [org.gradle.api.internal.artifacts.ivyservice.ivyresolve.CachingModuleComponentRepository] Found artifact 'scala-library.jar (org.scala-lang:scala-library:2.11.1)' in resolver cache: /home/ray/.gradle/caches/modules-2/files-2.1/org.scala-lang/scala-library/2.11.1/e11da23da3eabab9f4777b9220e60d44c1aab6a/scala-library-2.11.1.jar
  36. 20:46:06.782 [DEBUG] [org.gradle.api.internal.artifacts.ivyservice.ivyresolve.CachingModuleComponentRepository] Found artifact 'scala-parser-combinators_2.11.jar (org.scala-lang.modules:scala-parser-combinators_2.11:1.0.1)' in resolver cache: /home/ray/.gradle/caches/modules-2/files-2.1/org.scala-lang.modules/scala-parser-combinators_2.11/1.0.1/f05d7345bf5a58924f2837c6c1f4d73a938e1ff0/scala-parser-combinators_2.11-1.0.1.jar
  37. 20:46:06.783 [DEBUG] [org.gradle.api.internal.artifacts.ivyservice.ivyresolve.CachingModuleComponentRepository] Found artifact 'scala-reflect.jar (org.scala-lang:scala-reflect:2.11.1)' in resolver cache: /home/ray/.gradle/caches/modules-2/files-2.1/org.scala-lang/scala-reflect/2.11.1/6580347e61cc7f8e802941e7fde40fa83b8badeb/scala-reflect-2.11.1.jar
  38. 20:46:06.784 [DEBUG] [org.gradle.api.internal.artifacts.ivyservice.ivyresolve.CachingModuleComponentRepository] Found artifact 'scala-swing_2.11.jar (org.scala-lang.modules:scala-swing_2.11:1.0.1)' in resolver cache: /home/ray/.gradle/caches/modules-2/files-2.1/org.scala-lang.modules/scala-swing_2.11/1.0.1/b1cdd92bd47b1e1837139c1c53020e86bb9112ae/scala-swing_2.11-1.0.1.jar
  39. 20:46:06.785 [DEBUG] [org.gradle.api.internal.artifacts.ivyservice.ivyresolve.CachingModuleComponentRepository] Found artifact 'scala-xml_2.11.jar (org.scala-lang.modules:scala-xml_2.11:1.0.2)' in resolver cache: /home/ray/.gradle/caches/modules-2/files-2.1/org.scala-lang.modules/scala-xml_2.11/1.0.2/820fbca7e524b530fdadc594c39d49a21ea0337e/scala-xml_2.11-1.0.2.jar
  40. 20:46:06.786 [DEBUG] [org.gradle.api.internal.artifacts.ivyservice.ivyresolve.CachingModuleComponentRepository] Found artifact 'lzma.jar (lzma:lzma:0.0.1)' in resolver cache: /home/ray/.gradle/caches/modules-2/files-2.1/lzma/lzma/0.0.1/521616dc7487b42bef0e803bd2fa3faf668101d7/lzma-0.0.1.jar
  41. 20:46:06.791 [DEBUG] [org.gradle.api.internal.artifacts.ivyservice.ivyresolve.CachingModuleComponentRepository] Found artifact 'trove4j.jar (net.sf.trove4j:trove4j:3.0.3)' in resolver cache: /home/ray/.gradle/caches/modules-2/files-2.1/net.sf.trove4j/trove4j/3.0.3/42ccaf4761f0dfdfa805c9e340d99a755907e2dd/trove4j-3.0.3.jar
  42. 20:46:06.793 [DEBUG] [org.gradle.api.internal.artifacts.ivyservice.ivyresolve.CachingModuleComponentRepository] Found artifact 'codecjorbis.jar (com.paulscode:codecjorbis:20101023)' in resolver cache: /home/ray/.gradle/caches/modules-2/files-2.1/com.paulscode/codecjorbis/20101023/c73b5636faf089d9f00e8732a829577de25237ee/codecjorbis-20101023.jar
  43. 20:46:06.794 [DEBUG] [org.gradle.api.internal.artifacts.ivyservice.ivyresolve.CachingModuleComponentRepository] Found artifact 'codecwav.jar (com.paulscode:codecwav:20101023)' in resolver cache: /home/ray/.gradle/caches/modules-2/files-2.1/com.paulscode/codecwav/20101023/12f031cfe88fef5c1dd36c563c0a3a69bd7261da/codecwav-20101023.jar
  44. 20:46:06.794 [DEBUG] [org.gradle.api.internal.artifacts.ivyservice.ivyresolve.CachingModuleComponentRepository] Found artifact 'libraryjavasound.jar (com.paulscode:libraryjavasound:20101123)' in resolver cache: /home/ray/.gradle/caches/modules-2/files-2.1/com.paulscode/libraryjavasound/20101123/5c5e304366f75f9eaa2e8cca546a1fb6109348b3/libraryjavasound-20101123.jar
  45. 20:46:06.809 [DEBUG] [org.gradle.api.internal.artifacts.ivyservice.ivyresolve.CachingModuleComponentRepository] Found artifact 'librarylwjglopenal.jar (com.paulscode:librarylwjglopenal:20100824)' in resolver cache: /home/ray/.gradle/caches/modules-2/files-2.1/com.paulscode/librarylwjglopenal/20100824/73e80d0794c39665aec3f62eee88ca91676674ef/librarylwjglopenal-20100824.jar
  46. 20:46:06.810 [DEBUG] [org.gradle.api.internal.artifacts.ivyservice.ivyresolve.CachingModuleComponentRepository] Found artifact 'soundsystem.jar (com.paulscode:soundsystem:20120107)' in resolver cache: /home/ray/.gradle/caches/modules-2/files-2.1/com.paulscode/soundsystem/20120107/419c05fe9be71f792b2d76cfc9b67f1ed0fec7f6/soundsystem-20120107.jar
  47. 20:46:06.811 [DEBUG] [org.gradle.api.internal.artifacts.ivyservice.ivyresolve.CachingModuleComponentRepository] Found artifact 'jinput.jar (net.java.jinput:jinput:2.0.5)' in resolver cache: /home/ray/.gradle/caches/modules-2/files-2.1/net.java.jinput/jinput/2.0.5/39c7796b469a600f72380316f6b1f11db6c2c7c4/jinput-2.0.5.jar
  48. 20:46:06.813 [DEBUG] [org.gradle.api.internal.artifacts.ivyservice.ivyresolve.CachingModuleComponentRepository] Found artifact 'lwjgl.jar (org.lwjgl.lwjgl:lwjgl:2.9.4-nightly-20150209)' in resolver cache: /home/ray/.gradle/caches/modules-2/files-2.1/org.lwjgl.lwjgl/lwjgl/2.9.4-nightly-20150209/697517568c68e78ae0b4544145af031c81082dfe/lwjgl-2.9.4-nightly-20150209.jar
  49. 20:46:06.814 [DEBUG] [org.gradle.api.internal.artifacts.ivyservice.ivyresolve.CachingModuleComponentRepository] Found artifact 'lwjgl_util.jar (org.lwjgl.lwjgl:lwjgl_util:2.9.4-nightly-20150209)' in resolver cache: /home/ray/.gradle/caches/modules-2/files-2.1/org.lwjgl.lwjgl/lwjgl_util/2.9.4-nightly-20150209/d51a7c040a721d13efdfbd34f8b257b2df882ad0/lwjgl_util-2.9.4-nightly-20150209.jar
  50. 20:46:06.816 [DEBUG] [org.gradle.api.internal.artifacts.ivyservice.ivyresolve.CachingModuleComponentRepository] Found artifact 'vecmath.jar (java3d:vecmath:1.5.2)' in resolver cache: /home/ray/.gradle/caches/modules-2/files-2.1/java3d/vecmath/1.5.2/79846ba34cbd89e2422d74d53752f993dcc2ccaf/vecmath-1.5.2.jar
  51. 20:46:06.818 [DEBUG] [org.gradle.api.internal.artifacts.ivyservice.ivyresolve.CachingModuleComponentRepository] Found artifact 'jansi.jar (org.fusesource.jansi:jansi:1.11)' in resolver cache: /home/ray/.gradle/caches/modules-2/files-2.1/org.fusesource.jansi/jansi/1.11/655c643309c2f45a56a747fda70e3fadf57e9f11/jansi-1.11.jar
  52. 20:46:06.819 [DEBUG] [org.gradle.api.internal.artifacts.ivyservice.ivyresolve.CachingModuleComponentRepository] Found artifact 'scala-actors.jar (org.scala-lang:scala-actors:2.11.0)' in resolver cache: /home/ray/.gradle/caches/modules-2/files-2.1/org.scala-lang/scala-actors/2.11.0/8ccfb6541de179bb1c4d45cf414acee069b7f78b/scala-actors-2.11.0.jar
  53. 20:46:06.820 [DEBUG] [org.gradle.api.internal.artifacts.ivyservice.ivyresolve.CachingModuleComponentRepository] Found artifact 'jinput-platform-natives-linux.jar (net.java.jinput:jinput-platform:2.0.5)' in resolver cache: /home/ray/.gradle/caches/modules-2/files-2.1/net.java.jinput/jinput-platform/2.0.5/7ff832a6eb9ab6a767f1ade2b548092d0fa64795/jinput-platform-2.0.5-natives-linux.jar
  54. 20:46:06.820 [DEBUG] [org.gradle.api.internal.artifacts.ivyservice.ivyresolve.CachingModuleComponentRepository] Found artifact 'jinput-platform-natives-windows.jar (net.java.jinput:jinput-platform:2.0.5)' in resolver cache: /home/ray/.gradle/caches/modules-2/files-2.1/net.java.jinput/jinput-platform/2.0.5/385ee093e01f587f30ee1c8a2ee7d408fd732e16/jinput-platform-2.0.5-natives-windows.jar
  55. 20:46:06.824 [DEBUG] [org.gradle.api.internal.artifacts.ivyservice.ivyresolve.CachingModuleComponentRepository] Found artifact 'jinput-platform-natives-osx.jar (net.java.jinput:jinput-platform:2.0.5)' in resolver cache: /home/ray/.gradle/caches/modules-2/files-2.1/net.java.jinput/jinput-platform/2.0.5/53f9c919f34d2ca9de8c51fc4e1e8282029a9232/jinput-platform-2.0.5-natives-osx.jar
  56. 20:46:06.834 [DEBUG] [org.gradle.api.internal.artifacts.ivyservice.ivyresolve.CachingModuleComponentRepository] Found artifact 'lwjgl-platform-natives-windows.jar (org.lwjgl.lwjgl:lwjgl-platform:2.9.4-nightly-20150209)' in resolver cache: /home/ray/.gradle/caches/modules-2/files-2.1/org.lwjgl.lwjgl/lwjgl-platform/2.9.4-nightly-20150209/b84d5102b9dbfabfeb5e43c7e2828d98a7fc80e0/lwjgl-platform-2.9.4-nightly-20150209-natives-windows.jar
  57. 20:46:06.836 [DEBUG] [org.gradle.api.internal.artifacts.ivyservice.ivyresolve.CachingModuleComponentRepository] Found artifact 'lwjgl-platform-natives-linux.jar (org.lwjgl.lwjgl:lwjgl-platform:2.9.4-nightly-20150209)' in resolver cache: /home/ray/.gradle/caches/modules-2/files-2.1/org.lwjgl.lwjgl/lwjgl-platform/2.9.4-nightly-20150209/931074f46c795d2f7b30ed6395df5715cfd7675b/lwjgl-platform-2.9.4-nightly-20150209-natives-linux.jar
  58. 20:46:06.837 [DEBUG] [org.gradle.api.internal.artifacts.ivyservice.ivyresolve.CachingModuleComponentRepository] Found artifact 'lwjgl-platform-natives-osx.jar (org.lwjgl.lwjgl:lwjgl-platform:2.9.4-nightly-20150209)' in resolver cache: /home/ray/.gradle/caches/modules-2/files-2.1/org.lwjgl.lwjgl/lwjgl-platform/2.9.4-nightly-20150209/bcab850f8f487c3f4c4dbabde778bb82bd1a40ed/lwjgl-platform-2.9.4-nightly-20150209-natives-osx.jar
  59. 20:46:09.027 [DEBUG] [org.gradle.launcher.daemon.server.Daemon] DaemonExpirationPeriodicCheck running
  60. 20:46:09.027 [DEBUG] [org.gradle.cache.internal.DefaultFileLockManager] Waiting to acquire shared lock on daemon addresses registry.
  61. 20:46:09.028 [DEBUG] [org.gradle.cache.internal.DefaultFileLockManager] Lock acquired.
  62. 20:46:09.030 [DEBUG] [org.gradle.cache.internal.DefaultFileLockManager] Releasing lock on daemon addresses registry.
  63. 20:46:19.501 [DEBUG] [org.gradle.launcher.daemon.server.Daemon] DaemonExpirationPeriodicCheck running
  64. 20:46:19.503 [DEBUG] [org.gradle.cache.internal.DefaultFileLockManager] Waiting to acquire shared lock on daemon addresses registry.
  65. 20:46:19.503 [DEBUG] [org.gradle.cache.internal.DefaultFileLockManager] Lock acquired.
  66. 20:46:19.505 [DEBUG] [org.gradle.cache.internal.DefaultFileLockManager] Releasing lock on daemon addresses registry.
  67. 20:46:29.826 [DEBUG] [org.gradle.launcher.daemon.server.Daemon] DaemonExpirationPeriodicCheck running
  68. 20:46:29.826 [DEBUG] [org.gradle.cache.internal.DefaultFileLockManager] Waiting to acquire shared lock on daemon addresses registry.
  69. 20:46:29.827 [DEBUG] [org.gradle.cache.internal.DefaultFileLockManager] Lock acquired.
  70. 20:46:29.828 [DEBUG] [org.gradle.cache.internal.DefaultFileLockManager] Releasing lock on daemon addresses registry.
  71. 20:46:40.042 [DEBUG] [org.gradle.launcher.daemon.server.Daemon] DaemonExpirationPeriodicCheck running
  72. 20:46:40.043 [DEBUG] [org.gradle.cache.internal.DefaultFileLockManager] Waiting to acquire shared lock on daemon addresses registry.
  73. 20:46:40.043 [DEBUG] [org.gradle.cache.internal.DefaultFileLockManager] Lock acquired.
  74. 20:47:09.975 [DEBUG] [org.gradle.cache.internal.DefaultFileLockManager] Releasing lock on daemon addresses registry.
  75. 20:47:09.980 [DEBUG] [org.gradle.launcher.daemon.server.Daemon] DaemonExpirationPeriodicCheck running
  76. 20:47:09.982 [DEBUG] [org.gradle.cache.internal.DefaultFileLockManager] Waiting to acquire shared lock on daemon addresses registry.
  77. 20:47:09.982 [DEBUG] [org.gradle.cache.internal.DefaultFileLockManager] Lock acquired.
  78. 20:47:09.984 [DEBUG] [org.gradle.cache.internal.DefaultFileLockManager] Releasing lock on daemon addresses registry.
  79. 20:47:09.985 [DEBUG] [org.gradle.launcher.daemon.server.Daemon] DaemonExpirationPeriodicCheck running
  80. 20:47:09.985 [DEBUG] [org.gradle.cache.internal.DefaultFileLockManager] Waiting to acquire shared lock on daemon addresses registry.
  81. 20:47:09.985 [DEBUG] [org.gradle.cache.internal.DefaultFileLockManager] Lock acquired.
  82. 20:47:09.988 [DEBUG] [org.gradle.cache.internal.DefaultFileLockManager] Releasing lock on daemon addresses registry.
  83. 20:47:09.989 [DEBUG] [org.gradle.launcher.daemon.server.Daemon] DaemonExpirationPeriodicCheck running
  84. 20:47:09.989 [DEBUG] [org.gradle.cache.internal.DefaultFileLockManager] Waiting to acquire shared lock on daemon addresses registry.
  85. 20:47:09.990 [DEBUG] [org.gradle.cache.internal.DefaultFileLockManager] Lock acquired.
  86. 20:47:09.992 [DEBUG] [org.gradle.cache.internal.DefaultFileLockManager] Releasing lock on daemon addresses registry.
  87. 20:47:19.354 [DEBUG] [org.gradle.launcher.daemon.server.Daemon] DaemonExpirationPeriodicCheck running
  88. 20:47:26.656 [DEBUG] [org.gradle.api.internal.tasks.execution.ExecuteAtMostOnceTaskExecuter] Finished executing task ':decompileMc'
  89. 20:47:26.656 [DEBUG] [org.gradle.cache.internal.DefaultFileLockManager] Waiting to acquire shared lock on daemon addresses registry.
  90. 20:47:26.656 [LIFECYCLE] [class org.gradle.internal.buildevents.TaskExecutionLogger] :decompileMc FAILED
  91. 20:47:26.656 [DEBUG] [org.gradle.cache.internal.DefaultFileLockManager] Lock acquired.
  92. 20:47:26.656 [INFO] [org.gradle.execution.taskgraph.AbstractTaskPlanExecutor] :decompileMc (Thread[Daemon worker,5,main]) completed. Took 1 mins 26.231 secs.
  93. 20:47:26.657 [DEBUG] [org.gradle.internal.operations.DefaultBuildOperationWorkerRegistry] Worker root.14 completed (0 in use)
  94. 20:47:26.657 [DEBUG] [org.gradle.execution.taskgraph.AbstractTaskPlanExecutor] Task worker [Thread[Daemon worker,5,main]] finished, busy: 1 mins 33.15 secs, idle: 0.01 secs
  95. 20:47:26.800 [ERROR] [org.gradle.internal.buildevents.BuildExceptionReporter]
  96. 20:47:26.803 [ERROR] [org.gradle.internal.buildevents.BuildExceptionReporter] FAILURE: Build failed with an exception.
  97. 20:47:26.804 [ERROR] [org.gradle.internal.buildevents.BuildExceptionReporter]
  98. 20:47:26.804 [ERROR] [org.gradle.internal.buildevents.BuildExceptionReporter] * What went wrong:
  99. 20:47:26.804 [ERROR] [org.gradle.internal.buildevents.BuildExceptionReporter] Execution failed for task ':decompileMc'.
  100. 20:47:26.804 [ERROR] [org.gradle.internal.buildevents.BuildExceptionReporter] > GC overhead limit exceeded
  101. 20:47:26.805 [ERROR] [org.gradle.internal.buildevents.BuildExceptionReporter]
  102. 20:47:26.805 [ERROR] [org.gradle.internal.buildevents.BuildExceptionReporter] * Exception is:
  103. 20:47:26.805 [ERROR] [org.gradle.internal.buildevents.BuildExceptionReporter] org.gradle.api.tasks.TaskExecutionException: Execution failed for task ':decompileMc'.
  104. 20:47:26.806 [ERROR] [org.gradle.internal.buildevents.BuildExceptionReporter] at org.gradle.api.internal.tasks.execution.ExecuteActionsTaskExecuter.executeActions(ExecuteActionsTaskExecuter.java:69)
  105. 20:47:26.806 [ERROR] [org.gradle.internal.buildevents.BuildExceptionReporter] at org.gradle.api.internal.tasks.execution.ExecuteActionsTaskExecuter.execute(ExecuteActionsTaskExecuter.java:46)
  106. 20:47:26.806 [ERROR] [org.gradle.internal.buildevents.BuildExceptionReporter] at org.gradle.api.internal.tasks.execution.PostExecutionAnalysisTaskExecuter.execute(PostExecutionAnalysisTaskExecuter.java:35)
  107. 20:47:26.806 [ERROR] [org.gradle.internal.buildevents.BuildExceptionReporter] at org.gradle.api.internal.tasks.execution.SkipUpToDateTaskExecuter.execute(SkipUpToDateTaskExecuter.java:64)
  108. 20:47:26.806 [ERROR] [org.gradle.internal.buildevents.BuildExceptionReporter] at org.gradle.api.internal.tasks.execution.ValidatingTaskExecuter.execute(ValidatingTaskExecuter.java:58)
  109. 20:47:26.806 [ERROR] [org.gradle.internal.buildevents.BuildExceptionReporter] at org.gradle.api.internal.tasks.execution.SkipEmptySourceFilesTaskExecuter.execute(SkipEmptySourceFilesTaskExecuter.java:52)
  110. 20:47:26.806 [ERROR] [org.gradle.internal.buildevents.BuildExceptionReporter] at org.gradle.api.internal.tasks.execution.SkipTaskWithNoActionsExecuter.execute(SkipTaskWithNoActionsExecuter.java:52)
  111. 20:47:26.807 [ERROR] [org.gradle.internal.buildevents.BuildExceptionReporter] at org.gradle.api.internal.tasks.execution.SkipOnlyIfTaskExecuter.execute(SkipOnlyIfTaskExecuter.java:53)
  112. 20:47:26.807 [ERROR] [org.gradle.internal.buildevents.BuildExceptionReporter] at org.gradle.api.internal.tasks.execution.ExecuteAtMostOnceTaskExecuter.execute(ExecuteAtMostOnceTaskExecuter.java:43)
  113. 20:47:26.807 [ERROR] [org.gradle.internal.buildevents.BuildExceptionReporter] at org.gradle.execution.taskgraph.DefaultTaskGraphExecuter$EventFiringTaskWorker.execute(DefaultTaskGraphExecuter.java:203)
  114. 20:47:26.807 [ERROR] [org.gradle.internal.buildevents.BuildExceptionReporter] at org.gradle.execution.taskgraph.DefaultTaskGraphExecuter$EventFiringTaskWorker.execute(DefaultTaskGraphExecuter.java:185)
  115. 20:47:26.807 [ERROR] [org.gradle.internal.buildevents.BuildExceptionReporter] at org.gradle.execution.taskgraph.AbstractTaskPlanExecutor$TaskExecutorWorker.processTask(AbstractTaskPlanExecutor.java:74)
  116. 20:47:26.807 [ERROR] [org.gradle.internal.buildevents.BuildExceptionReporter] at org.gradle.execution.taskgraph.AbstractTaskPlanExecutor$TaskExecutorWorker.run(AbstractTaskPlanExecutor.java:55)
  117. 20:47:26.807 [ERROR] [org.gradle.internal.buildevents.BuildExceptionReporter] at org.gradle.execution.taskgraph.DefaultTaskPlanExecutor.process(DefaultTaskPlanExecutor.java:32)
  118. 20:47:26.808 [ERROR] [org.gradle.internal.buildevents.BuildExceptionReporter] at org.gradle.execution.taskgraph.DefaultTaskGraphExecuter.execute(DefaultTaskGraphExecuter.java:110)
  119. 20:47:26.808 [ERROR] [org.gradle.internal.buildevents.BuildExceptionReporter] at org.gradle.execution.SelectedTaskExecutionAction.execute(SelectedTaskExecutionAction.java:37)
  120. 20:47:26.808 [ERROR] [org.gradle.internal.buildevents.BuildExceptionReporter] at org.gradle.execution.DefaultBuildExecuter.execute(DefaultBuildExecuter.java:37)
  121. 20:47:26.808 [ERROR] [org.gradle.internal.buildevents.BuildExceptionReporter] at org.gradle.execution.DefaultBuildExecuter.access$000(DefaultBuildExecuter.java:23)
  122. 20:47:26.808 [ERROR] [org.gradle.internal.buildevents.BuildExceptionReporter] at org.gradle.execution.DefaultBuildExecuter$1.proceed(DefaultBuildExecuter.java:43)
  123. 20:47:26.808 [ERROR] [org.gradle.internal.buildevents.BuildExceptionReporter] at org.gradle.execution.DryRunBuildExecutionAction.execute(DryRunBuildExecutionAction.java:32)
  124. 20:47:26.808 [ERROR] [org.gradle.internal.buildevents.BuildExceptionReporter] at org.gradle.execution.DefaultBuildExecuter.execute(DefaultBuildExecuter.java:37)
  125. 20:47:26.808 [ERROR] [org.gradle.internal.buildevents.BuildExceptionReporter] at org.gradle.execution.DefaultBuildExecuter.execute(DefaultBuildExecuter.java:30)
  126. 20:47:26.809 [ERROR] [org.gradle.internal.buildevents.BuildExceptionReporter] at org.gradle.initialization.DefaultGradleLauncher$4.run(DefaultGradleLauncher.java:153)
  127. 20:47:26.809 [ERROR] [org.gradle.internal.buildevents.BuildExceptionReporter] at org.gradle.internal.Factories$1.create(Factories.java:22)
  128. 20:47:26.809 [ERROR] [org.gradle.internal.buildevents.BuildExceptionReporter] at org.gradle.internal.progress.DefaultBuildOperationExecutor.run(DefaultBuildOperationExecutor.java:91)
  129. 20:47:26.809 [ERROR] [org.gradle.internal.buildevents.BuildExceptionReporter] at org.gradle.internal.progress.DefaultBuildOperationExecutor.run(DefaultBuildOperationExecutor.java:53)
  130. 20:47:26.809 [ERROR] [org.gradle.internal.buildevents.BuildExceptionReporter] at org.gradle.initialization.DefaultGradleLauncher.doBuildStages(DefaultGradleLauncher.java:150)
  131. 20:47:26.809 [ERROR] [org.gradle.internal.buildevents.BuildExceptionReporter] at org.gradle.initialization.DefaultGradleLauncher.access$200(DefaultGradleLauncher.java:32)
  132. 20:47:26.809 [ERROR] [org.gradle.internal.buildevents.BuildExceptionReporter] at org.gradle.initialization.DefaultGradleLauncher$1.create(DefaultGradleLauncher.java:98)
  133. 20:47:26.809 [ERROR] [org.gradle.internal.buildevents.BuildExceptionReporter] at org.gradle.initialization.DefaultGradleLauncher$1.create(DefaultGradleLauncher.java:92)
  134. 20:47:26.810 [ERROR] [org.gradle.internal.buildevents.BuildExceptionReporter] at org.gradle.internal.progress.DefaultBuildOperationExecutor.run(DefaultBuildOperationExecutor.java:91)
  135. 20:47:26.810 [ERROR] [org.gradle.internal.buildevents.BuildExceptionReporter] at org.gradle.internal.progress.DefaultBuildOperationExecutor.run(DefaultBuildOperationExecutor.java:63)
  136. 20:47:26.810 [ERROR] [org.gradle.internal.buildevents.BuildExceptionReporter] at org.gradle.initialization.DefaultGradleLauncher.doBuild(DefaultGradleLauncher.java:92)
  137. 20:47:26.810 [ERROR] [org.gradle.internal.buildevents.BuildExceptionReporter] at org.gradle.initialization.DefaultGradleLauncher.run(DefaultGradleLauncher.java:83)
  138. 20:47:26.810 [ERROR] [org.gradle.internal.buildevents.BuildExceptionReporter] at org.gradle.launcher.exec.InProcessBuildActionExecuter$DefaultBuildController.run(InProcessBuildActionExecuter.java:94)
  139. 20:47:26.810 [ERROR] [org.gradle.internal.buildevents.BuildExceptionReporter] at org.gradle.tooling.internal.provider.ExecuteBuildActionRunner.run(ExecuteBuildActionRunner.java:28)
  140. 20:47:26.810 [ERROR] [org.gradle.internal.buildevents.BuildExceptionReporter] at org.gradle.launcher.exec.ChainingBuildActionRunner.run(ChainingBuildActionRunner.java:35)
  141. 20:47:26.811 [ERROR] [org.gradle.internal.buildevents.BuildExceptionReporter] at org.gradle.launcher.exec.InProcessBuildActionExecuter.execute(InProcessBuildActionExecuter.java:43)
  142. 20:47:26.811 [ERROR] [org.gradle.internal.buildevents.BuildExceptionReporter] at org.gradle.launcher.exec.InProcessBuildActionExecuter.execute(InProcessBuildActionExecuter.java:28)
  143. 20:47:26.811 [ERROR] [org.gradle.internal.buildevents.BuildExceptionReporter] at org.gradle.launcher.exec.ContinuousBuildActionExecuter.execute(ContinuousBuildActionExecuter.java:82)
  144. 20:47:26.811 [ERROR] [org.gradle.internal.buildevents.BuildExceptionReporter] at org.gradle.launcher.exec.ContinuousBuildActionExecuter.execute(ContinuousBuildActionExecuter.java:49)
  145. 20:47:26.811 [ERROR] [org.gradle.internal.buildevents.BuildExceptionReporter] at org.gradle.launcher.daemon.server.exec.ExecuteBuild.doBuild(ExecuteBuild.java:59)
  146. 20:47:26.811 [ERROR] [org.gradle.internal.buildevents.BuildExceptionReporter] at org.gradle.launcher.daemon.server.exec.BuildCommandOnly.execute(BuildCommandOnly.java:36)
  147. 20:47:26.811 [ERROR] [org.gradle.internal.buildevents.BuildExceptionReporter] at org.gradle.launcher.daemon.server.api.DaemonCommandExecution.proceed(DaemonCommandExecution.java:120)
  148. 20:47:26.811 [ERROR] [org.gradle.internal.buildevents.BuildExceptionReporter] at org.gradle.launcher.daemon.server.exec.WatchForDisconnection.execute(WatchForDisconnection.java:49)
  149. 20:47:26.812 [ERROR] [org.gradle.internal.buildevents.BuildExceptionReporter] at org.gradle.launcher.daemon.server.api.DaemonCommandExecution.proceed(DaemonCommandExecution.java:120)
  150. 20:47:26.812 [ERROR] [org.gradle.internal.buildevents.BuildExceptionReporter] at org.gradle.launcher.daemon.server.exec.ResetDeprecationLogger.execute(ResetDeprecationLogger.java:26)
  151. 20:47:26.812 [ERROR] [org.gradle.internal.buildevents.BuildExceptionReporter] at org.gradle.launcher.daemon.server.api.DaemonCommandExecution.proceed(DaemonCommandExecution.java:120)
  152. 20:47:26.812 [ERROR] [org.gradle.internal.buildevents.BuildExceptionReporter] at org.gradle.launcher.daemon.server.exec.RequestStopIfSingleUsedDaemon.execute(RequestStopIfSingleUsedDaemon.java:34)
  153. 20:47:26.812 [ERROR] [org.gradle.internal.buildevents.BuildExceptionReporter] at org.gradle.launcher.daemon.server.api.DaemonCommandExecution.proceed(DaemonCommandExecution.java:120)
  154. 20:47:26.812 [ERROR] [org.gradle.internal.buildevents.BuildExceptionReporter] at org.gradle.launcher.daemon.server.exec.ForwardClientInput$2.call(ForwardClientInput.java:74)
  155. 20:47:26.812 [ERROR] [org.gradle.internal.buildevents.BuildExceptionReporter] at org.gradle.launcher.daemon.server.exec.ForwardClientInput$2.call(ForwardClientInput.java:72)
  156. 20:47:26.813 [ERROR] [org.gradle.internal.buildevents.BuildExceptionReporter] at org.gradle.util.Swapper.swap(Swapper.java:38)
  157. 20:47:26.813 [ERROR] [org.gradle.internal.buildevents.BuildExceptionReporter] at org.gradle.launcher.daemon.server.exec.ForwardClientInput.execute(ForwardClientInput.java:72)
  158. 20:47:26.813 [ERROR] [org.gradle.internal.buildevents.BuildExceptionReporter] at org.gradle.launcher.daemon.server.api.DaemonCommandExecution.proceed(DaemonCommandExecution.java:120)
  159. 20:47:26.813 [ERROR] [org.gradle.internal.buildevents.BuildExceptionReporter] at org.gradle.launcher.daemon.server.exec.LogAndCheckHealth.execute(LogAndCheckHealth.java:55)
  160. 20:47:26.813 [ERROR] [org.gradle.internal.buildevents.BuildExceptionReporter] at org.gradle.launcher.daemon.server.api.DaemonCommandExecution.proceed(DaemonCommandExecution.java:120)
  161. 20:47:26.813 [ERROR] [org.gradle.internal.buildevents.BuildExceptionReporter] at org.gradle.launcher.daemon.server.exec.LogToClient.doBuild(LogToClient.java:60)
  162. 20:47:26.813 [ERROR] [org.gradle.internal.buildevents.BuildExceptionReporter] at org.gradle.launcher.daemon.server.exec.BuildCommandOnly.execute(BuildCommandOnly.java:36)
  163. 20:47:26.813 [ERROR] [org.gradle.internal.buildevents.BuildExceptionReporter] at org.gradle.launcher.daemon.server.api.DaemonCommandExecution.proceed(DaemonCommandExecution.java:120)
  164. 20:47:26.814 [ERROR] [org.gradle.internal.buildevents.BuildExceptionReporter] at org.gradle.launcher.daemon.server.exec.EstablishBuildEnvironment.doBuild(EstablishBuildEnvironment.java:72)
  165. 20:47:26.814 [ERROR] [org.gradle.internal.buildevents.BuildExceptionReporter] at org.gradle.launcher.daemon.server.exec.BuildCommandOnly.execute(BuildCommandOnly.java:36)
  166. 20:47:26.814 [ERROR] [org.gradle.internal.buildevents.BuildExceptionReporter] at org.gradle.launcher.daemon.server.api.DaemonCommandExecution.proceed(DaemonCommandExecution.java:120)
  167. 20:47:26.814 [ERROR] [org.gradle.internal.buildevents.BuildExceptionReporter] at org.gradle.launcher.daemon.server.exec.HintGCAfterBuild.execute(HintGCAfterBuild.java:44)
  168. 20:47:26.814 [ERROR] [org.gradle.internal.buildevents.BuildExceptionReporter] at org.gradle.launcher.daemon.server.api.DaemonCommandExecution.proceed(DaemonCommandExecution.java:120)
  169. 20:47:26.814 [ERROR] [org.gradle.internal.buildevents.BuildExceptionReporter] at org.gradle.launcher.daemon.server.exec.StartBuildOrRespondWithBusy$1.run(StartBuildOrRespondWithBusy.java:50)
  170. 20:47:26.814 [ERROR] [org.gradle.internal.buildevents.BuildExceptionReporter] at org.gradle.launcher.daemon.server.DaemonStateCoordinator$1.run(DaemonStateCoordinator.java:240)
  171. 20:47:26.814 [ERROR] [org.gradle.internal.buildevents.BuildExceptionReporter] at org.gradle.internal.concurrent.ExecutorPolicy$CatchAndRecordFailures.onExecute(ExecutorPolicy.java:54)
  172. 20:47:26.815 [ERROR] [org.gradle.internal.buildevents.BuildExceptionReporter] at org.gradle.internal.concurrent.StoppableExecutorImpl$1.run(StoppableExecutorImpl.java:40)
  173. 20:47:26.815 [ERROR] [org.gradle.internal.buildevents.BuildExceptionReporter] Caused by: java.lang.OutOfMemoryError: GC overhead limit exceeded
  174. 20:47:26.815 [ERROR] [org.gradle.internal.buildevents.BuildExceptionReporter] at org.jetbrains.java.decompiler.struct.consts.ConstantPool.<init>(ConstantPool.java:54)
  175. 20:47:26.815 [ERROR] [org.gradle.internal.buildevents.BuildExceptionReporter] at org.jetbrains.java.decompiler.struct.StructClass.<init>(StructClass.java:87)
  176. 20:47:26.815 [ERROR] [org.gradle.internal.buildevents.BuildExceptionReporter] at org.jetbrains.java.decompiler.struct.StructClass.<init>(StructClass.java:75)
  177. 20:47:26.815 [ERROR] [org.gradle.internal.buildevents.BuildExceptionReporter] at org.jetbrains.java.decompiler.struct.StructContext.addArchive(StructContext.java:167)
  178. 20:47:26.815 [ERROR] [org.gradle.internal.buildevents.BuildExceptionReporter] at org.jetbrains.java.decompiler.struct.StructContext.addSpace(StructContext.java:100)
  179. 20:47:26.815 [ERROR] [org.gradle.internal.buildevents.BuildExceptionReporter] at org.jetbrains.java.decompiler.struct.StructContext.addSpace(StructContext.java:78)
  180. 20:47:26.816 [ERROR] [org.gradle.internal.buildevents.BuildExceptionReporter] at org.jetbrains.java.decompiler.main.decompiler.BaseDecompiler.addSpace(BaseDecompiler.java:36)
  181. 20:47:26.816 [ERROR] [org.gradle.internal.buildevents.BuildExceptionReporter] at net.minecraftforge.gradle.tasks.ApplyFernFlowerTask.applyFernFlower(ApplyFernFlowerTask.java:98)
  182. 20:47:26.816 [ERROR] [org.gradle.internal.buildevents.BuildExceptionReporter] at org.gradle.internal.reflect.JavaMethod.invoke(JavaMethod.java:75)
  183. 20:47:26.816 [ERROR] [org.gradle.internal.buildevents.BuildExceptionReporter] at org.gradle.api.internal.project.taskfactory.DefaultTaskClassInfoStore$StandardTaskAction.doExecute(DefaultTaskClassInfoStore.java:133)
  184. 20:47:26.816 [ERROR] [org.gradle.internal.buildevents.BuildExceptionReporter] at org.gradle.api.internal.project.taskfactory.DefaultTaskClassInfoStore$StandardTaskAction.execute(DefaultTaskClassInfoStore.java:126)
  185. 20:47:26.816 [ERROR] [org.gradle.internal.buildevents.BuildExceptionReporter] at org.gradle.api.internal.project.taskfactory.DefaultTaskClassInfoStore$StandardTaskAction.execute(DefaultTaskClassInfoStore.java:115)
  186. 20:47:26.816 [ERROR] [org.gradle.internal.buildevents.BuildExceptionReporter] at org.gradle.api.internal.AbstractTask$TaskActionWrapper.execute(AbstractTask.java:623)
  187. 20:47:26.816 [ERROR] [org.gradle.internal.buildevents.BuildExceptionReporter] at org.gradle.api.internal.AbstractTask$TaskActionWrapper.execute(AbstractTask.java:606)
  188. 20:47:26.817 [ERROR] [org.gradle.internal.buildevents.BuildExceptionReporter] at org.gradle.api.internal.tasks.execution.ExecuteActionsTaskExecuter.executeAction(ExecuteActionsTaskExecuter.java:80)
  189. 20:47:26.817 [ERROR] [org.gradle.internal.buildevents.BuildExceptionReporter] at org.gradle.api.internal.tasks.execution.ExecuteActionsTaskExecuter.executeActions(ExecuteActionsTaskExecuter.java:61)
  190. 20:47:26.817 [ERROR] [org.gradle.internal.buildevents.BuildExceptionReporter] at org.gradle.api.internal.tasks.execution.ExecuteActionsTaskExecuter.execute(ExecuteActionsTaskExecuter.java:46)
  191. 20:47:26.817 [ERROR] [org.gradle.internal.buildevents.BuildExceptionReporter] at org.gradle.api.internal.tasks.execution.PostExecutionAnalysisTaskExecuter.execute(PostExecutionAnalysisTaskExecuter.java:35)
  192. 20:47:26.817 [ERROR] [org.gradle.internal.buildevents.BuildExceptionReporter] at org.gradle.api.internal.tasks.execution.SkipUpToDateTaskExecuter.execute(SkipUpToDateTaskExecuter.java:64)
  193. 20:47:26.817 [ERROR] [org.gradle.internal.buildevents.BuildExceptionReporter] at org.gradle.api.internal.tasks.execution.ValidatingTaskExecuter.execute(ValidatingTaskExecuter.java:58)
  194. 20:47:26.817 [ERROR] [org.gradle.internal.buildevents.BuildExceptionReporter] at org.gradle.api.internal.tasks.execution.SkipEmptySourceFilesTaskExecuter.execute(SkipEmptySourceFilesTaskExecuter.java:52)
  195. 20:47:26.817 [ERROR] [org.gradle.internal.buildevents.BuildExceptionReporter] at org.gradle.api.internal.tasks.execution.SkipTaskWithNoActionsExecuter.execute(SkipTaskWithNoActionsExecuter.java:52)
  196. 20:47:26.818 [ERROR] [org.gradle.internal.buildevents.BuildExceptionReporter] at org.gradle.api.internal.tasks.execution.SkipOnlyIfTaskExecuter.execute(SkipOnlyIfTaskExecuter.java:53)
  197. 20:47:26.818 [ERROR] [org.gradle.internal.buildevents.BuildExceptionReporter]
  198. 20:47:26.818 [DEBUG] [org.gradle.cache.internal.DefaultFileLockManager] Releasing lock on daemon addresses registry.
  199. 20:47:26.818 [LIFECYCLE] [org.gradle.internal.buildevents.BuildResultLogger]
  200. 20:47:26.818 [LIFECYCLE] [org.gradle.internal.buildevents.BuildResultLogger] BUILD FAILED
  201. 20:47:26.818 [LIFECYCLE] [org.gradle.internal.buildevents.BuildResultLogger]
  202. 20:47:26.818 [LIFECYCLE] [org.gradle.internal.buildevents.BuildResultLogger] Total time: 1 mins 49.535 secs
  203. 20:47:26.827 [DEBUG] [org.gradle.cache.internal.btree.BTreePersistentIndexedCache] Closing cache fileSnapshots.bin (/home/ray/IdeaProjects/minecolonies/.gradle/3.0/taskArtifacts/fileSnapshots.bin)
  204. 20:47:26.828 [DEBUG] [org.gradle.cache.internal.btree.BTreePersistentIndexedCache] Closing cache fileHashes.bin (/home/ray/IdeaProjects/minecolonies/.gradle/3.0/taskArtifacts/fileHashes.bin)
  205. 20:47:26.828 [DEBUG] [org.gradle.cache.internal.btree.BTreePersistentIndexedCache] Closing cache fileSnapshotsToTreeSnapshotsIndex.bin (/home/ray/IdeaProjects/minecolonies/.gradle/3.0/taskArtifacts/fileSnapshotsToTreeSnapshotsIndex.bin)
  206. 20:47:26.828 [DEBUG] [org.gradle.cache.internal.btree.BTreePersistentIndexedCache] Closing cache taskArtifacts.bin (/home/ray/IdeaProjects/minecolonies/.gradle/3.0/taskArtifacts/taskArtifacts.bin)
  207. 20:47:26.828 [DEBUG] [org.gradle.cache.internal.DefaultFileLockManager] Releasing lock on task history cache (/home/ray/IdeaProjects/minecolonies/.gradle/3.0/taskArtifacts).
  208. 20:47:26.836 [DEBUG] [org.gradle.api.internal.artifacts.ivyservice.resolveengine.store.CachedStoreFactory] Resolution result cache closed. Cache reads: 0, disk reads: 0 (avg: 0.0 secs, total: 0.0 secs)
  209. 20:47:26.836 [DEBUG] [org.gradle.api.internal.artifacts.ivyservice.resolveengine.store.CachedStoreFactory] Resolution result cache closed. Cache reads: 0, disk reads: 0 (avg: 0.0 secs, total: 0.0 secs)
  210. 20:47:26.837 [DEBUG] [org.gradle.api.internal.artifacts.ivyservice.resolveengine.store.ResolutionResultsStoreFactory] Deleted 2 resolution results binary files in 0.001 secs
  211. 20:47:26.837 [DEBUG] [org.gradle.api.internal.artifacts.ivyservice.ivyresolve.memcache.InMemoryCachedRepositoryFactory] In-memory dependency metadata cache closed. Repos cached: 31, cache instances: 7, modules served from cache: 0, artifacts: 0
  212. 20:47:26.837 [DEBUG] [org.gradle.cache.internal.DefaultCacheAccess] Cache Generated Gradle JARs cache (/home/ray/.gradle/caches/3.0/generated-gradle-jars) was closed 0 times.
  213. 20:47:26.837 [DEBUG] [org.gradle.cache.internal.btree.BTreePersistentIndexedCache] Closing cache artifact-at-url.bin (/home/ray/.gradle/caches/modules-2/metadata-2.17/artifact-at-url.bin)
  214. 20:47:26.838 [DEBUG] [org.gradle.cache.internal.btree.BTreePersistentIndexedCache] Closing cache module-metadata.bin (/home/ray/.gradle/caches/modules-2/metadata-2.17/module-metadata.bin)
  215. 20:47:26.838 [DEBUG] [org.gradle.cache.internal.btree.BTreePersistentIndexedCache] Closing cache artifact-at-repository.bin (/home/ray/.gradle/caches/modules-2/metadata-2.17/artifact-at-repository.bin)
  216. 20:47:26.838 [DEBUG] [org.gradle.cache.internal.DefaultFileLockManager] Releasing lock on artifact cache (/home/ray/.gradle/caches/modules-2).
  217. 20:47:26.838 [DEBUG] [org.gradle.cache.internal.btree.BTreePersistentIndexedCache] Closing cache plugin-use-metadata.bin (/home/ray/.gradle/caches/3.0/plugin-resolution/plugin-use-metadata.bin)
  218. 20:47:26.838 [DEBUG] [org.gradle.cache.internal.DefaultFileLockManager] Releasing lock on Plugin Resolution Cache (/home/ray/.gradle/caches/3.0/plugin-resolution).
  219. 20:47:26.839 [DEBUG] [org.gradle.api.internal.tasks.compile.daemon.CompilerDaemonManager] Stopping 0 compiler daemon(s).
  220. 20:47:26.839 [INFO] [org.gradle.api.internal.tasks.compile.daemon.CompilerDaemonManager] Stopped 0 compiler daemon(s).
  221. 20:47:26.839 [DEBUG] [org.gradle.launcher.daemon.server.exec.ExecuteBuild] The daemon has finished executing the build.
  222. 20:47:27.092 [DEBUG] [org.gradle.launcher.daemon.client.DaemonClientInputForwarder] Dispatching close input message: org.gradle.launcher.daemon.protocol.CloseInput@51d7f778
  223. 20:47:27.092 [DEBUG] [org.gradle.launcher.daemon.client.DaemonClientConnection] thread 16: dispatching class org.gradle.launcher.daemon.protocol.CloseInput
  224. 20:47:27.101 [INFO] [org.gradle.launcher.daemon.client.DaemonClient] Received result Failure[value=org.gradle.initialization.ReportedException: org.gradle.internal.exceptions.LocationAwareException: Execution failed for task ':decompileMc'.] from daemon DaemonInfo{pid=2314, address=[03fe05c6-1e44-4b9e-ae1d-037c2ae57039 port:42453, addresses:[/0:0:0:0:0:0:0:1%lo, /127.0.0.1]], idle=false, lastBusy=1478213138934, context=DefaultDaemonContext[uid=bb22c26e-8804-4cc3-8bf5-0ad05079bc8f,javaHome=/usr/lib/jvm/java-8-openjdk,daemonRegistryDir=/home/ray/.gradle/daemon,pid=2314,idleTimeout=10800000,daemonOpts=-XX:MaxPermSize=256m,-XX:+HeapDumpOnOutOfMemoryError,-Xmx1024m,-Dfile.encoding=UTF-8,-Duser.country=US,-Duser.language=en,-Duser.variant]} (build should be done).
  225. 20:47:27.101 [DEBUG] [org.gradle.launcher.daemon.client.DaemonClientConnection] thread 1: dispatching class org.gradle.launcher.daemon.protocol.Finished
  226. 20:47:27.104 [DEBUG] [org.gradle.launcher.daemon.client.DaemonClientConnection] thread 1: connection stop
Advertisement
Advertisement
Advertisement
RAW Paste Data Copied
Advertisement