Guest User

Untitled

a guest
Oct 4th, 2012
59
Never
Not a member of Pastebin yet? Sign Up, it unlocks many cool features!
  1. 18:51:59.792 [DEBUG] [TestEventLogger] com.<xxxxx>.app.dicomview.TestImagePrinter > testWrongImagePrintoutFile FAILED
  2. 18:51:59.782 [QUIET] [system.out] 18:51:59.736 [DEBUG] [org.gradle.process.internal.child.ActionExecutionWorker] Completed Gradle Worker 5.
  3. 18:51:59.826 [DEBUG] [TestEventLogger] java.lang.AssertionError: dicomServer is not started
  4. 18:51:59.802 [DEBUG] [org.gradle.messaging.remote.internal.WorkerProtocol] Dispatching request to worker: [Request consumer: 053da2b2-c592-431e-ae83-d592e417e7e6, payload: [MethodInvocation method: comple
  5. ed()]]
  6. 18:51:59.842 [DEBUG] [TestEventLogger] at org.junit.Assert.fail(Assert.java:91)
  7. 18:51:59.834 [QUIET] [system.out] 18:51:59.736 [DEBUG] [org.gradle.process.internal.child.ActionExecutionWorker] Stopping client connection.
  8. 18:51:59.861 [DEBUG] [TestEventLogger] at org.junit.Assert.assertTrue(Assert.java:43)
  9. 18:51:59.853 [DEBUG] [org.gradle.messaging.remote.internal.WorkerProtocol] Dispatching request to worker: [Request consumer: 053da2b2-c592-431e-ae83-d592e417e7e6, payload: [MethodInvocation method: comple
  10. ed()]]
  11. 18:51:59.882 [DEBUG] [TestEventLogger] at com.<xxxxx>.api.dicom.DicomTestCase.startTestDicomServer(DicomTestCase.java:77)
  12. 18:51:59.869 [QUIET] [system.out]
  13. 18:51:59.900 [DEBUG] [TestEventLogger] at com.<xxxxx>.api.dicom.DicomTestCase.startDicomServerAndLoadStudies(DicomTestCase.java:81)
  14. 18:51:59.908 [QUIET] [system.out] 18:51:59.749 [DEBUG] [org.gradle.messaging.remote.internal.ReceiveProtocol] Waiting for producers to finish. Stopping later. Producers: [1a0892f7-b868-48f3-a336-022a9f344
  15. e9]
  16. 18:51:59.917 [DEBUG] [TestEventLogger] at com.<xxxxx>.api.dicom.DicomTestCase.startDicomServerAndLoadStudies(DicomTestCase.java:92)
  17. 18:51:59.926 [QUIET] [system.out] 18:51:59.750 [DEBUG] [org.gradle.messaging.remote.internal.SendProtocol] Waiting for consumers to stop: [053da2b2-c592-431e-ae83-d592e417e7e6]
  18. 18:51:59.934 [DEBUG] [TestEventLogger] at com.<xxxxx>.app.dicomview.TestImagePrinter.setUp(TestImagePrinter.java:55)
  19. 18:51:59.943 [QUIET] [system.out] 18:51:59.803 [DEBUG] [org.gradle.messaging.remote.internal.SendProtocol] Consumer stopped: [ConsumerStopped, consumerId: 053da2b2-c592-431e-ae83-d592e417e7e6, producerId:
  20. 5066da04-523c-40a9-956e-a227846319fe]
  21. 18:51:59.950 [DEBUG] [TestEventLogger] at sun.reflect.NativeMethodAccessorImpl.invoke0(Native Method)
  22. 18:51:59.961 [DEBUG] [org.gradle.messaging.remote.internal.Router] Received route unavailable. Message: [ProducerUnavailable id: 5066da04-523c-40a9-956e-a227846319fe]
  23. 18:51:59.979 [DEBUG] [org.gradle.messaging.remote.internal.Router] Received route unavailable. Message: [ConsumerUnavailable id: 3989f4d0-b9a8-4f91-bab1-236b8fa3aca7]
  24. 18:51:59.959 [QUIET] [system.out]
  25. 18:51:59.979 [DEBUG] [org.gradle.messaging.remote.internal.SendProtocol] Consumer stopped: [ConsumerStopped, consumerId: 3989f4d0-b9a8-4f91-bab1-236b8fa3aca7, producerId: 1a0892f7-b868-48f3-a336-022a9f344
  26. e9]
  27. 18:51:59.970 [DEBUG] [TestEventLogger] at sun.reflect.NativeMethodAccessorImpl.invoke(NativeMethodAccessorImpl.java:39)
  28. 18:52:00.005 [DEBUG] [org.gradle.messaging.remote.internal.SendProtocol] Consumer unavailable: [ConsumerUnavailable id: 3989f4d0-b9a8-4f91-bab1-236b8fa3aca7]
  29. 18:51:59.996 [QUIET] [system.out] 18:51:59.869 [DEBUG] [org.gradle.messaging.remote.internal.SendProtocol] All consumers stopped. Stopping now.
  30. 18:51:59.979 [DEBUG] [org.gradle.messaging.remote.internal.ReceiveProtocol] Producer unavailable: [ProducerUnavailable id: 5066da04-523c-40a9-956e-a227846319fe]
  31. 18:52:00.015 [DEBUG] [TestEventLogger] at sun.reflect.DelegatingMethodAccessorImpl.invoke(DelegatingMethodAccessorImpl.java:25)
  32. 18:52:00.032 [QUIET] [system.out] 18:51:59.815 [DEBUG] [org.gradle.messaging.remote.internal.ReceiveProtocol] Producer stopped: [ProducerStopped producerId: 1a0892f7-b868-48f3-a336-022a9f344ee9, consumerI
  33. : 3989f4d0-b9a8-4f91-bab1-236b8fa3aca7
  34. 18:52:00.059 [QUIET] [system.out] 18:51:59.871 [DEBUG] [org.gradle.messaging.remote.internal.ReceiveProtocol] All producers finished. Stopping now.
  35. 18:52:00.051 [DEBUG] [TestEventLogger] at java.lang.reflect.Method.invoke(Method.java:597)
  36. 18:52:00.068 [QUIET] [system.out] 18:51:59.871 [DEBUG] [org.gradle.messaging.remote.internal.Router] Received route unavailable. Message: [ProducerUnavailable id: 5066da04-523c-40a9-956e-a227846319fe]
  37. 18:52:00.086 [QUIET] [system.out] 18:51:59.871 [DEBUG] [org.gradle.messaging.remote.internal.WorkerProtocol] Received worker stopped: [EndOfStreamEvent]
  38. 18:52:00.076 [DEBUG] [TestEventLogger] at org.junit.runners.model.FrameworkMethod$1.runReflectiveCall(FrameworkMethod.java:44)
  39. 18:52:00.106 [DEBUG] [TestEventLogger] at org.junit.internal.runners.model.ReflectiveCallable.run(ReflectiveCallable.java:15)
  40. 18:52:00.097 [QUIET] [system.out] 18:51:59.959 [DEBUG] [org.gradle.messaging.remote.internal.Router] Received route unavailable. Message: [ConsumerUnavailable id: 3989f4d0-b9a8-4f91-bab1-236b8fa3aca7]
  41. 18:52:00.114 [DEBUG] [TestEventLogger] at org.junit.runners.model.FrameworkMethod.invokeExplosively(FrameworkMethod.java:41)
  42. 18:52:00.125 [QUIET] [system.out] 18:51:59.963 [DEBUG] [org.gradle.messaging.remote.internal.Router] Removing route 053da2b2-c592-431e-ae83-d592e417e7e6 due to end of stream.
  43. 18:52:00.135 [DEBUG] [TestEventLogger] at org.junit.internal.runners.statements.RunBefores.evaluate(RunBefores.java:27)
  44. 18:52:00.145 [QUIET] [system.out] 18:51:59.963 [DEBUG] [org.gradle.messaging.remote.internal.Router] Removing route 1a0892f7-b868-48f3-a336-022a9f344ee9 due to end of stream.
  45. 18:52:00.152 [DEBUG] [TestEventLogger] at org.junit.internal.runners.statements.RunAfters.evaluate(RunAfters.java:31)
  46. 18:52:00.162 [QUIET] [system.out]
  47. 18:52:00.172 [DEBUG] [TestEventLogger] at org.junit.rules.TestWatchman$1.evaluate(TestWatchman.java:48)
  48. 18:52:00.190 [DEBUG] [TestEventLogger] at org.junit.runners.BlockJUnit4ClassRunner.runNotIgnored(BlockJUnit4ClassRunner.java:79)
  49. 18:52:00.198 [DEBUG] [TestEventLogger] at org.junit.runners.BlockJUnit4ClassRunner.runChild(BlockJUnit4ClassRunner.java:71)
  50. 18:52:00.209 [DEBUG] [TestEventLogger] at org.junit.runners.BlockJUnit4ClassRunner.runChild(BlockJUnit4ClassRunner.java:49)
  51. 18:52:00.217 [DEBUG] [TestEventLogger] at org.junit.runners.ParentRunner$3.run(ParentRunner.java:193)
  52. 18:52:00.226 [DEBUG] [TestEventLogger] at org.junit.runners.ParentRunner$1.schedule(ParentRunner.java:52)
  53. 18:52:00.235 [DEBUG] [TestEventLogger] at org.junit.runners.ParentRunner.runChildren(ParentRunner.java:191)
  54. 18:52:00.243 [DEBUG] [TestEventLogger] at org.junit.runners.ParentRunner.access$000(ParentRunner.java:42)
  55. 18:52:00.252 [DEBUG] [TestEventLogger] at org.junit.runners.ParentRunner$2.evaluate(ParentRunner.java:184)
  56. 18:52:00.262 [DEBUG] [TestEventLogger] at org.junit.internal.runners.statements.RunBefores.evaluate(RunBefores.java:28)
  57. 18:52:00.274 [DEBUG] [TestEventLogger] at org.junit.runners.ParentRunner.run(ParentRunner.java:236)
  58. 18:52:00.285 [DEBUG] [TestEventLogger] at org.gradle.api.internal.tasks.testing.junit.JUnitTestClassExecuter.runTestClass(JUnitTestClassExecuter.java:55)
  59. 18:52:00.294 [DEBUG] [TestEventLogger] at org.gradle.api.internal.tasks.testing.junit.JUnitTestClassExecuter.execute(JUnitTestClassExecuter.java:42)
  60. 18:52:00.305 [DEBUG] [TestEventLogger] at org.gradle.api.internal.tasks.testing.junit.JUnitTestClassProcessor.processTestClass(JUnitTestClassProcessor.java:75)
  61. 18:52:00.316 [DEBUG] [TestEventLogger] at org.gradle.api.internal.tasks.testing.SuiteTestClassProcessor.processTestClass(SuiteTestClassProcessor.java:49)
  62. 18:52:00.325 [DEBUG] [TestEventLogger] at sun.reflect.NativeMethodAccessorImpl.invoke0(Native Method)
  63. 18:52:00.334 [DEBUG] [TestEventLogger] at sun.reflect.NativeMethodAccessorImpl.invoke(NativeMethodAccessorImpl.java:39)
  64. 18:52:00.342 [DEBUG] [TestEventLogger] at sun.reflect.DelegatingMethodAccessorImpl.invoke(DelegatingMethodAccessorImpl.java:25)
  65. 18:52:00.351 [DEBUG] [TestEventLogger] at java.lang.reflect.Method.invoke(Method.java:597)
  66. 18:52:00.359 [DEBUG] [TestEventLogger] at org.gradle.messaging.dispatch.ReflectionDispatch.dispatch(ReflectionDispatch.java:35)
  67. 18:52:00.368 [DEBUG] [TestEventLogger] at org.gradle.messaging.dispatch.ReflectionDispatch.dispatch(ReflectionDispatch.java:24)
  68. 18:52:00.376 [DEBUG] [TestEventLogger] at org.gradle.messaging.dispatch.ContextClassLoaderDispatch.dispatch(ContextClassLoaderDispatch.java:32)
  69. 18:52:00.388 [DEBUG] [TestEventLogger] at org.gradle.messaging.dispatch.ProxyDispatchAdapter$DispatchingInvocationHandler.invoke(ProxyDispatchAdapter.java:93)
  70. 18:52:00.399 [DEBUG] [TestEventLogger] at $Proxy2.processTestClass(Unknown Source)
  71. 18:52:00.409 [DEBUG] [TestEventLogger] at org.gradle.api.internal.tasks.testing.worker.TestWorker.processTestClass(TestWorker.java:103)
  72. 18:52:00.420 [DEBUG] [TestEventLogger] at sun.reflect.NativeMethodAccessorImpl.invoke0(Native Method)
  73. 18:52:00.424 [ERROR] [system.err] Picked up JAVA_TOOL_OPTIONS: -Dfile.encoding=UTF-8
  74.  
  75. 18:52:00.473 [DEBUG] [org.gradle.process.internal.DefaultExecHandle] Changing state to: SUCCEEDED
  76. 18:52:00.466 [DEBUG] [TestEventLogger] at sun.reflect.NativeMethodAccessorImpl.invoke(NativeMethodAccessorImpl.java:39)
  77. 18:52:00.481 [INFO] [org.gradle.process.internal.DefaultExecHandle] Process 'Gradle Worker 5' finished with exit value 0 (state: SUCCEEDED)
  78. 18:52:00.488 [DEBUG] [TestEventLogger] at sun.reflect.DelegatingMethodAccessorImpl.invoke(DelegatingMethodAccessorImpl.java:25)
  79. 18:52:00.496 [DEBUG] [org.gradle.messaging.remote.internal.SendProtocol] All consumers stopped. Stopping now.
  80. 18:52:00.518 [DEBUG] [TestEventLogger] at java.lang.reflect.Method.invoke(Method.java:597)
  81. 18:52:00.496 [DEBUG] [org.gradle.messaging.remote.internal.ReceiveProtocol] No producers. Stopping now.
  82. 18:52:00.530 [DEBUG] [org.gradle.messaging.remote.internal.Router] Received route unavailable. Message: [ProducerUnavailable id: 1a0892f7-b868-48f3-a336-022a9f344ee9]
  83. 18:52:00.540 [DEBUG] [TestEventLogger] at org.gradle.messaging.dispatch.ReflectionDispatch.dispatch(ReflectionDispatch.java:35)
  84. 18:52:00.560 [DEBUG] [org.gradle.messaging.remote.internal.Router] Received route unavailable. Message: [ConsumerUnavailable id: 053da2b2-c592-431e-ae83-d592e417e7e6]
  85. 18:52:00.569 [DEBUG] [TestEventLogger] at org.gradle.messaging.dispatch.ReflectionDispatch.dispatch(ReflectionDispatch.java:24)
  86. 18:52:00.589 [DEBUG] [TestEventLogger] at org.gradle.messaging.remote.internal.TypeCastDispatch.dispatch(TypeCastDispatch.java:30)
  87. 18:52:00.548 [DEBUG] [org.gradle.messaging.remote.internal.WorkerProtocol] Received worker stopped: [EndOfStreamEvent]
  88. 18:52:00.600 [DEBUG] [TestEventLogger] at org.gradle.messaging.remote.internal.WorkerProtocol.handleIncoming(WorkerProtocol.java:53)
  89. 18:52:00.620 [DEBUG] [TestEventLogger] at org.gradle.messaging.remote.internal.WorkerProtocol.handleIncoming(WorkerProtocol.java:31)
  90. 18:52:00.629 [DEBUG] [TestEventLogger] at org.gradle.messaging.remote.internal.ProtocolStack$ProtocolStage.handleIncoming(ProtocolStack.java:167)
  91. 18:52:00.638 [DEBUG] [TestEventLogger] at org.gradle.messaging.remote.internal.ProtocolStack$BottomStage.handleIncoming(ProtocolStack.java:277)
  92. 18:52:00.648 [DEBUG] [TestEventLogger] at org.gradle.messaging.remote.internal.ProtocolStack$BottomConnection$1.run(ProtocolStack.java:299)
  93. 18:52:00.656 [DEBUG] [TestEventLogger] at org.gradle.messaging.remote.internal.ProtocolStack$ExecuteRunnable.dispatch(ProtocolStack.java:120)
  94. 18:52:00.665 [DEBUG] [TestEventLogger] at org.gradle.messaging.remote.internal.ProtocolStack$ExecuteRunnable.dispatch(ProtocolStack.java:116)
  95. 18:52:00.674 [DEBUG] [TestEventLogger] at org.gradle.messaging.dispatch.AsyncDispatch.dispatchMessages(AsyncDispatch.java:132)
  96. 18:52:00.683 [DEBUG] [TestEventLogger] at org.gradle.messaging.dispatch.AsyncDispatch.access$000(AsyncDispatch.java:33)
  97. 18:52:00.693 [DEBUG] [TestEventLogger] at org.gradle.messaging.dispatch.AsyncDispatch$1.run(AsyncDispatch.java:72)
  98. 18:52:00.702 [DEBUG] [TestEventLogger] at org.gradle.internal.concurrent.DefaultExecutorFactory$StoppableExecutorImpl$1.run(DefaultExecutorFactory.java:66)
  99. 18:52:00.711 [DEBUG] [TestEventLogger] at java.util.concurrent.ThreadPoolExecutor$Worker.runTask(ThreadPoolExecutor.java:886)
  100. 18:52:00.720 [DEBUG] [TestEventLogger] at java.util.concurrent.ThreadPoolExecutor$Worker.run(ThreadPoolExecutor.java:908)
  101. 18:52:00.729 [DEBUG] [TestEventLogger] at java.lang.Thread.run(Thread.java:662)
  102. 18:52:00.739 [DEBUG] [TestEventLogger]
  103. 18:52:00.748 [DEBUG] [TestEventLogger] com.<xxxxx>.app.dicomview.TestImagePrinter FAILED
  104. 18:52:00.763 [DEBUG] [TestEventLogger]
  105. 18:52:00.772 [DEBUG] [TestEventLogger] Gradle Worker 5 FAILED
  106. > Building > :<xxxxx>:test > 30 tests completed, 16 failed
RAW Paste Data