Guest User

Untitled

a guest
Jul 18th, 2016
85
Never
Not a member of Pastebin yet? Sign Up, it unlocks many cool features!
  1. mvn exec:java -Dexec.mainClass="ar.uba.fi.fallas.App" Mon Jul 18 11:33:04 2016
  2. [INFO] Scanning for projects...
  3. [INFO]
  4. [INFO] ------------------------------------------------------------------------
  5. [INFO] Building fallas 1.0-SNAPSHOT
  6. [INFO] ------------------------------------------------------------------------
  7. [INFO]
  8. [INFO] --- exec-maven-plugin:1.5.0:java (default-cli) @ fallas ---
  9. Jul 18, 2016 11:33:09 AM org.jboss.weld.bootstrap.WeldStartup <clinit>
  10. INFO: WELD-000900: 2.3.0 (Final)
  11. [WARNING]
  12. java.lang.reflect.InvocationTargetException
  13. at sun.reflect.NativeMethodAccessorImpl.invoke0(Native Method)
  14. at sun.reflect.NativeMethodAccessorImpl.invoke(NativeMethodAccessorImpl.java:62)
  15. at sun.reflect.DelegatingMethodAccessorImpl.invoke(DelegatingMethodAccessorImpl.java:43)
  16. at java.lang.reflect.Method.invoke(Method.java:498)
  17. at org.codehaus.mojo.exec.ExecJavaMojo$1.run(ExecJavaMojo.java:294)
  18. at java.lang.Thread.run(Thread.java:745)
  19. Caused by: java.lang.NoClassDefFoundError: com/google/common/base/Function
  20. at org.jboss.weld.bootstrap.WeldBootstrap.<init>(WeldBootstrap.java:54)
  21. at org.jboss.weld.environment.se.Weld.initialize(Weld.java:524)
  22. at ar.uba.fi.fallas.App.main(App.java:31)
  23. ... 6 more
  24. Caused by: java.lang.ClassNotFoundException: com.google.common.base.Function
  25. at java.net.URLClassLoader.findClass(URLClassLoader.java:381)
  26. at java.lang.ClassLoader.loadClass(ClassLoader.java:424)
  27. at java.lang.ClassLoader.loadClass(ClassLoader.java:357)
  28. ... 9 more
  29. [INFO] ------------------------------------------------------------------------
  30. [INFO] BUILD FAILURE
  31. [INFO] ------------------------------------------------------------------------
  32. [INFO] Total time: 1.619 s
  33. [INFO] Finished at: 2016-07-18T11:33:09-03:00
  34. [INFO] Final Memory: 15M/309M
  35. [INFO] ------------------------------------------------------------------------
  36. [ERROR] Failed to execute goal org.codehaus.mojo:exec-maven-plugin:1.5.0:java (default-cli) on project fallas: An exception occured while executing the Java class. null: InvocationTargetException: com/google/common/base/Function: com.google.common.base.Function -> [Help 1]
  37. [ERROR]
  38. [ERROR] To see the full stack trace of the errors, re-run Maven with the -e switch.
  39. [ERROR] Re-run Maven using the -X switch to enable full debug logging.
  40. [ERROR]
  41. [ERROR] For more information about the errors and possible solutions, please read the following articles:
  42. [ERROR] [Help 1] http://cwiki.apache.org/confluence/display/MAVEN/MojoExecutionException
  43. !  ~/W/f/fallas   master *…  mvn exec:java -Dexec.mainClass="ar.uba.fi.fallas.App" -X Mon Jul 18 11:33:09 2016
  44. Apache Maven 3.3.9 (bb52d8502b132ec0a5a3f4c09453c07478323dc5; 2015-11-10T13:41:47-03:00)
  45. Maven home: /usr/local/Cellar/maven/3.3.9/libexec
  46. Java version: 1.8.0_77, vendor: Oracle Corporation
  47. Java home: /Library/Java/JavaVirtualMachines/jdk1.8.0_77.jdk/Contents/Home/jre
  48. Default locale: en_US, platform encoding: UTF-8
  49. OS name: "mac os x", version: "10.11.5", arch: "x86_64", family: "mac"
  50. [DEBUG] Created new class realm maven.api
  51. [DEBUG] Importing foreign packages into class realm maven.api
  52. [DEBUG] Imported: javax.enterprise.inject.* < plexus.core
  53. [DEBUG] Imported: javax.enterprise.util.* < plexus.core
  54. [DEBUG] Imported: javax.inject.* < plexus.core
  55. [DEBUG] Imported: org.apache.maven.* < plexus.core
  56. [DEBUG] Imported: org.apache.maven.artifact < plexus.core
  57. [DEBUG] Imported: org.apache.maven.classrealm < plexus.core
  58. [DEBUG] Imported: org.apache.maven.cli < plexus.core
  59. [DEBUG] Imported: org.apache.maven.configuration < plexus.core
  60. [DEBUG] Imported: org.apache.maven.exception < plexus.core
  61. [DEBUG] Imported: org.apache.maven.execution < plexus.core
  62. [DEBUG] Imported: org.apache.maven.execution.scope < plexus.core
  63. [DEBUG] Imported: org.apache.maven.lifecycle < plexus.core
  64. [DEBUG] Imported: org.apache.maven.model < plexus.core
  65. [DEBUG] Imported: org.apache.maven.monitor < plexus.core
  66. [DEBUG] Imported: org.apache.maven.plugin < plexus.core
  67. [DEBUG] Imported: org.apache.maven.profiles < plexus.core
  68. [DEBUG] Imported: org.apache.maven.project < plexus.core
  69. [DEBUG] Imported: org.apache.maven.reporting < plexus.core
  70. [DEBUG] Imported: org.apache.maven.repository < plexus.core
  71. [DEBUG] Imported: org.apache.maven.rtinfo < plexus.core
  72. [DEBUG] Imported: org.apache.maven.settings < plexus.core
  73. [DEBUG] Imported: org.apache.maven.toolchain < plexus.core
  74. [DEBUG] Imported: org.apache.maven.usability < plexus.core
  75. [DEBUG] Imported: org.apache.maven.wagon.* < plexus.core
  76. [DEBUG] Imported: org.apache.maven.wagon.authentication < plexus.core
  77. [DEBUG] Imported: org.apache.maven.wagon.authorization < plexus.core
  78. [DEBUG] Imported: org.apache.maven.wagon.events < plexus.core
  79. [DEBUG] Imported: org.apache.maven.wagon.observers < plexus.core
  80. [DEBUG] Imported: org.apache.maven.wagon.proxy < plexus.core
  81. [DEBUG] Imported: org.apache.maven.wagon.repository < plexus.core
  82. [DEBUG] Imported: org.apache.maven.wagon.resource < plexus.core
  83. [DEBUG] Imported: org.codehaus.classworlds < plexus.core
  84. [DEBUG] Imported: org.codehaus.plexus.* < plexus.core
  85. [DEBUG] Imported: org.codehaus.plexus.classworlds < plexus.core
  86. [DEBUG] Imported: org.codehaus.plexus.component < plexus.core
  87. [DEBUG] Imported: org.codehaus.plexus.configuration < plexus.core
  88. [DEBUG] Imported: org.codehaus.plexus.container < plexus.core
  89. [DEBUG] Imported: org.codehaus.plexus.context < plexus.core
  90. [DEBUG] Imported: org.codehaus.plexus.lifecycle < plexus.core
  91. [DEBUG] Imported: org.codehaus.plexus.logging < plexus.core
  92. [DEBUG] Imported: org.codehaus.plexus.personality < plexus.core
  93. [DEBUG] Imported: org.codehaus.plexus.util.xml.Xpp3Dom < plexus.core
  94. [DEBUG] Imported: org.codehaus.plexus.util.xml.pull.XmlPullParser < plexus.core
  95. [DEBUG] Imported: org.codehaus.plexus.util.xml.pull.XmlPullParserException < plexus.core
  96. [DEBUG] Imported: org.codehaus.plexus.util.xml.pull.XmlSerializer < plexus.core
  97. [DEBUG] Imported: org.eclipse.aether.* < plexus.core
  98. [DEBUG] Imported: org.eclipse.aether.artifact < plexus.core
  99. [DEBUG] Imported: org.eclipse.aether.collection < plexus.core
  100. [DEBUG] Imported: org.eclipse.aether.deployment < plexus.core
  101. [DEBUG] Imported: org.eclipse.aether.graph < plexus.core
  102. [DEBUG] Imported: org.eclipse.aether.impl < plexus.core
  103. [DEBUG] Imported: org.eclipse.aether.installation < plexus.core
  104. [DEBUG] Imported: org.eclipse.aether.internal.impl < plexus.core
  105. [DEBUG] Imported: org.eclipse.aether.metadata < plexus.core
  106. [DEBUG] Imported: org.eclipse.aether.repository < plexus.core
  107. [DEBUG] Imported: org.eclipse.aether.resolution < plexus.core
  108. [DEBUG] Imported: org.eclipse.aether.spi < plexus.core
  109. [DEBUG] Imported: org.eclipse.aether.transfer < plexus.core
  110. [DEBUG] Imported: org.eclipse.aether.version < plexus.core
  111. [DEBUG] Imported: org.slf4j.* < plexus.core
  112. [DEBUG] Imported: org.slf4j.helpers.* < plexus.core
  113. [DEBUG] Imported: org.slf4j.spi.* < plexus.core
  114. [DEBUG] Populating class realm maven.api
  115. [INFO] Error stacktraces are turned on.
  116. [DEBUG] Reading global settings from /usr/local/Cellar/maven/3.3.9/libexec/conf/settings.xml
  117. [DEBUG] Reading user settings from /Users/ariel/.m2/settings.xml
  118. [DEBUG] Reading global toolchains from /usr/local/Cellar/maven/3.3.9/libexec/conf/toolchains.xml
  119. [DEBUG] Reading user toolchains from /Users/ariel/.m2/toolchains.xml
  120. [DEBUG] Using local repository at /Users/ariel/.m2/repository
  121. [DEBUG] Using manager EnhancedLocalRepositoryManager with priority 10.0 for /Users/ariel/.m2/repository
  122. [INFO] Scanning for projects...
  123. [DEBUG] Extension realms for project ar.uba.fi.fallas:fallas:jar:1.0-SNAPSHOT: (none)
  124. [DEBUG] Looking up lifecyle mappings for packaging jar from ClassRealm[plexus.core, parent: null]
  125. [DEBUG] Resolving plugin prefix exec from [org.apache.maven.plugins, org.codehaus.mojo]
  126. [DEBUG] Could not find metadata org.apache.maven.plugins/maven-metadata.xml in local (/Users/ariel/.m2/repository)
  127. [DEBUG] Skipped remote request for org.apache.maven.plugins/maven-metadata.xml, locally cached metadata up-to-date.
  128. [DEBUG] Could not find metadata org.codehaus.mojo/maven-metadata.xml in local (/Users/ariel/.m2/repository)
  129. [DEBUG] Skipped remote request for org.codehaus.mojo/maven-metadata.xml, locally cached metadata up-to-date.
  130. [DEBUG] Resolved plugin prefix exec to org.codehaus.mojo:exec-maven-plugin from repository central
  131. [DEBUG] Resolving plugin version for org.codehaus.mojo:exec-maven-plugin
  132. [DEBUG] Could not find metadata org.codehaus.mojo:exec-maven-plugin/maven-metadata.xml in local (/Users/ariel/.m2/repository)
  133. [DEBUG] Skipped remote request for org.codehaus.mojo:exec-maven-plugin/maven-metadata.xml, locally cached metadata up-to-date.
  134. [DEBUG] Resolved plugin version for org.codehaus.mojo:exec-maven-plugin to 1.5.0 from repository central (https://repo.maven.apache.org/maven2, default, releases)
  135. [DEBUG] === REACTOR BUILD PLAN ================================================
  136. [DEBUG] Project: ar.uba.fi.fallas:fallas:jar:1.0-SNAPSHOT
  137. [DEBUG] Tasks: [exec:java]
  138. [DEBUG] Style: Regular
  139. [DEBUG] =======================================================================
  140. [INFO]
  141. [INFO] ------------------------------------------------------------------------
  142. [INFO] Building fallas 1.0-SNAPSHOT
  143. [INFO] ------------------------------------------------------------------------
  144. [DEBUG] Resolving plugin prefix exec from [org.apache.maven.plugins, org.codehaus.mojo]
  145. [DEBUG] Could not find metadata org.apache.maven.plugins/maven-metadata.xml in local (/Users/ariel/.m2/repository)
  146. [DEBUG] Skipped remote request for org.apache.maven.plugins/maven-metadata.xml, locally cached metadata up-to-date.
  147. [DEBUG] Could not find metadata org.codehaus.mojo/maven-metadata.xml in local (/Users/ariel/.m2/repository)
  148. [DEBUG] Skipped remote request for org.codehaus.mojo/maven-metadata.xml, locally cached metadata up-to-date.
  149. [DEBUG] Resolved plugin prefix exec to org.codehaus.mojo:exec-maven-plugin from repository central
  150. [DEBUG] Resolving plugin version for org.codehaus.mojo:exec-maven-plugin
  151. [DEBUG] Could not find metadata org.codehaus.mojo:exec-maven-plugin/maven-metadata.xml in local (/Users/ariel/.m2/repository)
  152. [DEBUG] Skipped remote request for org.codehaus.mojo:exec-maven-plugin/maven-metadata.xml, locally cached metadata up-to-date.
  153. [DEBUG] Resolved plugin version for org.codehaus.mojo:exec-maven-plugin to 1.5.0 from repository central (https://repo.maven.apache.org/maven2, default, releases)
  154. [DEBUG] Lifecycle default -> [validate, initialize, generate-sources, process-sources, generate-resources, process-resources, compile, process-classes, generate-test-sources, process-test-sources, generate-test-resources, process-test-resources, test-compile, process-test-classes, test, prepare-package, package, pre-integration-test, integration-test, post-integration-test, verify, install, deploy]
  155. [DEBUG] Lifecycle clean -> [pre-clean, clean, post-clean]
  156. [DEBUG] Lifecycle site -> [pre-site, site, post-site, site-deploy]
  157. [DEBUG] === PROJECT BUILD PLAN ================================================
  158. [DEBUG] Project: ar.uba.fi.fallas:fallas:1.0-SNAPSHOT
  159. [DEBUG] Dependencies (collect): []
  160. [DEBUG] Dependencies (resolve): [test]
  161. [DEBUG] Repositories (dependencies): [central (https://repo.maven.apache.org/maven2, default, releases)]
  162. [DEBUG] Repositories (plugins) : [central (https://repo.maven.apache.org/maven2, default, releases)]
  163. [DEBUG] -----------------------------------------------------------------------
  164. [DEBUG] Goal: org.codehaus.mojo:exec-maven-plugin:1.5.0:java (default-cli)
  165. [DEBUG] Style: Regular
  166. [DEBUG] Configuration: <?xml version="1.0" encoding="UTF-8"?>
  167. <configuration>
  168. <arguments>${exec.arguments}</arguments>
  169. <classpathScope default-value="runtime">${exec.classpathScope}</classpathScope>
  170. <cleanupDaemonThreads default-value="true">${exec.cleanupDaemonThreads}</cleanupDaemonThreads>
  171. <commandlineArgs>${exec.args}</commandlineArgs>
  172. <daemonThreadJoinTimeout default-value="15000">${exec.daemonThreadJoinTimeout}</daemonThreadJoinTimeout>
  173. <includePluginDependencies default-value="false">${exec.includePluginsDependencies}</includePluginDependencies>
  174. <includeProjectDependencies default-value="true">${exec.includeProjectDependencies}</includeProjectDependencies>
  175. <keepAlive default-value="false">${exec.keepAlive}</keepAlive>
  176. <killAfter default-value="-1">${exec.killAfter}</killAfter>
  177. <localRepository default-value="${localRepository}"/>
  178. <mainClass>${exec.mainClass}</mainClass>
  179. <pluginDependencies default-value="${plugin.artifacts}"/>
  180. <project default-value="${project}"/>
  181. <remoteRepositories default-value="${project.remoteArtifactRepositories}"/>
  182. <skip default-value="false">${exec.skip}</skip>
  183. <sourceRoot>${sourceRoot}</sourceRoot>
  184. <stopUnresponsiveDaemonThreads default-value="false">${exec.stopUnresponsiveDaemonThreads}</stopUnresponsiveDaemonThreads>
  185. <testSourceRoot>${testSourceRoot}</testSourceRoot>
  186. </configuration>
  187. [DEBUG] =======================================================================
  188. [DEBUG] Dependency collection stats: {ConflictMarker.analyzeTime=1, ConflictMarker.markTime=1, ConflictMarker.nodeCount=51, ConflictIdSorter.graphTime=1, ConflictIdSorter.topsortTime=1, ConflictIdSorter.conflictIdCount=30, ConflictIdSorter.conflictIdCycleCount=0, ConflictResolver.totalTime=9, ConflictResolver.conflictItemCount=49, DefaultDependencyCollector.collectTime=472, DefaultDependencyCollector.transformTime=14}
  189. [DEBUG] ar.uba.fi.fallas:fallas:jar:1.0-SNAPSHOT
  190. [DEBUG] org.kie:kie-api:jar:6.4.0.Final:compile
  191. [DEBUG] org.slf4j:slf4j-api:jar:1.7.2:compile
  192. [DEBUG] org.drools:drools-compiler:jar:6.4.0.Final:compile
  193. [DEBUG] org.kie:kie-internal:jar:6.4.0.Final:compile
  194. [DEBUG] org.antlr:antlr-runtime:jar:3.5:compile
  195. [DEBUG] org.eclipse.jdt.core.compiler:ecj:jar:4.4.2:compile
  196. [DEBUG] org.mvel:mvel2:jar:2.2.8.Final:compile
  197. [DEBUG] com.thoughtworks.xstream:xstream:jar:1.4.7:compile
  198. [DEBUG] xmlpull:xmlpull:jar:1.1.3.1:compile
  199. [DEBUG] xpp3:xpp3_min:jar:1.1.4c:compile
  200. [DEBUG] com.google.protobuf:protobuf-java:jar:2.6.0:compile
  201. [DEBUG] org.drools:drools-core:jar:6.4.0.Final:compile
  202. [DEBUG] commons-codec:commons-codec:jar:1.4:compile
  203. [DEBUG] javax.enterprise:cdi-api:jar:1.2:compile
  204. [DEBUG] javax.el:javax.el-api:jar:3.0.0:compile
  205. [DEBUG] javax.interceptor:javax.interceptor-api:jar:1.2:compile
  206. [DEBUG] javax.inject:javax.inject:jar:1:compile
  207. [DEBUG] org.jboss.weld.se:weld-se-core:jar:2.3.0.Final:compile
  208. [DEBUG] org.jboss.weld.environment:weld-environment-common:jar:2.3.0.Final:compile
  209. [DEBUG] org.jboss.weld:weld-core-impl:jar:2.3.0.Final:compile
  210. [DEBUG] org.jboss.weld:weld-api:jar:2.3.Final:compile
  211. [DEBUG] org.jboss.weld:weld-spi:jar:2.3.Final:compile
  212. [DEBUG] org.jboss.classfilewriter:jboss-classfilewriter:jar:1.1.2.Final:compile
  213. [DEBUG] com.google.guava:guava:jar:18.0:compile
  214. [DEBUG] org.jboss.spec.javax.el:jboss-el-api_3.0_spec:jar:1.0.0.Alpha1:compile
  215. [DEBUG] org.jboss.spec.javax.interceptor:jboss-interceptors-api_1.2_spec:jar:1.0.0.Final:compile
  216. [DEBUG] org.jboss.logging:jboss-logging:jar:3.2.1.Final:compile
  217. [DEBUG] org.jboss.weld.probe:weld-probe-core:jar:2.3.0.Final:compile
  218. [DEBUG] org.jboss.spec.javax.annotation:jboss-annotations-api_1.2_spec:jar:1.0.0.Final:compile
  219. [DEBUG] junit:junit:jar:3.8.1:test
  220. [INFO]
  221. [INFO] --- exec-maven-plugin:1.5.0:java (default-cli) @ fallas ---
  222. [DEBUG] Dependency collection stats: {ConflictMarker.analyzeTime=1, ConflictMarker.markTime=0, ConflictMarker.nodeCount=136, ConflictIdSorter.graphTime=0, ConflictIdSorter.topsortTime=0, ConflictIdSorter.conflictIdCount=35, ConflictIdSorter.conflictIdCycleCount=0, ConflictResolver.totalTime=2, ConflictResolver.conflictItemCount=78, DefaultDependencyCollector.collectTime=264, DefaultDependencyCollector.transformTime=3}
  223. [DEBUG] org.codehaus.mojo:exec-maven-plugin:jar:1.5.0:
  224. [DEBUG] org.apache.maven:maven-toolchain:jar:1.0:compile
  225. [DEBUG] org.apache.maven:maven-project:jar:2.2.1:compile
  226. [DEBUG] org.apache.maven:maven-settings:jar:2.2.1:compile
  227. [DEBUG] org.apache.maven:maven-profile:jar:2.2.1:compile
  228. [DEBUG] org.apache.maven:maven-plugin-registry:jar:2.2.1:compile
  229. [DEBUG] org.codehaus.plexus:plexus-interpolation:jar:1.11:compile
  230. [DEBUG] org.codehaus.plexus:plexus-container-default:jar:1.0-alpha-9-stable-1:compile
  231. [DEBUG] junit:junit:jar:4.12:test
  232. [DEBUG] org.hamcrest:hamcrest-core:jar:1.3:test
  233. [DEBUG] org.apache.maven:maven-model:jar:2.2.1:compile
  234. [DEBUG] org.apache.maven:maven-artifact:jar:2.2.1:compile
  235. [DEBUG] org.apache.maven:maven-artifact-manager:jar:2.2.1:compile
  236. [DEBUG] org.apache.maven:maven-repository-metadata:jar:2.2.1:compile
  237. [DEBUG] backport-util-concurrent:backport-util-concurrent:jar:3.1:compile
  238. [DEBUG] org.apache.maven:maven-core:jar:2.2.1:compile
  239. [DEBUG] org.apache.maven:maven-plugin-parameter-documenter:jar:2.2.1:compile
  240. [DEBUG] org.slf4j:slf4j-jdk14:jar:1.5.6:runtime
  241. [DEBUG] org.slf4j:slf4j-api:jar:1.5.6:runtime
  242. [DEBUG] org.slf4j:jcl-over-slf4j:jar:1.5.6:runtime
  243. [DEBUG] org.apache.maven.reporting:maven-reporting-api:jar:2.2.1:compile
  244. [DEBUG] org.apache.maven.doxia:doxia-sink-api:jar:1.1:compile
  245. [DEBUG] org.apache.maven.doxia:doxia-logging-api:jar:1.1:compile
  246. [DEBUG] org.apache.maven:maven-error-diagnostics:jar:2.2.1:compile
  247. [DEBUG] commons-cli:commons-cli:jar:1.2:compile
  248. [DEBUG] org.apache.maven:maven-plugin-descriptor:jar:2.2.1:compile
  249. [DEBUG] org.codehaus.plexus:plexus-interactivity-api:jar:1.0-alpha-4:compile
  250. [DEBUG] org.apache.maven:maven-monitor:jar:2.2.1:compile
  251. [DEBUG] classworlds:classworlds:jar:1.1:compile
  252. [DEBUG] org.sonatype.plexus:plexus-sec-dispatcher:jar:1.3:compile
  253. [DEBUG] org.sonatype.plexus:plexus-cipher:jar:1.4:compile
  254. [DEBUG] org.apache.maven:maven-plugin-api:jar:2.2.1:compile
  255. [DEBUG] org.codehaus.plexus:plexus-utils:jar:3.0.20:compile
  256. [DEBUG] org.apache.commons:commons-exec:jar:1.3:compile
  257. [DEBUG] Created new class realm plugin>org.codehaus.mojo:exec-maven-plugin:1.5.0
  258. [DEBUG] Importing foreign packages into class realm plugin>org.codehaus.mojo:exec-maven-plugin:1.5.0
  259. [DEBUG] Imported: < maven.api
  260. [DEBUG] Populating class realm plugin>org.codehaus.mojo:exec-maven-plugin:1.5.0
  261. [DEBUG] Included: org.codehaus.mojo:exec-maven-plugin:jar:1.5.0
  262. [DEBUG] Included: org.codehaus.plexus:plexus-interpolation:jar:1.11
  263. [DEBUG] Included: backport-util-concurrent:backport-util-concurrent:jar:3.1
  264. [DEBUG] Included: org.slf4j:slf4j-jdk14:jar:1.5.6
  265. [DEBUG] Included: org.slf4j:jcl-over-slf4j:jar:1.5.6
  266. [DEBUG] Included: org.apache.maven.reporting:maven-reporting-api:jar:2.2.1
  267. [DEBUG] Included: org.apache.maven.doxia:doxia-sink-api:jar:1.1
  268. [DEBUG] Included: org.apache.maven.doxia:doxia-logging-api:jar:1.1
  269. [DEBUG] Included: commons-cli:commons-cli:jar:1.2
  270. [DEBUG] Included: org.codehaus.plexus:plexus-interactivity-api:jar:1.0-alpha-4
  271. [DEBUG] Included: org.sonatype.plexus:plexus-sec-dispatcher:jar:1.3
  272. [DEBUG] Included: org.sonatype.plexus:plexus-cipher:jar:1.4
  273. [DEBUG] Included: org.codehaus.plexus:plexus-utils:jar:3.0.20
  274. [DEBUG] Included: org.apache.commons:commons-exec:jar:1.3
  275. [DEBUG] Configuring mojo org.codehaus.mojo:exec-maven-plugin:1.5.0:java from plugin realm ClassRealm[plugin>org.codehaus.mojo:exec-maven-plugin:1.5.0, parent: sun.misc.Launcher$AppClassLoader@55f96302]
  276. [DEBUG] Configuring mojo 'org.codehaus.mojo:exec-maven-plugin:1.5.0:java' with basic configurator -->
  277. [DEBUG] (f) arguments = []
  278. [DEBUG] (f) classpathScope = runtime
  279. [DEBUG] (f) cleanupDaemonThreads = true
  280. [DEBUG] (f) daemonThreadJoinTimeout = 15000
  281. [DEBUG] (f) includePluginDependencies = false
  282. [DEBUG] (f) includeProjectDependencies = true
  283. [DEBUG] (f) keepAlive = false
  284. [DEBUG] (f) killAfter = -1
  285. [DEBUG] (f) localRepository = id: local
  286. url: file:///Users/ariel/.m2/repository/
  287. layout: default
  288. snapshots: [enabled => true, update => always]
  289. releases: [enabled => true, update => always]
  290.  
  291. [DEBUG] (f) mainClass = ar.uba.fi.fallas.App
  292. [DEBUG] (f) pluginDependencies = [org.codehaus.mojo:exec-maven-plugin:maven-plugin:1.5.0:, org.apache.maven:maven-toolchain:jar:1.0:compile, org.apache.maven:maven-project:jar:2.2.1:compile, org.apache.maven:maven-settings:jar:2.2.1:compile, org.apache.maven:maven-profile:jar:2.2.1:compile, org.apache.maven:maven-plugin-registry:jar:2.2.1:compile, org.codehaus.plexus:plexus-interpolation:jar:1.11:compile, org.codehaus.plexus:plexus-container-default:jar:1.0-alpha-9-stable-1:compile, org.apache.maven:maven-model:jar:2.2.1:compile, org.apache.maven:maven-artifact:jar:2.2.1:compile, org.apache.maven:maven-artifact-manager:jar:2.2.1:compile, org.apache.maven:maven-repository-metadata:jar:2.2.1:compile, backport-util-concurrent:backport-util-concurrent:jar:3.1:compile, org.apache.maven:maven-core:jar:2.2.1:compile, org.apache.maven:maven-plugin-parameter-documenter:jar:2.2.1:compile, org.slf4j:slf4j-jdk14:jar:1.5.6:runtime, org.slf4j:slf4j-api:jar:1.5.6:runtime, org.slf4j:jcl-over-slf4j:jar:1.5.6:runtime, org.apache.maven.reporting:maven-reporting-api:jar:2.2.1:compile, org.apache.maven.doxia:doxia-sink-api:jar:1.1:compile, org.apache.maven.doxia:doxia-logging-api:jar:1.1:compile, org.apache.maven:maven-error-diagnostics:jar:2.2.1:compile, commons-cli:commons-cli:jar:1.2:compile, org.apache.maven:maven-plugin-descriptor:jar:2.2.1:compile, org.codehaus.plexus:plexus-interactivity-api:jar:1.0-alpha-4:compile, org.apache.maven:maven-monitor:jar:2.2.1:compile, classworlds:classworlds:jar:1.1:compile, org.sonatype.plexus:plexus-sec-dispatcher:jar:1.3:compile, org.sonatype.plexus:plexus-cipher:jar:1.4:compile, org.apache.maven:maven-plugin-api:jar:2.2.1:compile, org.codehaus.plexus:plexus-utils:jar:3.0.20:compile, org.apache.commons:commons-exec:jar:1.3:compile]
  293. [DEBUG] (f) project = MavenProject: ar.uba.fi.fallas:fallas:1.0-SNAPSHOT @ /Users/ariel/Work/fallas/fallas/pom.xml
  294. [DEBUG] (f) remoteRepositories = [ id: central
  295. url: https://repo.maven.apache.org/maven2
  296. layout: default
  297. snapshots: [enabled => false, update => daily]
  298. releases: [enabled => true, update => daily]
  299. ]
  300. [DEBUG] (f) skip = false
  301. [DEBUG] (f) stopUnresponsiveDaemonThreads = false
  302. [DEBUG] -- end configuration --
  303. [DEBUG] Invoking : ar.uba.fi.fallas.App.main()
  304. [DEBUG] Plugin Dependencies will be excluded.
  305. [DEBUG] Project Dependencies will be included.
  306. [DEBUG] Collected project artifacts [org.kie:kie-api:jar:6.4.0.Final:compile, org.slf4j:slf4j-api:jar:1.7.2:compile, org.drools:drools-compiler:jar:6.4.0.Final:compile, org.kie:kie-internal:jar:6.4.0.Final:compile, org.antlr:antlr-runtime:jar:3.5:compile, org.eclipse.jdt.core.compiler:ecj:jar:4.4.2:compile, org.mvel:mvel2:jar:2.2.8.Final:compile, com.thoughtworks.xstream:xstream:jar:1.4.7:compile, xmlpull:xmlpull:jar:1.1.3.1:compile, xpp3:xpp3_min:jar:1.1.4c:compile, com.google.protobuf:protobuf-java:jar:2.6.0:compile, org.drools:drools-core:jar:6.4.0.Final:compile, commons-codec:commons-codec:jar:1.4:compile, javax.enterprise:cdi-api:jar:1.2:compile, javax.el:javax.el-api:jar:3.0.0:compile, javax.interceptor:javax.interceptor-api:jar:1.2:compile, javax.inject:javax.inject:jar:1:compile, org.jboss.weld.se:weld-se-core:jar:2.3.0.Final:compile, org.jboss.weld.environment:weld-environment-common:jar:2.3.0.Final:compile, org.jboss.weld:weld-core-impl:jar:2.3.0.Final:compile, org.jboss.weld:weld-api:jar:2.3.Final:compile, org.jboss.weld:weld-spi:jar:2.3.Final:compile, org.jboss.classfilewriter:jboss-classfilewriter:jar:1.1.2.Final:compile, com.google.guava:guava:jar:18.0:compile, org.jboss.spec.javax.el:jboss-el-api_3.0_spec:jar:1.0.0.Alpha1:compile, org.jboss.spec.javax.interceptor:jboss-interceptors-api_1.2_spec:jar:1.0.0.Final:compile, org.jboss.logging:jboss-logging:jar:3.2.1.Final:compile, org.jboss.weld.probe:weld-probe-core:jar:2.3.0.Final:compile, org.jboss.spec.javax.annotation:jboss-annotations-api_1.2_spec:jar:1.0.0.Final:compile]
  307. [DEBUG] Collected project classpath [/Users/ariel/Work/fallas/fallas/target/classes]
  308. [DEBUG] Adding to classpath : file:/Users/ariel/Work/fallas/fallas/target/classes/
  309. [DEBUG] Adding project dependency artifact: kie-api to classpath
  310. [DEBUG] Adding project dependency artifact: slf4j-api to classpath
  311. [DEBUG] Adding project dependency artifact: drools-compiler to classpath
  312. [DEBUG] Adding project dependency artifact: kie-internal to classpath
  313. [DEBUG] Adding project dependency artifact: antlr-runtime to classpath
  314. [DEBUG] Adding project dependency artifact: ecj to classpath
  315. [DEBUG] Adding project dependency artifact: mvel2 to classpath
  316. [DEBUG] Adding project dependency artifact: xstream to classpath
  317. [DEBUG] Adding project dependency artifact: xmlpull to classpath
  318. [DEBUG] Adding project dependency artifact: xpp3_min to classpath
  319. [DEBUG] Adding project dependency artifact: protobuf-java to classpath
  320. [DEBUG] Adding project dependency artifact: drools-core to classpath
  321. [DEBUG] Adding project dependency artifact: commons-codec to classpath
  322. [DEBUG] Adding project dependency artifact: cdi-api to classpath
  323. [DEBUG] Adding project dependency artifact: javax.el-api to classpath
  324. [DEBUG] Adding project dependency artifact: javax.interceptor-api to classpath
  325. [DEBUG] Adding project dependency artifact: javax.inject to classpath
  326. [DEBUG] Adding project dependency artifact: weld-se-core to classpath
  327. [DEBUG] Adding project dependency artifact: weld-environment-common to classpath
  328. [DEBUG] Adding project dependency artifact: weld-core-impl to classpath
  329. [DEBUG] Adding project dependency artifact: weld-api to classpath
  330. [DEBUG] Adding project dependency artifact: weld-spi to classpath
  331. [DEBUG] Adding project dependency artifact: jboss-classfilewriter to classpath
  332. [DEBUG] Adding project dependency artifact: guava to classpath
  333. [DEBUG] Adding project dependency artifact: jboss-el-api_3.0_spec to classpath
  334. [DEBUG] Adding project dependency artifact: jboss-interceptors-api_1.2_spec to classpath
  335. [DEBUG] Adding project dependency artifact: jboss-logging to classpath
  336. [DEBUG] Adding project dependency artifact: weld-probe-core to classpath
  337. [DEBUG] Adding project dependency artifact: jboss-annotations-api_1.2_spec to classpath
  338. [DEBUG] joining on thread Thread[ar.uba.fi.fallas.App.main(),5,ar.uba.fi.fallas.App]
  339. [DEBUG] Setting accessibility to true in order to invoke main().
  340. Jul 18, 2016 11:35:35 AM org.jboss.weld.bootstrap.WeldStartup <clinit>
  341. INFO: WELD-000900: 2.3.0 (Final)
  342. [WARNING]
  343. java.lang.reflect.InvocationTargetException
  344. at sun.reflect.NativeMethodAccessorImpl.invoke0(Native Method)
  345. at sun.reflect.NativeMethodAccessorImpl.invoke(NativeMethodAccessorImpl.java:62)
  346. at sun.reflect.DelegatingMethodAccessorImpl.invoke(DelegatingMethodAccessorImpl.java:43)
  347. at java.lang.reflect.Method.invoke(Method.java:498)
  348. at org.codehaus.mojo.exec.ExecJavaMojo$1.run(ExecJavaMojo.java:294)
  349. at java.lang.Thread.run(Thread.java:745)
  350. Caused by: java.lang.NoClassDefFoundError: com/google/common/base/Function
  351. at org.jboss.weld.bootstrap.WeldBootstrap.<init>(WeldBootstrap.java:54)
  352. at org.jboss.weld.environment.se.Weld.initialize(Weld.java:524)
  353. at ar.uba.fi.fallas.App.main(App.java:31)
  354. ... 6 more
  355. Caused by: java.lang.ClassNotFoundException: com.google.common.base.Function
  356. at java.net.URLClassLoader.findClass(URLClassLoader.java:381)
  357. at java.lang.ClassLoader.loadClass(ClassLoader.java:424)
  358. at java.lang.ClassLoader.loadClass(ClassLoader.java:357)
  359. ... 9 more
  360. [INFO] ------------------------------------------------------------------------
  361. [INFO] BUILD FAILURE
  362. [INFO] ------------------------------------------------------------------------
  363. [INFO] Total time: 1.628 s
  364. [INFO] Finished at: 2016-07-18T11:35:35-03:00
  365. [INFO] Final Memory: 14M/309M
  366. [INFO] ------------------------------------------------------------------------
  367. [ERROR] Failed to execute goal org.codehaus.mojo:exec-maven-plugin:1.5.0:java (default-cli) on project fallas: An exception occured while executing the Java class. null: InvocationTargetException: com/google/common/base/Function: com.google.common.base.Function -> [Help 1]
  368. org.apache.maven.lifecycle.LifecycleExecutionException: Failed to execute goal org.codehaus.mojo:exec-maven-plugin:1.5.0:java (default-cli) on project fallas: An exception occured while executing the Java class. null
  369. at org.apache.maven.lifecycle.internal.MojoExecutor.execute(MojoExecutor.java:212)
  370. at org.apache.maven.lifecycle.internal.MojoExecutor.execute(MojoExecutor.java:153)
  371. at org.apache.maven.lifecycle.internal.MojoExecutor.execute(MojoExecutor.java:145)
  372. at org.apache.maven.lifecycle.internal.LifecycleModuleBuilder.buildProject(LifecycleModuleBuilder.java:116)
  373. at org.apache.maven.lifecycle.internal.LifecycleModuleBuilder.buildProject(LifecycleModuleBuilder.java:80)
  374. at org.apache.maven.lifecycle.internal.builder.singlethreaded.SingleThreadedBuilder.build(SingleThreadedBuilder.java:51)
  375. at org.apache.maven.lifecycle.internal.LifecycleStarter.execute(LifecycleStarter.java:128)
  376. at org.apache.maven.DefaultMaven.doExecute(DefaultMaven.java:307)
  377. at org.apache.maven.DefaultMaven.doExecute(DefaultMaven.java:193)
  378. at org.apache.maven.DefaultMaven.execute(DefaultMaven.java:106)
  379. at org.apache.maven.cli.MavenCli.execute(MavenCli.java:863)
  380. at org.apache.maven.cli.MavenCli.doMain(MavenCli.java:288)
  381. at org.apache.maven.cli.MavenCli.main(MavenCli.java:199)
  382. at sun.reflect.NativeMethodAccessorImpl.invoke0(Native Method)
  383. at sun.reflect.NativeMethodAccessorImpl.invoke(NativeMethodAccessorImpl.java:62)
  384. at sun.reflect.DelegatingMethodAccessorImpl.invoke(DelegatingMethodAccessorImpl.java:43)
  385. at java.lang.reflect.Method.invoke(Method.java:498)
  386. at org.codehaus.plexus.classworlds.launcher.Launcher.launchEnhanced(Launcher.java:289)
  387. at org.codehaus.plexus.classworlds.launcher.Launcher.launch(Launcher.java:229)
  388. at org.codehaus.plexus.classworlds.launcher.Launcher.mainWithExitCode(Launcher.java:415)
  389. at org.codehaus.plexus.classworlds.launcher.Launcher.main(Launcher.java:356)
  390. Caused by: org.apache.maven.plugin.MojoExecutionException: An exception occured while executing the Java class. null
  391. at org.codehaus.mojo.exec.ExecJavaMojo.execute(ExecJavaMojo.java:345)
  392. at org.apache.maven.plugin.DefaultBuildPluginManager.executeMojo(DefaultBuildPluginManager.java:134)
  393. at org.apache.maven.lifecycle.internal.MojoExecutor.execute(MojoExecutor.java:207)
  394. ... 20 more
  395. Caused by: java.lang.reflect.InvocationTargetException
  396. at sun.reflect.NativeMethodAccessorImpl.invoke0(Native Method)
  397. at sun.reflect.NativeMethodAccessorImpl.invoke(NativeMethodAccessorImpl.java:62)
  398. at sun.reflect.DelegatingMethodAccessorImpl.invoke(DelegatingMethodAccessorImpl.java:43)
  399. at java.lang.reflect.Method.invoke(Method.java:498)
  400. at org.codehaus.mojo.exec.ExecJavaMojo$1.run(ExecJavaMojo.java:294)
  401. at java.lang.Thread.run(Thread.java:745)
  402. Caused by: java.lang.NoClassDefFoundError: com/google/common/base/Function
  403. at org.jboss.weld.bootstrap.WeldBootstrap.<init>(WeldBootstrap.java:54)
  404. at org.jboss.weld.environment.se.Weld.initialize(Weld.java:524)
  405. at ar.uba.fi.fallas.App.main(App.java:31)
  406. ... 6 more
  407. Caused by: java.lang.ClassNotFoundException: com.google.common.base.Function
  408. at java.net.URLClassLoader.findClass(URLClassLoader.java:381)
  409. at java.lang.ClassLoader.loadClass(ClassLoader.java:424)
  410. at java.lang.ClassLoader.loadClass(ClassLoader.java:357)
  411. ... 9 more
  412. [ERROR]
  413. [ERROR]
  414. [ERROR] For more information about the errors and possible solutions, please read the following articles:
  415. [ERROR] [Help 1] http://cwiki.apache.org/confluence/display/MAVEN/MojoExecutionException
RAW Paste Data