ananungi

Untitled

Jan 20th, 2022 (edited)
30
0
Never
Not a member of Pastebin yet? Sign Up, it unlocks many cool features!
text 4.05 KB | None | 0 0
  1. Error stacktraces are turned on.
  2. [INFO] Scanning for projects...
  3. [INFO] ------------------------------------------------------------------------
  4. [INFO] Reactor Build Order:
  5. [INFO]
  6. [INFO] Aijar [pom]
  7. [INFO] aijar Module API [jar]
  8. [INFO] aijar Module OMOD [jar]
  9. [INFO] aijar tools Module [jar]
  10. [INFO] ------------------------------------------------------------------------
  11. [INFO] Reactor Summary for Aijar 3.0.0-SNAPSHOT:
  12. [INFO]
  13. [INFO] Aijar .............................................. SKIPPED
  14. [INFO] aijar Module API ................................... SKIPPED
  15. [INFO] aijar Module OMOD .................................. SKIPPED
  16. [INFO] aijar tools Module ................................. SKIPPED
  17. [INFO] ------------------------------------------------------------------------
  18. [INFO] BUILD FAILURE
  19. [INFO] ------------------------------------------------------------------------
  20. [INFO] Total time: 0.229 s
  21. [INFO] Finished at: 2022-01-20T15:15:47+03:00
  22. [INFO] ------------------------------------------------------------------------
  23. [ERROR] No goals have been specified for this build. You must specify a valid lifecycle phase or a goal in the format <plugin-prefix>:<goal> or <plugin-group-id>:<plugin-artifact-id>[:<plugin-version>]:<goal>. Available lifecycle phases are: validate, initialize, generate-sources, process-sources, generate-resources, process-resources, compile, process-classes, generate-test-sources, process-test-sources, generate-test-resources, process-test-resources, test-compile, process-test-classes, test, prepare-package, package, pre-integration-test, integration-test, post-integration-test, verify, install, deploy, pre-clean, clean, post-clean, pre-site, site, post-site, site-deploy. -> [Help 1]
  24. org.apache.maven.lifecycle.NoGoalSpecifiedException: No goals have been specified for this build. You must specify a valid lifecycle phase or a goal in the format <plugin-prefix>:<goal> or <plugin-group-id>:<plugin-artifact-id>[:<plugin-version>]:<goal>. Available lifecycle phases are: validate, initialize, generate-sources, process-sources, generate-resources, process-resources, compile, process-classes, generate-test-sources, process-test-sources, generate-test-resources, process-test-resources, test-compile, process-test-classes, test, prepare-package, package, pre-integration-test, integration-test, post-integration-test, verify, install, deploy, pre-clean, clean, post-clean, pre-site, site, post-site, site-deploy.
  25. at org.apache.maven.lifecycle.internal.LifecycleStarter.execute (LifecycleStarter.java:97)
  26. at org.apache.maven.DefaultMaven.doExecute (DefaultMaven.java:305)
  27. at org.apache.maven.DefaultMaven.doExecute (DefaultMaven.java:192)
  28. at org.apache.maven.DefaultMaven.execute (DefaultMaven.java:105)
  29. at org.apache.maven.cli.MavenCli.execute (MavenCli.java:972)
  30. at org.apache.maven.cli.MavenCli.doMain (MavenCli.java:293)
  31. at org.apache.maven.cli.MavenCli.main (MavenCli.java:196)
  32. at sun.reflect.NativeMethodAccessorImpl.invoke0 (Native Method)
  33. at sun.reflect.NativeMethodAccessorImpl.invoke (NativeMethodAccessorImpl.java:62)
  34. at sun.reflect.DelegatingMethodAccessorImpl.invoke (DelegatingMethodAccessorImpl.java:43)
  35. at java.lang.reflect.Method.invoke (Method.java:498)
  36. at org.codehaus.plexus.classworlds.launcher.Launcher.launchEnhanced (Launcher.java:282)
  37. at org.codehaus.plexus.classworlds.launcher.Launcher.launch (Launcher.java:225)
  38. at org.codehaus.plexus.classworlds.launcher.Launcher.mainWithExitCode (Launcher.java:406)
  39. at org.codehaus.plexus.classworlds.launcher.Launcher.main (Launcher.java:347)
  40. [ERROR]
  41. [ERROR] Re-run Maven using the -X switch to enable full debug logging.
  42. [ERROR]
  43. [ERROR] For more information about the errors and possible solutions, please read the following articles:
  44. [ERROR] [Help 1] http://cwiki.apache.org/confluence/display/MAVEN/NoGoalSpecifiedException
Add Comment
Please, Sign In to add comment