Guest User

Untitled

a guest
Jul 18th, 2016
67
Never
Not a member of Pastebin yet? Sign Up, it unlocks many cool features!
  1. # mvn exec:java -Dexec.mainClass="ar.uba.fi.fallas.App" Mon Jul 18 11:33:04 2016
  2. [INFO] Scanning for projects...
  3. [INFO]
  4. [INFO] ------------------------------------------------------------------------
  5. [INFO] Building fallas 1.0-SNAPSHOT
  6. [INFO] ------------------------------------------------------------------------
  7. [INFO]
  8. [INFO] --- exec-maven-plugin:1.5.0:java (default-cli) @ fallas ---
  9. Jul 18, 2016 11:33:09 AM org.jboss.weld.bootstrap.WeldStartup <clinit>
  10. INFO: WELD-000900: 2.3.0 (Final)
  11. [WARNING]
  12. java.lang.reflect.InvocationTargetException
  13. at sun.reflect.NativeMethodAccessorImpl.invoke0(Native Method)
  14. at sun.reflect.NativeMethodAccessorImpl.invoke(NativeMethodAccessorImpl.java:62)
  15. at sun.reflect.DelegatingMethodAccessorImpl.invoke(DelegatingMethodAccessorImpl.java:43)
  16. at java.lang.reflect.Method.invoke(Method.java:498)
  17. at org.codehaus.mojo.exec.ExecJavaMojo$1.run(ExecJavaMojo.java:294)
  18. at java.lang.Thread.run(Thread.java:745)
  19. Caused by: java.lang.NoClassDefFoundError: com/google/common/base/Function
  20. at org.jboss.weld.bootstrap.WeldBootstrap.<init>(WeldBootstrap.java:54)
  21. at org.jboss.weld.environment.se.Weld.initialize(Weld.java:524)
  22. at ar.uba.fi.fallas.App.main(App.java:31)
  23. ... 6 more
  24. Caused by: java.lang.ClassNotFoundException: com.google.common.base.Function
  25. at java.net.URLClassLoader.findClass(URLClassLoader.java:381)
  26. at java.lang.ClassLoader.loadClass(ClassLoader.java:424)
  27. at java.lang.ClassLoader.loadClass(ClassLoader.java:357)
  28. ... 9 more
  29. [INFO] ------------------------------------------------------------------------
  30. [INFO] BUILD FAILURE
  31. [INFO] ------------------------------------------------------------------------
  32. [INFO] Total time: 1.619 s
  33. [INFO] Finished at: 2016-07-18T11:33:09-03:00
  34. [INFO] Final Memory: 15M/309M
  35. [INFO] ------------------------------------------------------------------------
  36. [ERROR] Failed to execute goal org.codehaus.mojo:exec-maven-plugin:1.5.0:java (default-cli) on project fallas: An exception occured while executing the Java class. null: InvocationTargetException: com/google/common/base/Function: com.google.common.base.Function -> [Help 1]
  37. [ERROR]
  38. [ERROR] To see the full stack trace of the errors, re-run Maven with the -e switch.
  39. [ERROR] Re-run Maven using the -X switch to enable full debug logging.
  40. [ERROR]
  41. [ERROR] For more information about the errors and possible solutions, please read the following articles:
  42. [ERROR] [Help 1] http://cwiki.apache.org/confluence/display/MAVEN/MojoExecutionException
RAW Paste Data