SHARE
TWEET

Gradle Execution Result

a guest Jul 20th, 2015 250 Never
Not a member of Pastebin yet? Sign Up, it unlocks many cool features!
  1. 02:04:24.052 [QUIET] [system.out] The --no-color option is deprecated - use --console=plain instead
  2. 02:04:25.177 [INFO] [org.gradle.BuildLogger] Starting Build
  3. 02:04:25.182 [DEBUG] [org.gradle.BuildLogger] Gradle user home: /opt/crw/upsource/Upsource/temp/upsource-analyzer/upsource-tmp/gradle-home
  4. 02:04:25.183 [DEBUG] [org.gradle.BuildLogger] Current dir: /opt/crw/upsource/Upsource
  5. 02:04:25.184 [DEBUG] [org.gradle.BuildLogger] Settings file: null
  6. 02:04:25.186 [DEBUG] [org.gradle.BuildLogger] Build file: null
  7. 02:04:25.379 [DEBUG] [org.gradle.api.internal.artifacts.mvnsettings.DefaultLocalMavenRepositoryLocator] No local repository in Settings file defined. Using default path: /root/.m2/repository
  8. 02:04:25.575 [ERROR] [org.gradle.BuildExceptionReporter]
  9. 02:04:25.577 [ERROR] [org.gradle.BuildExceptionReporter] FAILURE: Build failed with an exception.
  10. 02:04:25.579 [ERROR] [org.gradle.BuildExceptionReporter]
  11. 02:04:25.580 [ERROR] [org.gradle.BuildExceptionReporter] * What went wrong:
  12. 02:04:25.581 [ERROR] [org.gradle.BuildExceptionReporter] Could not read initialization script '/opt/crw/upsource/Upsource/temp/upsource-analyzer/_upsource_init_script9021095754170698374.gradle' as it does not exist.
  13. 02:04:25.582 [ERROR] [org.gradle.BuildExceptionReporter]
  14. 02:04:25.587 [ERROR] [org.gradle.BuildExceptionReporter] * Exception is:
  15. 02:04:25.589 [ERROR] [org.gradle.BuildExceptionReporter] org.gradle.internal.resource.ResourceNotFoundException: Could not read initialization script '/opt/crw/upsource/Upsource/temp/upsource-analyzer/_upsource_init_script9021095754170698374.gradle' as it does not exist.
  16. 02:04:25.595 [ERROR] [org.gradle.BuildExceptionReporter]        at org.gradle.internal.resource.UriResource.getText(UriResource.java:76)
  17. 02:04:25.598 [ERROR] [org.gradle.BuildExceptionReporter]        at org.gradle.internal.resource.CachingResource.maybeFetch(CachingResource.java:41)
  18. 02:04:25.602 [ERROR] [org.gradle.BuildExceptionReporter]        at org.gradle.internal.resource.CachingResource.getText(CachingResource.java:35)
  19. 02:04:25.604 [ERROR] [org.gradle.BuildExceptionReporter]        at org.gradle.groovy.scripts.internal.ShortCircuitEmptyScriptCompiler.compile(ShortCircuitEmptyScriptCompiler.java:39)
  20. 02:04:25.605 [ERROR] [org.gradle.BuildExceptionReporter]        at org.gradle.groovy.scripts.internal.CachingScriptClassCompiler.compile(CachingScriptClassCompiler.java:41)
  21. 02:04:25.607 [ERROR] [org.gradle.BuildExceptionReporter]        at org.gradle.groovy.scripts.DefaultScriptCompilerFactory$ScriptCompilerImpl.compile(DefaultScriptCompilerFactory.java:50)
  22. 02:04:25.608 [ERROR] [org.gradle.BuildExceptionReporter]        at org.gradle.configuration.DefaultScriptPluginFactory$ScriptPluginImpl.apply(DefaultScriptPluginFactory.java:122)
  23. 02:04:25.610 [ERROR] [org.gradle.BuildExceptionReporter]        at org.gradle.configuration.DefaultInitScriptProcessor.process(DefaultInitScriptProcessor.java:50)
  24. 02:04:25.612 [ERROR] [org.gradle.BuildExceptionReporter]        at org.gradle.initialization.InitScriptHandler.executeScripts(InitScriptHandler.java:36)
  25. 02:04:25.613 [ERROR] [org.gradle.BuildExceptionReporter]        at org.gradle.initialization.DefaultGradleLauncher.doBuildStages(DefaultGradleLauncher.java:118)
  26. 02:04:25.614 [ERROR] [org.gradle.BuildExceptionReporter]        at org.gradle.initialization.DefaultGradleLauncher.doBuild(DefaultGradleLauncher.java:106)
  27. 02:04:25.616 [ERROR] [org.gradle.BuildExceptionReporter]        at org.gradle.initialization.DefaultGradleLauncher.run(DefaultGradleLauncher.java:86)
  28. 02:04:25.618 [ERROR] [org.gradle.BuildExceptionReporter]        at org.gradle.launcher.exec.InProcessBuildActionExecuter$DefaultBuildController.run(InProcessBuildActionExecuter.java:90)
  29. 02:04:25.619 [ERROR] [org.gradle.BuildExceptionReporter]        at org.gradle.tooling.internal.provider.ExecuteBuildActionRunner.run(ExecuteBuildActionRunner.java:28)
  30. 02:04:25.622 [ERROR] [org.gradle.BuildExceptionReporter]        at org.gradle.launcher.exec.ChainingBuildActionRunner.run(ChainingBuildActionRunner.java:35)
  31. 02:04:25.623 [ERROR] [org.gradle.BuildExceptionReporter]        at org.gradle.launcher.exec.InProcessBuildActionExecuter.execute(InProcessBuildActionExecuter.java:41)
  32. 02:04:25.624 [ERROR] [org.gradle.BuildExceptionReporter]        at org.gradle.launcher.exec.InProcessBuildActionExecuter.execute(InProcessBuildActionExecuter.java:28)
  33. 02:04:25.624 [ERROR] [org.gradle.BuildExceptionReporter]        at org.gradle.launcher.exec.DaemonUsageSuggestingBuildActionExecuter.execute(DaemonUsageSuggestingBuildActionExecuter.java:50)
  34. 02:04:25.625 [ERROR] [org.gradle.BuildExceptionReporter]        at org.gradle.launcher.exec.DaemonUsageSuggestingBuildActionExecuter.execute(DaemonUsageSuggestingBuildActionExecuter.java:27)
  35. 02:04:25.627 [ERROR] [org.gradle.BuildExceptionReporter]        at org.gradle.launcher.cli.RunBuildAction.run(RunBuildAction.java:40)
  36. 02:04:25.631 [ERROR] [org.gradle.BuildExceptionReporter]        at org.gradle.internal.Actions$RunnableActionAdapter.execute(Actions.java:169)
  37. 02:04:25.634 [ERROR] [org.gradle.BuildExceptionReporter]        at org.gradle.launcher.cli.CommandLineActionFactory$ParseAndBuildAction.execute(CommandLineActionFactory.java:237)
  38. 02:04:25.644 [ERROR] [org.gradle.BuildExceptionReporter]        at org.gradle.launcher.cli.CommandLineActionFactory$ParseAndBuildAction.execute(CommandLineActionFactory.java:210)
  39. 02:04:25.645 [ERROR] [org.gradle.BuildExceptionReporter]        at org.gradle.launcher.cli.JavaRuntimeValidationAction.execute(JavaRuntimeValidationAction.java:35)
  40. 02:04:25.647 [ERROR] [org.gradle.BuildExceptionReporter]        at org.gradle.launcher.cli.JavaRuntimeValidationAction.execute(JavaRuntimeValidationAction.java:24)
  41. 02:04:25.648 [ERROR] [org.gradle.BuildExceptionReporter]        at org.gradle.launcher.cli.CommandLineActionFactory$WithLogging.execute(CommandLineActionFactory.java:206)
  42. 02:04:25.649 [ERROR] [org.gradle.BuildExceptionReporter]        at org.gradle.launcher.cli.CommandLineActionFactory$WithLogging.execute(CommandLineActionFactory.java:169)
  43. 02:04:25.651 [ERROR] [org.gradle.BuildExceptionReporter]        at org.gradle.launcher.cli.ExceptionReportingAction.execute(ExceptionReportingAction.java:33)
  44. 02:04:25.652 [ERROR] [org.gradle.BuildExceptionReporter]        at org.gradle.launcher.cli.ExceptionReportingAction.execute(ExceptionReportingAction.java:22)
  45. 02:04:25.653 [ERROR] [org.gradle.BuildExceptionReporter]        at org.gradle.launcher.Main.doAction(Main.java:33)
  46. 02:04:25.655 [ERROR] [org.gradle.BuildExceptionReporter]        at org.gradle.launcher.bootstrap.EntryPoint.run(EntryPoint.java:45)
  47. 02:04:25.656 [ERROR] [org.gradle.BuildExceptionReporter]        at org.gradle.launcher.bootstrap.ProcessBootstrap.runNoExit(ProcessBootstrap.java:54)
  48. 02:04:25.657 [ERROR] [org.gradle.BuildExceptionReporter]        at org.gradle.launcher.bootstrap.ProcessBootstrap.run(ProcessBootstrap.java:35)
  49. 02:04:25.658 [ERROR] [org.gradle.BuildExceptionReporter]        at org.gradle.launcher.GradleMain.main(GradleMain.java:23)
  50. 02:04:25.659 [ERROR] [org.gradle.BuildExceptionReporter]
  51. 02:04:25.660 [LIFECYCLE] [org.gradle.BuildResultLogger]
  52. 02:04:25.661 [LIFECYCLE] [org.gradle.BuildResultLogger] BUILD FAILED
  53. 02:04:25.662 [LIFECYCLE] [org.gradle.BuildResultLogger]
  54. 02:04:25.663 [LIFECYCLE] [org.gradle.BuildResultLogger] Total time: 1.935 secs
  55. 02:04:25.675 [DEBUG] [org.gradle.cache.internal.DefaultCacheAccess] Cache artifact cache (/opt/crw/upsource/Upsource/temp/upsource-analyzer/upsource-tmp/gradle-home/caches/modules-2) was closed 0 times.
  56. 02:04:25.676 [DEBUG] [org.gradle.cache.internal.DefaultCacheAccess] Cache Plugin Resolution Cache (/opt/crw/upsource/Upsource/temp/upsource-analyzer/upsource-tmp/gradle-home/caches/2.4/plugin-resolution) was closed 0 times.
  57. 02:04:25.680 [DEBUG] [org.gradle.api.internal.artifacts.ivyservice.resolveengine.store.ResolutionResultsStoreFactory] Deleted 0 resolution results binary files in 0.0 secs
  58. 02:04:25.681 [DEBUG] [org.gradle.api.internal.artifacts.ivyservice.ivyresolve.memcache.InMemoryCachedRepositoryFactory] In-memory dependency metadata cache closed. Repos cached: 0, cache instances: 0, modules served from cache: 0, artifacts: 0
RAW Paste Data
We use cookies for various purposes including analytics. By continuing to use Pastebin, you agree to our use of cookies as described in the Cookies Policy. OK, I Understand
 
Top