Guest User

Untitled

a guest
Mar 3rd, 2014
83
Never
Not a member of Pastebin yet? Sign Up, it unlocks many cool features!
  1. ➜ minetest-official git:(master) make -j2
  2. [ 0%] Built target jsoncpp
  3. -- *** Detected git version 0.4.9-121-gd5a6950 ***
  4. [ 0%] Built target GenerateVersion
  5. [ 0%] Building CXX object src/CMakeFiles/minetestserver.dir/jthread/pthread/jsemaphore.cpp.o
  6. [ 0%] Building CXX object src/CMakeFiles/minetest.dir/jthread/pthread/jsemaphore.cpp.o
  7. /Users/adrian/Github/minetest-official/src/jthread/pthread/jsemaphore.cpp:70:24: error:
  8. use of undeclared identifier 'sem_timedwait'
  9. /Users/adrian/Github/minetest-official/src/jthread/pthread/jsemaphore.cpp:70:24: error:
  10. use of undeclared identifier 'sem_timedwait'
  11. int sem_wait_retval = sem_timedwait(&m_semaphore,&waittime);
  12. ^
  13. int sem_wait_retval = sem_timedwait(&m_semaphore,&waittime);
  14. ^
  15. 11 error error generated.
  16. generated.
  17. make[2]: make[2]: *** [src/CMakeFiles/minetestserver.dir/jthread/pthread/jsemaphore.cpp.o] Error 1*** [src/CMakeFiles/minetest.dir/jthread/pthread/jsemaphore.cpp.o] Error 1
  18.  
  19. make[1]: *** [src/CMakeFiles/minetestserver.dir/all] Error 2
  20. make[1]: *** Waiting for unfinished jobs....
  21. make[1]: *** [src/CMakeFiles/minetest.dir/all] Error 2
  22. make: *** [all] Error 2
  23. ➜ minetest-official git:(master)
RAW Paste Data

Adblocker detected! Please consider disabling it...

We've detected AdBlock Plus or some other adblocking software preventing Pastebin.com from fully loading.

We don't have any obnoxious sound, or popup ads, we actively block these annoying types of ads!

Please add Pastebin.com to your ad blocker whitelist or disable your adblocking software.

×