Guest User

Untitled

a guest
Jul 2nd, 2021
39
70 days
Not a member of Pastebin yet? Sign Up, it unlocks many cool features!
  1. in shell with OpenSSL 1.0.x first on $PATH:
  2. $ which openssl
  3. /Users/me/.brew/opt/openssl/bin/openssl
  4. $ openssl version
  5. OpenSSL 1.0.2m 2 Nov 2017
  6. $ pyenv doctor
  7. Cloning /Users/me/.pyenv/plugins/pyenv-doctor/bin/.....
  8. Installing python-pyenv-doctor...
  9. python-build: use readline from homebrew
  10. python-build: use zlib from xcode sdk
  11.  
  12. BUILD FAILED (OS X 10.15.7 using python-build 20180424)
  13.  
  14. Inspect or clean up the working tree at /var/folders/75/0f43k9hs2lq88zz28jpm8t18wm1rhf/T/python-build.20210702151121.81430
  15. Results logged to /var/folders/75/0f43k9hs2lq88zz28jpm8t18wm1rhf/T/python-build.20210702151121.81430.log
  16.  
  17. Last 10 log lines:
  18. checking readline/readline.h, presence... no
  19. checking for readline/readline.h,... no
  20. checking readline/rlconf.h usability... yes
  21. checking readline/rlconf.h presence... yes
  22. checking for readline/rlconf.h... yes
  23. checking for SSL_library_init in -lssl... no
  24. configure: WARNING: OpenSSL <1.1 not installed. Checking v1.1 or beyond...
  25. checking for OPENSSL_init_ssl in -lssl... no
  26. configure: error: OpenSSL is not installed.
  27. make: *** No targets specified and no makefile found. Stop.
  28. Problem(s) detected while checking system.
  29.  
  30. See https://github.com/pyenv/pyenv/wiki/Common-build-problems for known solutions.
  31. $ CPPFLAGS="-I~/.brew/opt/openssl/include/openssl/include" LDFLAGS="-L~/.brew/opt/openssl/include/openssl/lib" pyenv doctor
  32. Cloning /Users/me/.pyenv/plugins/pyenv-doctor/bin/.....
  33. Installing python-pyenv-doctor...
  34. python-build: use readline from homebrew
  35. python-build: use zlib from xcode sdk
  36.  
  37. BUILD FAILED (OS X 10.15.7 using python-build 20180424)
  38.  
  39. Inspect or clean up the working tree at /var/folders/75/0f43k9hs2lq88zz28jpm8t18wm1rhf/T/python-build.20210702151132.82049
  40. Results logged to /var/folders/75/0f43k9hs2lq88zz28jpm8t18wm1rhf/T/python-build.20210702151132.82049.log
  41.  
  42. Last 10 log lines:
  43. checking readline/readline.h, presence... no
  44. checking for readline/readline.h,... no
  45. checking readline/rlconf.h usability... yes
  46. checking readline/rlconf.h presence... yes
  47. checking for readline/rlconf.h... yes
  48. checking for SSL_library_init in -lssl... no
  49. configure: WARNING: OpenSSL <1.1 not installed. Checking v1.1 or beyond...
  50. checking for OPENSSL_init_ssl in -lssl... no
  51. configure: error: OpenSSL is not installed.
  52. make: *** No targets specified and no makefile found. Stop.
  53. Problem(s) detected while checking system.
  54.  
  55. See https://github.com/pyenv/pyenv/wiki/Common-build-problems for known solutions.
  56.  
  57. in shell with OpenSSL >1.0.x first on $PATH:
  58. $ which openssl
  59. /usr/bin/openssl
  60. $ openssl version
  61. LibreSSL 2.8.3
  62. $ pyenv doctor
  63. Cloning /Users/me/.pyenv/plugins/pyenv-doctor/bin/.....
  64. Installing python-pyenv-doctor...
  65. python-build: use readline from homebrew
  66. python-build: use zlib from xcode sdk
  67.  
  68. BUILD FAILED (OS X 10.15.7 using python-build 20180424)
  69.  
  70. Inspect or clean up the working tree at /var/folders/75/0f43k9hs2lq88zz28jpm8t18wm1rhf/T/python-build.20210702151020.80715
  71. Results logged to /var/folders/75/0f43k9hs2lq88zz28jpm8t18wm1rhf/T/python-build.20210702151020.80715.log
  72.  
  73. Last 10 log lines:
  74. checking readline/readline.h, presence... no
  75. checking for readline/readline.h,... no
  76. checking readline/rlconf.h usability... yes
  77. checking readline/rlconf.h presence... yes
  78. checking for readline/rlconf.h... yes
  79. checking for SSL_library_init in -lssl... no
  80. configure: WARNING: OpenSSL <1.1 not installed. Checking v1.1 or beyond...
  81. checking for OPENSSL_init_ssl in -lssl... no
  82. configure: error: OpenSSL is not installed.
  83. make: *** No targets specified and no makefile found. Stop.
  84. Problem(s) detected while checking system.
  85.  
  86. See https://github.com/pyenv/pyenv/wiki/Common-build-problems for known solutions.
RAW Paste Data