Guest User

Untitled

a guest
May 1st, 2021
42
Never
Not a member of Pastebin yet? Sign Up, it unlocks many cool features!
  1.  
  2. a - sunrpc/des_impl.os
  3. a - sunrpc/des_soft.os
  4. a - sunrpc/key_prot.os
  5. a - sunrpc/openchild.os
  6. a - sunrpc/rtime.os
  7. a - sunrpc/svcauth_des.os
  8. a - sunrpc/clnt_unix.os
  9. a - sunrpc/svc_unix.os
  10. a - sunrpc/create_xid.os
  11. a - sunrpc/auth_des.os
  12. a - sunrpc/auth_unix.os
  13. a - sunrpc/clnt_gen.os
  14. a - sunrpc/clnt_perr.os
  15. a - sunrpc/clnt_tcp.os
  16. a - sunrpc/clnt_udp.os
  17. a - sunrpc/get_myaddr.os
  18. a - sunrpc/key_call.os
  19. a - sunrpc/netname.os
  20. a - sunrpc/pm_getport.os
  21. a - sunrpc/rpc_thread.os
  22. a - sunrpc/svc.os
  23. a - sunrpc/svc_tcp.os
  24. a - sunrpc/svc_udp.os
  25. a - sunrpc/xcrypt.os
  26. a - sunrpc/xdr_array.os
  27. a - sunrpc/xdr.os
  28. a - sunrpc/xdr_intXX_t.os
  29. a - sunrpc/xdr_mem.os
  30. a - sunrpc/xdr_ref.os
  31. a - sunrpc/xdr_sizeof.os
  32. a - sunrpc/xdr_stdio.os
  33. a - sunrpc/svc_run.os
  34. a - sunrpc/rpc_gethostbyname.os
  35. a - nscd/nscd_getpw_r.os
  36. a - nscd/nscd_getgr_r.os
  37. a - nscd/nscd_gethst_r.os
  38. a - nscd/nscd_getai.os
  39. a - nscd/nscd_initgroups.os
  40. a - nscd/nscd_getserv_r.os
  41. a - nscd/nscd_netgroup.os
  42. a - nscd/nscd_helper.os
  43. a - login/getlogin.os
  44. a - login/getlogin_r.os
  45. a - login/setlogin.os
  46. a - login/getlogin_r_chk.os
  47. a - login/getutent.os
  48. a - login/getutent_r.os
  49. a - login/getutid.os
  50. a - login/getutline.os
  51. a - login/getutid_r.os
  52. a - login/getutline_r.os
  53. a - login/utmp_file.os
  54. a - login/utmpname.os
  55. a - login/updwtmp.os
  56. a - login/getpt.os
  57. a - login/grantpt.os
  58. a - login/unlockpt.os
  59. a - login/ptsname.os
  60. a - login/ptsname_r_chk.os
  61. a - login/setutxent.os
  62. a - login/getutxent.os
  63. a - login/endutxent.os
  64. a - login/getutxid.os
  65. a - login/getutxline.os
  66. a - login/pututxline.os
  67. a - login/utmpxname.os
  68. a - login/updwtmpx.os
  69. a - login/getutmpx.os
  70. a - login/getutmp.os
  71. a - elf/dl-iteratephdr.os
  72. a - elf/dl-addr.os
  73. a - elf/dl-addr-obj.os
  74. a - elf/dl-profstub.os
  75. a - elf/dl-libc.os
  76. a - elf/dl-sym.os
  77. a - elf/dl-error.os
  78. a - elf/libc_early_init.os
  79. a - elf/aeabi_unwind_cpp_pr1.os
  80. a - elf/find_exidx.os
  81. armv6l-unknown-linux-gnueabihf-gcc -nostdlib -nostartfiles -r -o /build/build/libc_pic.os \
  82. -Wl,-d -Wl,--whole-archive /build/build/libc_pic.a -o /build/build/libc_pic.os
  83. armv6l-unknown-linux-gnueabihf-gcc -nostdlib -nostartfiles -r -o /build/build/elf/librtld.map.o -Wl,--defsym=calloc=0 -Wl,--defsym=free=0 -Wl,--defsym=malloc=0 -Wl,--defsym=realloc=0 -Wl,--defsym=__stack_chk_fail=0 -Wl,--defsym=__stack_chk_fail_local=0 \
  84. '-Wl,-(' /build/build/elf/dl-allobjs.os /build/build/libc_pic.a -lgcc '-Wl,-)' -Wl,-Map,/build/build/elf/librtld.mapT
  85. /nix/store/xb7xybgh6ch7krc51gnhvbmbsfb6r7rc-armv6l-unknown-linux-gnueabihf-binutils-2.35.1/bin/armv6l-unknown-linux-gnueabihf-ld: /build/build/libc_pic.a: error adding symbols: archive has no index; run ranlib to add one
  86. collect2: error: ld returned 1 exit status
  87. make[2]: *** [Makefile:525: /build/build/elf/librtld.map] Error 1
  88. make[2]: *** Waiting for unfinished jobs....
  89. make[2]: Leaving directory '/build/glibc-2.32/elf'
  90. make[1]: *** [Makefile:470: elf/subdir_lib] Error 2
  91. make[1]: Leaving directory '/build/glibc-2.32'
  92. make: *** [Makefile:9: all] Error 2
  93. error: builder for '/nix/store/k1mwjp3zay656g3jr0p2k78bf6jjizm1-glibc-2.32-40-armv6l-unknown-linux-gnueabihf.drv' failed with exit code 2;
  94. last 10 log lines:
  95. > armv6l-unknown-linux-gnueabihf-gcc -nostdlib -nostartfiles -r -o /build/build/elf/librtld.map.o -Wl,--defsym=calloc=0 -Wl,--defsym=free=0 -Wl,--defsym=malloc=0 -Wl,--defsym=realloc=0 -Wl,--defsym=__stack_chk_fail=0 -Wl,--defsym=__stack_chk_fail_local=0 \
  96. > '-Wl,-(' /build/build/elf/dl-allobjs.os /build/build/libc_pic.a -lgcc '-Wl,-)' -Wl,-Map,/build/build/elf/librtld.mapT
  97. > /nix/store/xb7xybgh6ch7krc51gnhvbmbsfb6r7rc-armv6l-unknown-linux-gnueabihf-binutils-2.35.1/bin/armv6l-unknown-linux-gnueabihf-ld: /build/build/libc_pic.a: error adding symbols: archive has no index; run ranlib to add one
  98. > collect2: error: ld returned 1 exit status
  99. > make[2]: *** [Makefile:525: /build/build/elf/librtld.map] Error 1
  100. > make[2]: *** Waiting for unfinished jobs....
  101. > make[2]: Leaving directory '/build/glibc-2.32/elf'
  102. > make[1]: *** [Makefile:470: elf/subdir_lib] Error 2
  103. > make[1]: Leaving directory '/build/glibc-2.32'
  104. > make: *** [Makefile:9: all] Error 2
  105. For full logs, run 'nix log /nix/store/k1mwjp3zay656g3jr0p2k78bf6jjizm1-glibc-2.32-40-armv6l-unknown-linux-gnueabihf.drv'.
  106. error: 1 dependencies of derivation '/nix/store/k42b6lpynj4rjnl7pygsnl6ng54y1dzd-armv6l-unknown-linux-gnueabihf-stage-final-gcc-debug-wrapper-10.2.0.drv' failed to build
  107. error: 1 dependencies of derivation '/nix/store/55fy29ihjbv0bkj2ri25vbam2m2r66s0-stdenv-linux.drv' failed to build
RAW Paste Data