G2A Many GEOs
SHARE
TWEET

Untitled

a guest Mar 13th, 2017 122 Never
Not a member of Pastebin yet? Sign Up, it unlocks many cool features!
  1.  
  2. 1>------ Build started: Project: libcaffe, Configuration: Release x64 ------
  3. 1>  ProtoCompile.cmd : Create proto temp directory "C:\Program Files\caffe-windows\caffe-windows\windows\..\src\caffe\proto\temp"
  4. 1>  ProtoCompile.cmd : Generating "C:\Program Files\caffe-windows\caffe-windows\windows\..\src\caffe\proto\temp\caffe.pb.h" and "C:\Program Files\caffe-windows\caffe-windows\windows\..\src\caffe\proto\temp\caffe.pb.cc"
  5. 1>  ProtoCompile.cmd : Create proto include directory
  6. 1>  A subdirectory or file C:\Program Files\caffe-windows\caffe-windows\windows\..\include\caffe\proto already exists.
  7. 1>  ProtoCompile.cmd : Compare newly compiled caffe.pb.h with existing one
  8. 1>  Compiling CUDA source file ..\..\src\caffe\layers\absval_layer.cu...
  9. 1>  
  10. 1>  C:\Program Files\caffe-windows\caffe-windows\windows\libcaffe>"C:\Program Files\NVIDIA GPU Computing Toolkit\CUDA\v7.5\bin\nvcc.exe" -gencode=arch=compute_35,code=\"sm_35,compute_35\" -gencode=arch=compute_50,code=\"sm_50,compute_50\" -gencode=arch=compute_52,code=\"sm_52,compute_52\" --use-local-env --cl-version 2013 -ccbin "C:\Program Files (x86)\Microsoft Visual Studio 12.0\VC\bin\x86_amd64"  -I"C:\Program Files\caffe-windows\NugetPackages\OpenCV.2.4.10\build\native\../../build/native/include/" -I"C:\Program Files\caffe-windows\NugetPackages\lmdb-v120-clean.0.9.14.0\build\native\..\..\lib\native\include" -I"C:\Program Files\caffe-windows\NugetPackages\LevelDB-vc120.1.2.0.0\build\native\../..//build/native/include/" -I"C:\Program Files\caffe-windows\NugetPackages\protobuf-v120.2.6.1\build\native\../..//build/native/include/" -I"C:\Program Files\caffe-windows\NugetPackages\glog.0.3.3.0\build\native\../..//build/native/include/" -I"C:\Program Files\caffe-windows\NugetPackages\gflags.2.1.2.1\build\native\../..///build/native/include/" -I"C:\Program Files\caffe-windows\NugetPackages\boost.1.59.0.0\build\native\..\..\lib\native\include\\" -I"C:\Program Files\caffe-windows\NugetPackages\hdf5-v120-complete.1.8.15.2\build\native\..\..\lib\native\include" -I"C:\Program Files\caffe-windows\NugetPackages\OpenBLAS.0.2.14.1\build\native\..\..\lib\native\include" -I"C:\Program Files\caffe-windows\caffe-windows\windows\libcaffe\\..\..\src\\" -I"C:\Program Files\NVIDIA GPU Computing Toolkit\CUDA\v7.5\include" -I"C:\Program Files\NVIDIA GPU Computing Toolkit\CUDA\v7.5\include"     --keep-dir "C:\Program Files\caffe-windows\caffe-windows\windows\..\Build\Int\libcaffe\x64\Release" -maxrregcount=0  --machine 64 --compile -cudart static -Xcudafe "--diag_suppress=exception_spec_override_incompat --diag_suppress=useless_using_declaration --diag_suppress=field_without_dll_interface" -D_SCL_SECURE_NO_WARNINGS -DGFLAGS_DLL_DECL=     -DHAS_OPENCV -DHAS_LMDB -DHAS_HDF5 -DHAS_OPENBLAS -DNDEBUG -D_SCL_SECURE_NO_WARNINGS -DUSE_OPENCV -DUSE_LEVELDB -DUSE_LMDB -DWITH_PYTHON_LAYER -DBOOST_PYTHON_STATIC_LIB -DUSE_CUDNN -D_UNICODE -DUNICODE -Xcompiler "/EHsc /W1 /nologo /Ox /Zi  /MD " -o "C:\Program Files\caffe-windows\caffe-windows\windows\..\Build\Int\libcaffe\x64\Release\absval_layer.cu.obj" "C:\Program Files\caffe-windows\caffe-windows\src\caffe\layers\absval_layer.cu"
  11. 1>C:\Program Files\caffe-windows\caffe-windows\include\caffe/util/cudnn.hpp(5): fatal error C1083: Cannot open include file: 'cudnn.h': No such file or directory
  12. 1>  absval_layer.cu
  13. 1>C:\Program Files (x86)\MSBuild\Microsoft.Cpp\v4.0\V120\BuildCustomizations\CUDA 7.5.targets(604,9): error MSB3721: The command ""C:\Program Files\NVIDIA GPU Computing Toolkit\CUDA\v7.5\bin\nvcc.exe" -gencode=arch=compute_35,code=\"sm_35,compute_35\" -gencode=arch=compute_50,code=\"sm_50,compute_50\" -gencode=arch=compute_52,code=\"sm_52,compute_52\" --use-local-env --cl-version 2013 -ccbin "C:\Program Files (x86)\Microsoft Visual Studio 12.0\VC\bin\x86_amd64"  -I"C:\Program Files\caffe-windows\NugetPackages\OpenCV.2.4.10\build\native\../../build/native/include/" -I"C:\Program Files\caffe-windows\NugetPackages\lmdb-v120-clean.0.9.14.0\build\native\..\..\lib\native\include" -I"C:\Program Files\caffe-windows\NugetPackages\LevelDB-vc120.1.2.0.0\build\native\../..//build/native/include/" -I"C:\Program Files\caffe-windows\NugetPackages\protobuf-v120.2.6.1\build\native\../..//build/native/include/" -I"C:\Program Files\caffe-windows\NugetPackages\glog.0.3.3.0\build\native\../..//build/native/include/" -I"C:\Program Files\caffe-windows\NugetPackages\gflags.2.1.2.1\build\native\../..///build/native/include/" -I"C:\Program Files\caffe-windows\NugetPackages\boost.1.59.0.0\build\native\..\..\lib\native\include\\" -I"C:\Program Files\caffe-windows\NugetPackages\hdf5-v120-complete.1.8.15.2\build\native\..\..\lib\native\include" -I"C:\Program Files\caffe-windows\NugetPackages\OpenBLAS.0.2.14.1\build\native\..\..\lib\native\include" -I"C:\Program Files\caffe-windows\caffe-windows\windows\libcaffe\\..\..\src\\" -I"C:\Program Files\NVIDIA GPU Computing Toolkit\CUDA\v7.5\include" -I"C:\Program Files\NVIDIA GPU Computing Toolkit\CUDA\v7.5\include"     --keep-dir "C:\Program Files\caffe-windows\caffe-windows\windows\..\Build\Int\libcaffe\x64\Release" -maxrregcount=0  --machine 64 --compile -cudart static -Xcudafe "--diag_suppress=exception_spec_override_incompat --diag_suppress=useless_using_declaration --diag_suppress=field_without_dll_interface" -D_SCL_SECURE_NO_WARNINGS -DGFLAGS_DLL_DECL=     -DHAS_OPENCV -DHAS_LMDB -DHAS_HDF5 -DHAS_OPENBLAS -DNDEBUG -D_SCL_SECURE_NO_WARNINGS -DUSE_OPENCV -DUSE_LEVELDB -DUSE_LMDB -DWITH_PYTHON_LAYER -DBOOST_PYTHON_STATIC_LIB -DUSE_CUDNN -D_UNICODE -DUNICODE -Xcompiler "/EHsc /W1 /nologo /Ox /Zi  /MD " -o "C:\Program Files\caffe-windows\caffe-windows\windows\..\Build\Int\libcaffe\x64\Release\absval_layer.cu.obj" "C:\Program Files\caffe-windows\caffe-windows\src\caffe\layers\absval_layer.cu"" exited with code 2.
  14. 2>------ Build started: Project: caffe, Configuration: Release x64 ------
  15. 3>------ Build started: Project: convert_cifar_data, Configuration: Release x64 ------
  16. 4>------ Build started: Project: classification, Configuration: Release x64 ------
  17. 5>------ Build started: Project: convert_mnist_data, Configuration: Release x64 ------
  18. 2>  caffe.cpp
  19. 2>C:\Program Files\caffe-windows\NugetPackages\boost.1.59.0.0\lib\native\include\boost/python/detail/wrap_python.hpp(50): fatal error C1083: Cannot open include file: 'pyconfig.h': No such file or directory
  20. 3>  convert_cifar_data.cpp
  21. 5>  convert_mnist_data.cpp
  22. 4>  classification.cpp
  23. 4>C:\Program Files\caffe-windows\caffe-windows\include\caffe/util/cudnn.hpp(5): fatal error C1083: Cannot open include file: 'cudnn.h': No such file or directory
  24. 6>------ Build started: Project: compute_image_mean, Configuration: Release x64 ------
  25. 7>------ Build started: Project: convert_imageset, Configuration: Release x64 ------
  26. 7>  convert_imageset.cpp
  27. 5>C:\Program Files\caffe-windows\caffe-windows\include\caffe/util/cudnn.hpp(5): fatal error C1083: Cannot open include file: 'cudnn.h': No such file or directory
  28. 6>  compute_image_mean.cpp
  29. 3>C:\Program Files\caffe-windows\caffe-windows\include\caffe/util/cudnn.hpp(5): fatal error C1083: Cannot open include file: 'cudnn.h': No such file or directory
  30. 8>------ Build started: Project: extract_features, Configuration: Release x64 ------
  31. 8>  extract_features.cpp
  32. 6>C:\Program Files\caffe-windows\caffe-windows\include\caffe/util/cudnn.hpp(5): fatal error C1083: Cannot open include file: 'cudnn.h': No such file or directory
  33. 7>C:\Program Files\caffe-windows\caffe-windows\include\caffe/util/cudnn.hpp(5): fatal error C1083: Cannot open include file: 'cudnn.h': No such file or directory
  34. 9>------ Build started: Project: test_all, Configuration: Release x64 ------
  35. 9>  Compiling CUDA source file ..\..\src\caffe\test\test_im2col_kernel.cu...
  36. 9>  
  37. 9>  C:\Program Files\caffe-windows\caffe-windows\windows\test_all>"C:\Program Files\NVIDIA GPU Computing Toolkit\CUDA\v7.5\bin\nvcc.exe" -gencode=arch=compute_35,code=\"sm_35,compute_35\" -gencode=arch=compute_50,code=\"sm_50,compute_50\" -gencode=arch=compute_52,code=\"sm_52,compute_52\" --use-local-env --cl-version 2013 -ccbin "C:\Program Files (x86)\Microsoft Visual Studio 12.0\VC\bin\x86_amd64"  -I"C:\Program Files\caffe-windows\NugetPackages\OpenCV.2.4.10\build\native\../../build/native/include/" -I"C:\Program Files\caffe-windows\NugetPackages\lmdb-v120-clean.0.9.14.0\build\native\..\..\lib\native\include" -I"C:\Program Files\caffe-windows\NugetPackages\LevelDB-vc120.1.2.0.0\build\native\../..//build/native/include/" -I"C:\Program Files\caffe-windows\NugetPackages\OpenBLAS.0.2.14.1\build\native\..\..\lib\native\include" -I"C:\Program Files\caffe-windows\NugetPackages\glog.0.3.3.0\build\native\../..//build/native/include/" -I"C:\Program Files\caffe-windows\NugetPackages\gflags.2.1.2.1\build\native\../..///build/native/include/" -I"C:\Program Files\caffe-windows\NugetPackages\protobuf-v120.2.6.1\build\native\../..//build/native/include/" -I"C:\Program Files\caffe-windows\NugetPackages\boost.1.59.0.0\build\native\..\..\lib\native\include\\" -I"C:\Program Files\caffe-windows\caffe-windows\windows\test_all\\..\..\src" -I"C:\Program Files\caffe-windows\NugetPackages\hdf5-v120-complete.1.8.15.2\build\native\..\..\lib\native\include" -I"C:\Program Files\NVIDIA GPU Computing Toolkit\CUDA\v7.5\include" -I"C:\Program Files\NVIDIA GPU Computing Toolkit\CUDA\v7.5\include"     --keep-dir "C:\Program Files\caffe-windows\caffe-windows\windows\..\Build\Int\test_all\x64\Release" -maxrregcount=0  --machine 64 --compile -cudart static -Xcudafe "--diag_suppress=exception_spec_override_incompat --diag_suppress=useless_using_declaration --diag_suppress=field_without_dll_interface --diag_suppress=boolean_controlling_expr_is_constant" -D_SCL_SECURE_NO_WARNINGS -DGFLAGS_DLL_DECL=     -DHAS_OPENCV -DHAS_LMDB -DHAS_OPENBLAS -DNDEBUG -D_SCL_SECURE_NO_WARNINGS -DUSE_OPENCV -DUSE_LEVELDB -DUSE_LMDB -DWITH_PYTHON_LAYER -DBOOST_PYTHON_STATIC_LIB -DUSE_CUDNN -D_UNICODE -DUNICODE -DHAS_HDF5 -Xcompiler "/EHsc /W1 /nologo /Ox /Zi  /MD " -o "C:\Program Files\caffe-windows\caffe-windows\windows\..\Build\Int\test_all\x64\Release\test_im2col_kernel.cu.obj" "C:\Program Files\caffe-windows\caffe-windows\src\caffe\test\test_im2col_kernel.cu"
  38. 10>------ Build started: Project: pycaffe, Configuration: Release x64 ------
  39. 11>------ Build started: Project: matcaffe, Configuration: Release x64 ------
  40. 11>  Skipping project matcaffe, Matlab support is not enabled in CommonSettings.props.
  41. 10>  PythonPreBuild.cmd : Create output directories for python scripts.
  42. 10>  PythonPreBuild.cmd : Create dummy __init__.py file
  43. 10>  PythonPreBuild.cmd : Generating src\caffe\proto\caffe.pb.h with python bindings
  44. 10>  _caffe.cpp
  45. 12>------ Build started: Project: convert_mnist_siamese_data, Configuration: Release x64 ------
  46. 9>C:\Program Files\caffe-windows\caffe-windows\include\caffe/util/cudnn.hpp(5): fatal error C1083: Cannot open include file: 'cudnn.h': No such file or directory
  47. 9>  test_im2col_kernel.cu
  48. 9>C:\Program Files (x86)\MSBuild\Microsoft.Cpp\v4.0\V120\BuildCustomizations\CUDA 7.5.targets(604,9): error MSB3721: The command ""C:\Program Files\NVIDIA GPU Computing Toolkit\CUDA\v7.5\bin\nvcc.exe" -gencode=arch=compute_35,code=\"sm_35,compute_35\" -gencode=arch=compute_50,code=\"sm_50,compute_50\" -gencode=arch=compute_52,code=\"sm_52,compute_52\" --use-local-env --cl-version 2013 -ccbin "C:\Program Files (x86)\Microsoft Visual Studio 12.0\VC\bin\x86_amd64"  -I"C:\Program Files\caffe-windows\NugetPackages\OpenCV.2.4.10\build\native\../../build/native/include/" -I"C:\Program Files\caffe-windows\NugetPackages\lmdb-v120-clean.0.9.14.0\build\native\..\..\lib\native\include" -I"C:\Program Files\caffe-windows\NugetPackages\LevelDB-vc120.1.2.0.0\build\native\../..//build/native/include/" -I"C:\Program Files\caffe-windows\NugetPackages\OpenBLAS.0.2.14.1\build\native\..\..\lib\native\include" -I"C:\Program Files\caffe-windows\NugetPackages\glog.0.3.3.0\build\native\../..//build/native/include/" -I"C:\Program Files\caffe-windows\NugetPackages\gflags.2.1.2.1\build\native\../..///build/native/include/" -I"C:\Program Files\caffe-windows\NugetPackages\protobuf-v120.2.6.1\build\native\../..//build/native/include/" -I"C:\Program Files\caffe-windows\NugetPackages\boost.1.59.0.0\build\native\..\..\lib\native\include\\" -I"C:\Program Files\caffe-windows\caffe-windows\windows\test_all\\..\..\src" -I"C:\Program Files\caffe-windows\NugetPackages\hdf5-v120-complete.1.8.15.2\build\native\..\..\lib\native\include" -I"C:\Program Files\NVIDIA GPU Computing Toolkit\CUDA\v7.5\include" -I"C:\Program Files\NVIDIA GPU Computing Toolkit\CUDA\v7.5\include"     --keep-dir "C:\Program Files\caffe-windows\caffe-windows\windows\..\Build\Int\test_all\x64\Release" -maxrregcount=0  --machine 64 --compile -cudart static -Xcudafe "--diag_suppress=exception_spec_override_incompat --diag_suppress=useless_using_declaration --diag_suppress=field_without_dll_interface --diag_suppress=boolean_controlling_expr_is_constant" -D_SCL_SECURE_NO_WARNINGS -DGFLAGS_DLL_DECL=     -DHAS_OPENCV -DHAS_LMDB -DHAS_OPENBLAS -DNDEBUG -D_SCL_SECURE_NO_WARNINGS -DUSE_OPENCV -DUSE_LEVELDB -DUSE_LMDB -DWITH_PYTHON_LAYER -DBOOST_PYTHON_STATIC_LIB -DUSE_CUDNN -D_UNICODE -DUNICODE -DHAS_HDF5 -Xcompiler "/EHsc /W1 /nologo /Ox /Zi  /MD " -o "C:\Program Files\caffe-windows\caffe-windows\windows\..\Build\Int\test_all\x64\Release\test_im2col_kernel.cu.obj" "C:\Program Files\caffe-windows\caffe-windows\src\caffe\test\test_im2col_kernel.cu"" exited with code 2.
  49. 10>C:\Program Files\caffe-windows\NugetPackages\boost.1.59.0.0\lib\native\include\boost/python/detail/wrap_python.hpp(50): fatal error C1083: Cannot open include file: 'pyconfig.h': No such file or directory
  50. 13>------ Build started: Project: upgrade_net_proto_binary, Configuration: Release x64 ------
  51. 13>  upgrade_net_proto_binary.cpp
  52. 14>------ Build started: Project: upgrade_net_proto_text, Configuration: Release x64 ------
  53. 14>  upgrade_net_proto_text.cpp
  54. 12>  convert_mnist_siamese_data.cpp
  55. 8>C:\Program Files\caffe-windows\caffe-windows\include\caffe/util/cudnn.hpp(5): fatal error C1083: Cannot open include file: 'cudnn.h': No such file or directory
  56. 13>C:\Program Files\caffe-windows\caffe-windows\include\caffe/util/cudnn.hpp(5): fatal error C1083: Cannot open include file: 'cudnn.h': No such file or directory
  57. 12>C:\Program Files\caffe-windows\caffe-windows\include\caffe/util/cudnn.hpp(5): fatal error C1083: Cannot open include file: 'cudnn.h': No such file or directory
  58. 15>------ Build started: Project: upgrade_solver_proto_text, Configuration: Release x64 ------
  59. 15>  upgrade_solver_proto_text.cpp
  60. 14>C:\Program Files\caffe-windows\caffe-windows\include\caffe/util/cudnn.hpp(5): fatal error C1083: Cannot open include file: 'cudnn.h': No such file or directory
  61. 15>C:\Program Files\caffe-windows\caffe-windows\include\caffe/util/cudnn.hpp(5): fatal error C1083: Cannot open include file: 'cudnn.h': No such file or directory
  62. ========== Build: 1 succeeded, 14 failed, 0 up-to-date, 0 skipped ==========
RAW Paste Data
Ledger Nano X - The secure hardware wallet
We use cookies for various purposes including analytics. By continuing to use Pastebin, you agree to our use of cookies as described in the Cookies Policy. OK, I Understand
Top