Need a unique gift idea?
A Pastebin account makes a great Christmas gift
SHARE
TWEET

error

a guest Aug 10th, 2018 71 Never
Upgrade to PRO!
ENDING IN00days00hours00mins00secs
 
  1. app:incrementalReleaseJavaCompilationSafeguard UP-TO-DATE
  2. :app:compileReleaseJavaWithJavac
  3. :app:compileReleaseJavaWithJavac - is not incremental (e.g. outputs have changed, no previous execution, etc.).
  4. /Users/User/Documents/Dev/reactnative/APPNAME/android/app/src/main/java/com/APPNAME/MainApplication.java:5: error: cannot find symbol
  5. import com.facebook.react.ReactApplication;
  6.                          ^
  7.   symbol:   class ReactApplication
  8.   location: package com.facebook.react
  9. /Users/User/Documents/Dev/reactnative/APPNAME/android/app/src/main/java/com/APPNAME/MainApplication.java:6: error: cannot find symbol
  10. import com.facebook.react.ReactNativeHost;
  11.                          ^
  12.   symbol:   class ReactNativeHost
  13.   location: package com.facebook.react
  14. /Users/User/Documents/Dev/reactnative/APPNAME/android/app/src/main/java/com/APPNAME/MainApplication.java:14: error: cannot find symbol
  15. public class MainApplication extends Application implements ReactApplication {
  16.                                                             ^
  17.   symbol: class ReactApplication
  18. /Users/User/Documents/Dev/reactnative/APPNAME/android/app/src/main/java/com/APPNAME/MainApplication.java:16: error: cannot find symbol
  19.   private final ReactNativeHost mReactNativeHost = new ReactNativeHost(this) {
  20.                 ^
  21.   symbol:   class ReactNativeHost
  22.   location: class MainApplication
  23. /Users/User/Documents/Dev/reactnative/APPNAME/android/app/src/main/java/com/APPNAME/MainApplication.java:36: error: cannot find symbol
  24.   public ReactNativeHost getReactNativeHost() {
  25.          ^
  26.   symbol:   class ReactNativeHost
  27.   location: class MainApplication
  28. /Users/User/Documents/Dev/reactnative/APPNAME/android/app/src/main/java/com/APPNAME/MainActivity.java:5: error: MainActivity is not abstractand does not override abstract method getPackages() in ReactActivity
  29. public class MainActivity extends ReactActivity {
  30.        ^
  31. /Users/User/Documents/Dev/reactnative/APPNAME/android/app/src/main/java/com/APPNAME/MainApplication.java:16: error: cannot find symbol
  32.   private final ReactNativeHost mReactNativeHost = new ReactNativeHost(this) {
  33.                                                        ^
  34.   symbol:   class ReactNativeHost
  35.   location: class MainApplication
  36. /Users/User/Documents/Dev/reactnative/APPNAME/android/app/src/main/java/com/APPNAME/MainApplication.java:35: error: method does not overrideor implement a method from a supertype
  37.   @Override
  38.   ^
  39. 8 errors
  40. :app:compileReleaseJavaWithJavac FAILED
  41.  
  42. FAILURE: Build failed with an exception.
  43.  
  44. * What went wrong:
  45. Execution failed for task ':app:compileReleaseJavaWithJavac'.
  46. > Compilation failed; see the compiler error output for details.
  47.  
  48. * Try:
  49. Run with --stacktrace option to get the stack trace. Run with --info or --debug option to get more log output.
  50.  
  51. BUILD FAILED
RAW Paste Data
We use cookies for various purposes including analytics. By continuing to use Pastebin, you agree to our use of cookies as described in the Cookies Policy. OK, I Understand
 
Top