SHARE
TWEET

Untitled

a guest Dec 15th, 2015 166 Never
Not a member of Pastebin yet? Sign Up, it unlocks many cool features!
  1. "C:\Program Files\Java\jdk1.8.0_65\bin\java" "-Dmaven.home=C:\Program Files (x86)\JetBrains\IntelliJ IDEA Community Edition 15.0.2\plugins\maven\lib\maven3" "-Dclassworlds.conf=C:\Program Files (x86)\JetBrains\IntelliJ IDEA Community Edition 15.0.2\plugins\maven\lib\maven3\bin\m2.conf" -Didea.launcher.port=7533 "-Didea.launcher.bin.path=C:\Program Files (x86)\JetBrains\IntelliJ IDEA Community Edition 15.0.2\bin" -Dfile.encoding=UTF-8 -classpath "C:\Program Files (x86)\JetBrains\IntelliJ IDEA Community Edition 15.0.2\plugins\maven\lib\maven3\boot\plexus-classworlds-2.4.jar;C:\Program Files (x86)\JetBrains\IntelliJ IDEA Community Edition 15.0.2\lib\idea_rt.jar" com.intellij.rt.execution.application.AppMain org.codehaus.classworlds.Launcher -Didea.version=15.0.2
  2. [INFO] Scanning for projects...
  3. [INFO] ------------------------------------------------------------------------
  4. [INFO] BUILD FAILURE
  5. [INFO] ------------------------------------------------------------------------
  6. [INFO] Total time: 0.166s
  7. [INFO] Finished at: Tue Dec 15 14:37:35 GMT 2015
  8. [INFO] Final Memory: 5M/184M
  9. [INFO] ------------------------------------------------------------------------
  10. [ERROR] No goals have been specified for this build. You must specify a valid lifecycle phase or a goal in the format <plugin-prefix>:<goal> or <plugin-group-id>:<plugin-artifact-id>[:<plugin-version>]:<goal>. Available lifecycle phases are: validate, initialize, generate-sources, process-sources, generate-resources, process-resources, compile, process-classes, generate-test-sources, process-test-sources, generate-test-resources, process-test-resources, test-compile, process-test-classes, test, prepare-package, package, pre-integration-test, integration-test, post-integration-test, verify, install, deploy, pre-clean, clean, post-clean, pre-site, site, post-site, site-deploy. -> [Help 1]
  11. [ERROR]
  12. [ERROR] To see the full stack trace of the errors, re-run Maven with the -e switch.
  13. [ERROR] Re-run Maven using the -X switch to enable full debug logging.
  14. [ERROR]
  15. [ERROR] For more information about the errors and possible solutions, please read the following articles:
  16. [ERROR] [Help 1] http://cwiki.apache.org/confluence/display/MAVEN/NoGoalSpecifiedException
  17.  
  18. Process finished with exit code 1
RAW Paste Data
We use cookies for various purposes including analytics. By continuing to use Pastebin, you agree to our use of cookies as described in the Cookies Policy. OK, I Understand
 
Top