Advertisement
Guest User

OpenMRS Error log1

a guest
Jul 25th, 2022
22
0
Never
Not a member of Pastebin yet? Sign Up, it unlocks many cool features!
Java 94.74 KB | None | 0 0
  1. [ERROR] Tests run: 8, Failures: 0, Errors: 8, Skipped: 0, Time elapsed: 0.065 s <<< FAILURE! - in org.openmrs.liquibase.CoreDataTunerTest
  2. [ERROR] shouldDetectThatSecondListDoesNotContainFirstList  Time elapsed: 0.019 s  <<< ERROR!
  3. org.dom4j.DocumentException: C:\Users\mahim\git2\openmrs-core\liquibase\target\test-classes\org%5copenmrs%5cliquibase%5csnapshots%5ccore-data%5cliquibase-core-data-SNAPSHOT.xml (The system cannot find the file specified)
  4.         at org.openmrs.liquibase.CoreDataTunerTest.setup(CoreDataTunerTest.java:63)
  5. Caused by: java.io.FileNotFoundException: C:\Users\mahim\git2\openmrs-core\liquibase\target\test-classes\org%5copenmrs%5cliquibase%5csnapshots%5ccore-data%5cliquibase-core-data-SNAPSHOT.xml (The system cannot find the file specified)
  6.         at org.openmrs.liquibase.CoreDataTunerTest.setup(CoreDataTunerTest.java:63)
  7.  
  8. [ERROR] shouldMergeTableNamesInTargetOrder  Time elapsed: 0.004 s  <<< ERROR!
  9. org.dom4j.DocumentException: C:\Users\mahim\git2\openmrs-core\liquibase\target\test-classes\org%5copenmrs%5cliquibase%5csnapshots%5ccore-data%5cliquibase-core-data-SNAPSHOT.xml (The system cannot find the file specified)
  10.         at org.openmrs.liquibase.CoreDataTunerTest.setup(CoreDataTunerTest.java:63)
  11. Caused by: java.io.FileNotFoundException: C:\Users\mahim\git2\openmrs-core\liquibase\target\test-classes\org%5copenmrs%5cliquibase%5csnapshots%5ccore-data%5cliquibase-core-data-SNAPSHOT.xml (The system cannot find the file specified)
  12.         at org.openmrs.liquibase.CoreDataTunerTest.setup(CoreDataTunerTest.java:63)
  13.  
  14. [ERROR] shouldCreateUpdatedChangeLogFile{Path}  Time elapsed: 0.005 s  <<< ERROR!
  15. org.dom4j.DocumentException: C:\Users\mahim\git2\openmrs-core\liquibase\target\test-classes\org%5copenmrs%5cliquibase%5csnapshots%5ccore-data%5cliquibase-core-data-SNAPSHOT.xml (The system cannot find the file specified)
  16.         at org.openmrs.liquibase.CoreDataTunerTest.setup(CoreDataTunerTest.java:63)
  17. Caused by: java.io.FileNotFoundException: C:\Users\mahim\git2\openmrs-core\liquibase\target\test-classes\org%5copenmrs%5cliquibase%5csnapshots%5ccore-data%5cliquibase-core-data-SNAPSHOT.xml (The system cannot find the file specified)
  18.         at org.openmrs.liquibase.CoreDataTunerTest.setup(CoreDataTunerTest.java:63)
  19.  
  20. [ERROR] shouldGetDatabaseChangeLogElement  Time elapsed: 0.004 s  <<< ERROR!
  21. org.dom4j.DocumentException: C:\Users\mahim\git2\openmrs-core\liquibase\target\test-classes\org%5copenmrs%5cliquibase%5csnapshots%5ccore-data%5cliquibase-core-data-SNAPSHOT.xml (The system cannot find the file specified)
  22.         at org.openmrs.liquibase.CoreDataTunerTest.setup(CoreDataTunerTest.java:63)
  23. Caused by: java.io.FileNotFoundException: C:\Users\mahim\git2\openmrs-core\liquibase\target\test-classes\org%5copenmrs%5cliquibase%5csnapshots%5ccore-data%5cliquibase-core-data-SNAPSHOT.xml (The system cannot find the file specified)
  24.         at org.openmrs.liquibase.CoreDataTunerTest.setup(CoreDataTunerTest.java:63)
  25.  
  26. [ERROR] shouldUpdateAdminUser  Time elapsed: 0.011 s  <<< ERROR!
  27. org.dom4j.DocumentException: C:\Users\mahim\git2\openmrs-core\liquibase\target\test-classes\org%5copenmrs%5cliquibase%5csnapshots%5ccore-data%5cliquibase-core-data-SNAPSHOT.xml (The system cannot find the file specified)
  28.         at org.openmrs.liquibase.CoreDataTunerTest.setup(CoreDataTunerTest.java:63)
  29. Caused by: java.io.FileNotFoundException: C:\Users\mahim\git2\openmrs-core\liquibase\target\test-classes\org%5copenmrs%5cliquibase%5csnapshots%5ccore-data%5cliquibase-core-data-SNAPSHOT.xml (The system cannot find the file specified)
  30.         at org.openmrs.liquibase.CoreDataTunerTest.setup(CoreDataTunerTest.java:63)
  31.  
  32. [ERROR] shouldDetachAndCacheChangeSets  Time elapsed: 0.002 s  <<< ERROR!
  33. org.dom4j.DocumentException: C:\Users\mahim\git2\openmrs-core\liquibase\target\test-classes\org%5copenmrs%5cliquibase%5csnapshots%5ccore-data%5cliquibase-core-data-SNAPSHOT.xml (The system cannot find the file specified)
  34.         at org.openmrs.liquibase.CoreDataTunerTest.setup(CoreDataTunerTest.java:63)
  35. Caused by: java.io.FileNotFoundException: C:\Users\mahim\git2\openmrs-core\liquibase\target\test-classes\org%5copenmrs%5cliquibase%5csnapshots%5ccore-data%5cliquibase-core-data-SNAPSHOT.xml (The system cannot find the file specified)
  36.         at org.openmrs.liquibase.CoreDataTunerTest.setup(CoreDataTunerTest.java:63)
  37.  
  38. [ERROR] shouldAddChangeSets  Time elapsed: 0.004 s  <<< ERROR!
  39. org.dom4j.DocumentException: C:\Users\mahim\git2\openmrs-core\liquibase\target\test-classes\org%5copenmrs%5cliquibase%5csnapshots%5ccore-data%5cliquibase-core-data-SNAPSHOT.xml (The system cannot find the file specified)
  40.         at org.openmrs.liquibase.CoreDataTunerTest.setup(CoreDataTunerTest.java:63)
  41. Caused by: java.io.FileNotFoundException: C:\Users\mahim\git2\openmrs-core\liquibase\target\test-classes\org%5copenmrs%5cliquibase%5csnapshots%5ccore-data%5cliquibase-core-data-SNAPSHOT.xml (The system cannot find the file specified)
  42.         at org.openmrs.liquibase.CoreDataTunerTest.setup(CoreDataTunerTest.java:63)
  43.  
  44. [ERROR] shouldGetTableNames  Time elapsed: 0.007 s  <<< ERROR!
  45. org.dom4j.DocumentException: C:\Users\mahim\git2\openmrs-core\liquibase\target\test-classes\org%5copenmrs%5cliquibase%5csnapshots%5ccore-data%5cliquibase-core-data-SNAPSHOT.xml (The system cannot find the file specified)
  46.         at org.openmrs.liquibase.CoreDataTunerTest.setup(CoreDataTunerTest.java:63)
  47. Caused by: java.io.FileNotFoundException: C:\Users\mahim\git2\openmrs-core\liquibase\target\test-classes\org%5copenmrs%5cliquibase%5csnapshots%5ccore-data%5cliquibase-core-data-SNAPSHOT.xml (The system cannot find the file specified)
  48.         at org.openmrs.liquibase.CoreDataTunerTest.setup(CoreDataTunerTest.java:63)
  49.  
  50. [INFO] Running org.openmrs.liquibase.MainTest
  51. [INFO] Tests run: 1, Failures: 0, Errors: 0, Skipped: 0, Time elapsed: 0.541 s - in org.openmrs.liquibase.MainTest
  52. [INFO] Running org.openmrs.liquibase.SchemaOnlyTunerTest
  53. ERROR - AbstractSnapshotTuner.readChangeLogResource(168) |2022-07-23T16:35:05,418| processing the resource '{}' raised an exception
  54. org.dom4j.DocumentException: C:\Users\mahim\git2\openmrs-core\liquibase\target\test-classes\org%5copenmrs%5cliquibase%5csnapshots%5cschema-only%5cliquibase-schema-only-SNAPSHOT.xml (The system cannot find the file specified)
  55.         at org.dom4j.io.SAXReader.read(SAXReader.java:327) ~[dom4j-2.1.3.jar:?]
  56.         at org.openmrs.liquibase.AbstractSnapshotTuner.readChangeLogResource(AbstractSnapshotTuner.java:165) ~[classes/:?]
  57.         at org.openmrs.liquibase.SchemaOnlyTunerTest.setup(SchemaOnlyTunerTest.java:57) ~[test-classes/:?]
  58.         at sun.reflect.NativeMethodAccessorImpl.invoke0(Native Method) ~[?:1.8.0_202]
  59.         at sun.reflect.NativeMethodAccessorImpl.invoke(NativeMethodAccessorImpl.java:62) ~[?:1.8.0_202]
  60.         at sun.reflect.DelegatingMethodAccessorImpl.invoke(DelegatingMethodAccessorImpl.java:43) ~[?:1.8.0_202]
  61.         at java.lang.reflect.Method.invoke(Method.java:498) ~[?:1.8.0_202]
  62.         at org.junit.platform.commons.util.ReflectionUtils.invokeMethod(ReflectionUtils.java:725) ~[junit-platform-commons-1.8.2.jar:1.8.2]
  63.         at org.junit.jupiter.engine.execution.MethodInvocation.proceed(MethodInvocation.java:60) ~[junit-jupiter-engine-5.8.2.jar:5.8.2]
  64.         at org.junit.jupiter.engine.execution.InvocationInterceptorChain$ValidatingInvocation.proceed(InvocationInterceptorChain.java:131) ~[junit-jupiter-engine-5.8.2.jar:5.8.2]
  65.         at org.junit.jupiter.engine.extension.TimeoutExtension.intercept(TimeoutExtension.java:149) ~[junit-jupiter-engine-5.8.2.jar:5.8.2]
  66.         at org.junit.jupiter.engine.extension.TimeoutExtension.interceptLifecycleMethod(TimeoutExtension.java:126) ~[junit-jupiter-engine-5.8.2.jar:5.8.2]
  67.         at org.junit.jupiter.engine.extension.TimeoutExtension.interceptBeforeEachMethod(TimeoutExtension.java:76) ~[junit-jupiter-engine-5.8.2.jar:5.8.2]
  68.         at org.junit.jupiter.engine.execution.ExecutableInvoker$ReflectiveInterceptorCall.lambda$ofVoidMethod$0(ExecutableInvoker.java:115) ~[junit-jupiter-engine-5.8.2.jar:5.8.2]
  69.         at org.junit.jupiter.engine.execution.ExecutableInvoker.lambda$invoke$0(ExecutableInvoker.java:105) ~[junit-jupiter-engine-5.8.2.jar:5.8.2]
  70.         at org.junit.jupiter.engine.execution.InvocationInterceptorChain$InterceptedInvocation.proceed(InvocationInterceptorChain.java:106) ~[junit-jupiter-engine-5.8.2.jar:5.8.2]
  71.         at org.junit.jupiter.engine.execution.InvocationInterceptorChain.proceed(InvocationInterceptorChain.java:64) ~[junit-jupiter-engine-5.8.2.jar:5.8.2]
  72.         at org.junit.jupiter.engine.execution.InvocationInterceptorChain.chainAndInvoke(InvocationInterceptorChain.java:45) ~[junit-jupiter-engine-5.8.2.jar:5.8.2]
  73.         at org.junit.jupiter.engine.execution.InvocationInterceptorChain.invoke(InvocationInterceptorChain.java:37) ~[junit-jupiter-engine-5.8.2.jar:5.8.2]
  74.         at org.junit.jupiter.engine.execution.ExecutableInvoker.invoke(ExecutableInvoker.java:104) ~[junit-jupiter-engine-5.8.2.jar:5.8.2]
  75.         at org.junit.jupiter.engine.execution.ExecutableInvoker.invoke(ExecutableInvoker.java:98) ~[junit-jupiter-engine-5.8.2.jar:5.8.2]
  76.         at org.junit.jupiter.engine.descriptor.ClassBasedTestDescriptor.invokeMethodInExtensionContext(ClassBasedTestDescriptor.java:506) ~[junit-jupiter-engine-5.8.2.jar:5.8.2]
  77.         at org.junit.jupiter.engine.descriptor.ClassBasedTestDescriptor.lambda$synthesizeBeforeEachMethodAdapter$21(ClassBasedTestDescriptor.java:491) ~[junit-jupiter-engine-5.8.2.jar:5.8.2]
  78.         at org.junit.jupiter.engine.descriptor.TestMethodTestDescriptor.lambda$invokeBeforeEachMethods$3(TestMethodTestDescriptor.java:171) ~[junit-jupiter-engine-5.8.2.jar:5.8.2]
  79.         at org.junit.jupiter.engine.descriptor.TestMethodTestDescriptor.lambda$invokeBeforeMethodsOrCallbacksUntilExceptionOccurs$6(TestMethodTestDescriptor.java:199) ~[junit-jupiter-engine-5.8.2.jar:5.8.2]
  80.         at org.junit.platform.engine.support.hierarchical.ThrowableCollector.execute(ThrowableCollector.java:73) ~[junit-platform-engine-1.8.2.jar:1.8.2]
  81.         at org.junit.jupiter.engine.descriptor.TestMethodTestDescriptor.invokeBeforeMethodsOrCallbacksUntilExceptionOccurs(TestMethodTestDescriptor.java:199) ~[junit-jupiter-engine-5.8.2.jar:5.8.2]
  82.         at org.junit.jupiter.engine.descriptor.TestMethodTestDescriptor.invokeBeforeEachMethods(TestMethodTestDescriptor.java:168) ~[junit-jupiter-engine-5.8.2.jar:5.8.2]
  83.         at org.junit.jupiter.engine.descriptor.TestMethodTestDescriptor.execute(TestMethodTestDescriptor.java:131) ~[junit-jupiter-engine-5.8.2.jar:5.8.2]
  84.         at org.junit.jupiter.engine.descriptor.TestMethodTestDescriptor.execute(TestMethodTestDescriptor.java:66) ~[junit-jupiter-engine-5.8.2.jar:5.8.2]
  85.         at org.junit.platform.engine.support.hierarchical.NodeTestTask.lambda$executeRecursively$6(NodeTestTask.java:151) ~[junit-platform-engine-1.8.2.jar:1.8.2]
  86.         at org.junit.platform.engine.support.hierarchical.ThrowableCollector.execute(ThrowableCollector.java:73) ~[junit-platform-engine-1.8.2.jar:1.8.2]
  87.         at org.junit.platform.engine.support.hierarchical.NodeTestTask.lambda$executeRecursively$8(NodeTestTask.java:141) ~[junit-platform-engine-1.8.2.jar:1.8.2]
  88.         at org.junit.platform.engine.support.hierarchical.Node.around(Node.java:137) ~[junit-platform-engine-1.8.2.jar:1.8.2]
  89.         at org.junit.platform.engine.support.hierarchical.NodeTestTask.lambda$executeRecursively$9(NodeTestTask.java:139) ~[junit-platform-engine-1.8.2.jar:1.8.2]
  90.         at org.junit.platform.engine.support.hierarchical.ThrowableCollector.execute(ThrowableCollector.java:73) ~[junit-platform-engine-1.8.2.jar:1.8.2]
  91.         at org.junit.platform.engine.support.hierarchical.NodeTestTask.executeRecursively(NodeTestTask.java:138) ~[junit-platform-engine-1.8.2.jar:1.8.2]
  92.         at org.junit.platform.engine.support.hierarchical.NodeTestTask.execute(NodeTestTask.java:95) ~[junit-platform-engine-1.8.2.jar:1.8.2]
  93.         at java.util.ArrayList.forEach(ArrayList.java:1257) ~[?:1.8.0_202]
  94.         at org.junit.platform.engine.support.hierarchical.SameThreadHierarchicalTestExecutorService.invokeAll(SameThreadHierarchicalTestExecutorService.java:41) ~[junit-platform-engine-1.8.2.jar:1.8.2]
  95.         at org.junit.platform.engine.support.hierarchical.NodeTestTask.lambda$executeRecursively$6(NodeTestTask.java:155) ~[junit-platform-engine-1.8.2.jar:1.8.2]
  96.         at org.junit.platform.engine.support.hierarchical.ThrowableCollector.execute(ThrowableCollector.java:73) ~[junit-platform-engine-1.8.2.jar:1.8.2]
  97.         at org.junit.platform.engine.support.hierarchical.NodeTestTask.lambda$executeRecursively$8(NodeTestTask.java:141) ~[junit-platform-engine-1.8.2.jar:1.8.2]
  98.         at org.junit.platform.engine.support.hierarchical.Node.around(Node.java:137) ~[junit-platform-engine-1.8.2.jar:1.8.2]
  99.         at org.junit.platform.engine.support.hierarchical.NodeTestTask.lambda$executeRecursively$9(NodeTestTask.java:139) ~[junit-platform-engine-1.8.2.jar:1.8.2]
  100.         at org.junit.platform.engine.support.hierarchical.ThrowableCollector.execute(ThrowableCollector.java:73) ~[junit-platform-engine-1.8.2.jar:1.8.2]
  101.         at org.junit.platform.engine.support.hierarchical.NodeTestTask.executeRecursively(NodeTestTask.java:138) ~[junit-platform-engine-1.8.2.jar:1.8.2]
  102.         at org.junit.platform.engine.support.hierarchical.NodeTestTask.execute(NodeTestTask.java:95) ~[junit-platform-engine-1.8.2.jar:1.8.2]
  103.         at java.util.ArrayList.forEach(ArrayList.java:1257) ~[?:1.8.0_202]
  104.         at org.junit.platform.engine.support.hierarchical.SameThreadHierarchicalTestExecutorService.invokeAll(SameThreadHierarchicalTestExecutorService.java:41) ~[junit-platform-engine-1.8.2.jar:1.8.2]
  105.         at org.junit.platform.engine.support.hierarchical.NodeTestTask.lambda$executeRecursively$6(NodeTestTask.java:155) ~[junit-platform-engine-1.8.2.jar:1.8.2]
  106.         at org.junit.platform.engine.support.hierarchical.ThrowableCollector.execute(ThrowableCollector.java:73) ~[junit-platform-engine-1.8.2.jar:1.8.2]
  107.         at org.junit.platform.engine.support.hierarchical.NodeTestTask.lambda$executeRecursively$8(NodeTestTask.java:141) ~[junit-platform-engine-1.8.2.jar:1.8.2]
  108.         at org.junit.platform.engine.support.hierarchical.Node.around(Node.java:137) ~[junit-platform-engine-1.8.2.jar:1.8.2]
  109.         at org.junit.platform.engine.support.hierarchical.NodeTestTask.lambda$executeRecursively$9(NodeTestTask.java:139) ~[junit-platform-engine-1.8.2.jar:1.8.2]
  110.         at org.junit.platform.engine.support.hierarchical.ThrowableCollector.execute(ThrowableCollector.java:73) ~[junit-platform-engine-1.8.2.jar:1.8.2]
  111.         at org.junit.platform.engine.support.hierarchical.NodeTestTask.executeRecursively(NodeTestTask.java:138) ~[junit-platform-engine-1.8.2.jar:1.8.2]
  112.         at org.junit.platform.engine.support.hierarchical.NodeTestTask.execute(NodeTestTask.java:95) ~[junit-platform-engine-1.8.2.jar:1.8.2]
  113.         at org.junit.platform.engine.support.hierarchical.SameThreadHierarchicalTestExecutorService.submit(SameThreadHierarchicalTestExecutorService.java:35) ~[junit-platform-engine-1.8.2.jar:1.8.2]
  114.         at org.junit.platform.engine.support.hierarchical.HierarchicalTestExecutor.execute(HierarchicalTestExecutor.java:57) ~[junit-platform-engine-1.8.2.jar:1.8.2]
  115.         at org.junit.platform.engine.support.hierarchical.HierarchicalTestEngine.execute(HierarchicalTestEngine.java:54) ~[junit-platform-engine-1.8.2.jar:1.8.2]
  116.         at org.junit.platform.launcher.core.DefaultLauncher.execute(DefaultLauncher.java:220) ~[junit-platform-launcher-1.3.1.jar:1.3.1]
  117.         at org.junit.platform.launcher.core.DefaultLauncher.lambda$execute$6(DefaultLauncher.java:188) ~[junit-platform-launcher-1.3.1.jar:1.3.1]
  118.         at org.junit.platform.launcher.core.DefaultLauncher.withInterceptedStreams(DefaultLauncher.java:202) ~[junit-platform-launcher-1.3.1.jar:1.3.1]
  119.         at org.junit.platform.launcher.core.DefaultLauncher.execute(DefaultLauncher.java:181) ~[junit-platform-launcher-1.3.1.jar:1.3.1]
  120.         at org.junit.platform.launcher.core.DefaultLauncher.execute(DefaultLauncher.java:128) ~[junit-platform-launcher-1.3.1.jar:1.3.1]
  121.         at org.apache.maven.surefire.junitplatform.JUnitPlatformProvider.invokeAllTests(JUnitPlatformProvider.java:150) ~[surefire-junit-platform-2.22.2.jar:2.22.2]
  122.         at org.apache.maven.surefire.junitplatform.JUnitPlatformProvider.invoke(JUnitPlatformProvider.java:124) ~[surefire-junit-platform-2.22.2.jar:2.22.2]
  123.         at org.apache.maven.surefire.booter.ForkedBooter.invokeProviderInSameClassLoader(ForkedBooter.java:384) ~[surefire-booter-2.22.2.jar:2.22.2]
  124.         at org.apache.maven.surefire.booter.ForkedBooter.runSuitesInProcess(ForkedBooter.java:345) ~[surefire-booter-2.22.2.jar:2.22.2]
  125.         at org.apache.maven.surefire.booter.ForkedBooter.execute(ForkedBooter.java:126) ~[surefire-booter-2.22.2.jar:2.22.2]
  126.         at org.apache.maven.surefire.booter.ForkedBooter.main(ForkedBooter.java:418) ~[surefire-booter-2.22.2.jar:2.22.2]
  127. Caused by: java.io.FileNotFoundException: C:\Users\mahim\git2\openmrs-core\liquibase\target\test-classes\org%5copenmrs%5cliquibase%5csnapshots%5cschema-only%5cliquibase-schema-only-SNAPSHOT.xml (The system cannot find the file specified)
  128.         at java.io.FileInputStream.open0(Native Method) ~[?:1.8.0_202]
  129.         at java.io.FileInputStream.open(FileInputStream.java:195) ~[?:1.8.0_202]
  130.         at java.io.FileInputStream.<init>(FileInputStream.java:138) ~[?:1.8.0_202]
  131.         at org.dom4j.io.SAXReader.read(SAXReader.java:304) ~[dom4j-2.1.3.jar:?]
  132.         ... 71 more
  133. ERROR - AbstractSnapshotTuner.readChangeLogResource(168) |2022-07-23T16:35:05,421| processing the resource '{}' raised an exception
  134. org.dom4j.DocumentException: C:\Users\mahim\git2\openmrs-core\liquibase\target\test-classes\org%5copenmrs%5cliquibase%5csnapshots%5cschema-only%5cliquibase-schema-only-SNAPSHOT.xml (The system cannot find the file specified)
  135.         at org.dom4j.io.SAXReader.read(SAXReader.java:327) ~[dom4j-2.1.3.jar:?]
  136.         at org.openmrs.liquibase.AbstractSnapshotTuner.readChangeLogResource(AbstractSnapshotTuner.java:165) ~[classes/:?]
  137.         at org.openmrs.liquibase.SchemaOnlyTunerTest.setup(SchemaOnlyTunerTest.java:57) ~[test-classes/:?]
  138.         at sun.reflect.NativeMethodAccessorImpl.invoke0(Native Method) ~[?:1.8.0_202]
  139.         at sun.reflect.NativeMethodAccessorImpl.invoke(NativeMethodAccessorImpl.java:62) ~[?:1.8.0_202]
  140.         at sun.reflect.DelegatingMethodAccessorImpl.invoke(DelegatingMethodAccessorImpl.java:43) ~[?:1.8.0_202]
  141.         at java.lang.reflect.Method.invoke(Method.java:498) ~[?:1.8.0_202]
  142.         at org.junit.platform.commons.util.ReflectionUtils.invokeMethod(ReflectionUtils.java:725) ~[junit-platform-commons-1.8.2.jar:1.8.2]
  143.         at org.junit.jupiter.engine.execution.MethodInvocation.proceed(MethodInvocation.java:60) ~[junit-jupiter-engine-5.8.2.jar:5.8.2]
  144.         at org.junit.jupiter.engine.execution.InvocationInterceptorChain$ValidatingInvocation.proceed(InvocationInterceptorChain.java:131) ~[junit-jupiter-engine-5.8.2.jar:5.8.2]
  145.         at org.junit.jupiter.engine.extension.TimeoutExtension.intercept(TimeoutExtension.java:149) ~[junit-jupiter-engine-5.8.2.jar:5.8.2]
  146.         at org.junit.jupiter.engine.extension.TimeoutExtension.interceptLifecycleMethod(TimeoutExtension.java:126) ~[junit-jupiter-engine-5.8.2.jar:5.8.2]
  147.         at org.junit.jupiter.engine.extension.TimeoutExtension.interceptBeforeEachMethod(TimeoutExtension.java:76) ~[junit-jupiter-engine-5.8.2.jar:5.8.2]
  148.         at org.junit.jupiter.engine.execution.ExecutableInvoker$ReflectiveInterceptorCall.lambda$ofVoidMethod$0(ExecutableInvoker.java:115) ~[junit-jupiter-engine-5.8.2.jar:5.8.2]
  149.         at org.junit.jupiter.engine.execution.ExecutableInvoker.lambda$invoke$0(ExecutableInvoker.java:105) ~[junit-jupiter-engine-5.8.2.jar:5.8.2]
  150.         at org.junit.jupiter.engine.execution.InvocationInterceptorChain$InterceptedInvocation.proceed(InvocationInterceptorChain.java:106) ~[junit-jupiter-engine-5.8.2.jar:5.8.2]
  151.         at org.junit.jupiter.engine.execution.InvocationInterceptorChain.proceed(InvocationInterceptorChain.java:64) ~[junit-jupiter-engine-5.8.2.jar:5.8.2]
  152.         at org.junit.jupiter.engine.execution.InvocationInterceptorChain.chainAndInvoke(InvocationInterceptorChain.java:45) ~[junit-jupiter-engine-5.8.2.jar:5.8.2]
  153.         at org.junit.jupiter.engine.execution.InvocationInterceptorChain.invoke(InvocationInterceptorChain.java:37) ~[junit-jupiter-engine-5.8.2.jar:5.8.2]
  154.         at org.junit.jupiter.engine.execution.ExecutableInvoker.invoke(ExecutableInvoker.java:104) ~[junit-jupiter-engine-5.8.2.jar:5.8.2]
  155.         at org.junit.jupiter.engine.execution.ExecutableInvoker.invoke(ExecutableInvoker.java:98) ~[junit-jupiter-engine-5.8.2.jar:5.8.2]
  156.         at org.junit.jupiter.engine.descriptor.ClassBasedTestDescriptor.invokeMethodInExtensionContext(ClassBasedTestDescriptor.java:506) ~[junit-jupiter-engine-5.8.2.jar:5.8.2]
  157.         at org.junit.jupiter.engine.descriptor.ClassBasedTestDescriptor.lambda$synthesizeBeforeEachMethodAdapter$21(ClassBasedTestDescriptor.java:491) ~[junit-jupiter-engine-5.8.2.jar:5.8.2]
  158.         at org.junit.jupiter.engine.descriptor.TestMethodTestDescriptor.lambda$invokeBeforeEachMethods$3(TestMethodTestDescriptor.java:171) ~[junit-jupiter-engine-5.8.2.jar:5.8.2]
  159.         at org.junit.jupiter.engine.descriptor.TestMethodTestDescriptor.lambda$invokeBeforeMethodsOrCallbacksUntilExceptionOccurs$6(TestMethodTestDescriptor.java:199) ~[junit-jupiter-engine-5.8.2.jar:5.8.2]
  160.         at org.junit.platform.engine.support.hierarchical.ThrowableCollector.execute(ThrowableCollector.java:73) ~[junit-platform-engine-1.8.2.jar:1.8.2]
  161.         at org.junit.jupiter.engine.descriptor.TestMethodTestDescriptor.invokeBeforeMethodsOrCallbacksUntilExceptionOccurs(TestMethodTestDescriptor.java:199) ~[junit-jupiter-engine-5.8.2.jar:5.8.2]
  162.         at org.junit.jupiter.engine.descriptor.TestMethodTestDescriptor.invokeBeforeEachMethods(TestMethodTestDescriptor.java:168) ~[junit-jupiter-engine-5.8.2.jar:5.8.2]
  163.         at org.junit.jupiter.engine.descriptor.TestMethodTestDescriptor.execute(TestMethodTestDescriptor.java:131) ~[junit-jupiter-engine-5.8.2.jar:5.8.2]
  164.         at org.junit.jupiter.engine.descriptor.TestMethodTestDescriptor.execute(TestMethodTestDescriptor.java:66) ~[junit-jupiter-engine-5.8.2.jar:5.8.2]
  165.         at org.junit.platform.engine.support.hierarchical.NodeTestTask.lambda$executeRecursively$6(NodeTestTask.java:151) ~[junit-platform-engine-1.8.2.jar:1.8.2]
  166.         at org.junit.platform.engine.support.hierarchical.ThrowableCollector.execute(ThrowableCollector.java:73) ~[junit-platform-engine-1.8.2.jar:1.8.2]
  167.         at org.junit.platform.engine.support.hierarchical.NodeTestTask.lambda$executeRecursively$8(NodeTestTask.java:141) ~[junit-platform-engine-1.8.2.jar:1.8.2]
  168.         at org.junit.platform.engine.support.hierarchical.Node.around(Node.java:137) ~[junit-platform-engine-1.8.2.jar:1.8.2]
  169.         at org.junit.platform.engine.support.hierarchical.NodeTestTask.lambda$executeRecursively$9(NodeTestTask.java:139) ~[junit-platform-engine-1.8.2.jar:1.8.2]
  170.         at org.junit.platform.engine.support.hierarchical.ThrowableCollector.execute(ThrowableCollector.java:73) ~[junit-platform-engine-1.8.2.jar:1.8.2]
  171.         at org.junit.platform.engine.support.hierarchical.NodeTestTask.executeRecursively(NodeTestTask.java:138) ~[junit-platform-engine-1.8.2.jar:1.8.2]
  172.         at org.junit.platform.engine.support.hierarchical.NodeTestTask.execute(NodeTestTask.java:95) ~[junit-platform-engine-1.8.2.jar:1.8.2]
  173.         at java.util.ArrayList.forEach(ArrayList.java:1257) ~[?:1.8.0_202]
  174.         at org.junit.platform.engine.support.hierarchical.SameThreadHierarchicalTestExecutorService.invokeAll(SameThreadHierarchicalTestExecutorService.java:41) ~[junit-platform-engine-1.8.2.jar:1.8.2]
  175.         at org.junit.platform.engine.support.hierarchical.NodeTestTask.lambda$executeRecursively$6(NodeTestTask.java:155) ~[junit-platform-engine-1.8.2.jar:1.8.2]
  176.         at org.junit.platform.engine.support.hierarchical.ThrowableCollector.execute(ThrowableCollector.java:73) ~[junit-platform-engine-1.8.2.jar:1.8.2]
  177.         at org.junit.platform.engine.support.hierarchical.NodeTestTask.lambda$executeRecursively$8(NodeTestTask.java:141) ~[junit-platform-engine-1.8.2.jar:1.8.2]
  178.         at org.junit.platform.engine.support.hierarchical.Node.around(Node.java:137) ~[junit-platform-engine-1.8.2.jar:1.8.2]
  179.         at org.junit.platform.engine.support.hierarchical.NodeTestTask.lambda$executeRecursively$9(NodeTestTask.java:139) ~[junit-platform-engine-1.8.2.jar:1.8.2]
  180.         at org.junit.platform.engine.support.hierarchical.ThrowableCollector.execute(ThrowableCollector.java:73) ~[junit-platform-engine-1.8.2.jar:1.8.2]
  181.         at org.junit.platform.engine.support.hierarchical.NodeTestTask.executeRecursively(NodeTestTask.java:138) ~[junit-platform-engine-1.8.2.jar:1.8.2]
  182.         at org.junit.platform.engine.support.hierarchical.NodeTestTask.execute(NodeTestTask.java:95) ~[junit-platform-engine-1.8.2.jar:1.8.2]
  183.         at java.util.ArrayList.forEach(ArrayList.java:1257) ~[?:1.8.0_202]
  184.         at org.junit.platform.engine.support.hierarchical.SameThreadHierarchicalTestExecutorService.invokeAll(SameThreadHierarchicalTestExecutorService.java:41) ~[junit-platform-engine-1.8.2.jar:1.8.2]
  185.         at org.junit.platform.engine.support.hierarchical.NodeTestTask.lambda$executeRecursively$6(NodeTestTask.java:155) ~[junit-platform-engine-1.8.2.jar:1.8.2]
  186.         at org.junit.platform.engine.support.hierarchical.ThrowableCollector.execute(ThrowableCollector.java:73) ~[junit-platform-engine-1.8.2.jar:1.8.2]
  187.         at org.junit.platform.engine.support.hierarchical.NodeTestTask.lambda$executeRecursively$8(NodeTestTask.java:141) ~[junit-platform-engine-1.8.2.jar:1.8.2]
  188.         at org.junit.platform.engine.support.hierarchical.Node.around(Node.java:137) ~[junit-platform-engine-1.8.2.jar:1.8.2]
  189.         at org.junit.platform.engine.support.hierarchical.NodeTestTask.lambda$executeRecursively$9(NodeTestTask.java:139) ~[junit-platform-engine-1.8.2.jar:1.8.2]
  190.         at org.junit.platform.engine.support.hierarchical.ThrowableCollector.execute(ThrowableCollector.java:73) ~[junit-platform-engine-1.8.2.jar:1.8.2]
  191.         at org.junit.platform.engine.support.hierarchical.NodeTestTask.executeRecursively(NodeTestTask.java:138) ~[junit-platform-engine-1.8.2.jar:1.8.2]
  192.         at org.junit.platform.engine.support.hierarchical.NodeTestTask.execute(NodeTestTask.java:95) ~[junit-platform-engine-1.8.2.jar:1.8.2]
  193.         at org.junit.platform.engine.support.hierarchical.SameThreadHierarchicalTestExecutorService.submit(SameThreadHierarchicalTestExecutorService.java:35) ~[junit-platform-engine-1.8.2.jar:1.8.2]
  194.         at org.junit.platform.engine.support.hierarchical.HierarchicalTestExecutor.execute(HierarchicalTestExecutor.java:57) ~[junit-platform-engine-1.8.2.jar:1.8.2]
  195.         at org.junit.platform.engine.support.hierarchical.HierarchicalTestEngine.execute(HierarchicalTestEngine.java:54) ~[junit-platform-engine-1.8.2.jar:1.8.2]
  196.         at org.junit.platform.launcher.core.DefaultLauncher.execute(DefaultLauncher.java:220) ~[junit-platform-launcher-1.3.1.jar:1.3.1]
  197.         at org.junit.platform.launcher.core.DefaultLauncher.lambda$execute$6(DefaultLauncher.java:188) ~[junit-platform-launcher-1.3.1.jar:1.3.1]
  198.         at org.junit.platform.launcher.core.DefaultLauncher.withInterceptedStreams(DefaultLauncher.java:202) ~[junit-platform-launcher-1.3.1.jar:1.3.1]
  199.         at org.junit.platform.launcher.core.DefaultLauncher.execute(DefaultLauncher.java:181) ~[junit-platform-launcher-1.3.1.jar:1.3.1]
  200.         at org.junit.platform.launcher.core.DefaultLauncher.execute(DefaultLauncher.java:128) ~[junit-platform-launcher-1.3.1.jar:1.3.1]
  201.         at org.apache.maven.surefire.junitplatform.JUnitPlatformProvider.invokeAllTests(JUnitPlatformProvider.java:150) ~[surefire-junit-platform-2.22.2.jar:2.22.2]
  202.         at org.apache.maven.surefire.junitplatform.JUnitPlatformProvider.invoke(JUnitPlatformProvider.java:124) ~[surefire-junit-platform-2.22.2.jar:2.22.2]
  203.         at org.apache.maven.surefire.booter.ForkedBooter.invokeProviderInSameClassLoader(ForkedBooter.java:384) ~[surefire-booter-2.22.2.jar:2.22.2]
  204.         at org.apache.maven.surefire.booter.ForkedBooter.runSuitesInProcess(ForkedBooter.java:345) ~[surefire-booter-2.22.2.jar:2.22.2]
  205.         at org.apache.maven.surefire.booter.ForkedBooter.execute(ForkedBooter.java:126) ~[surefire-booter-2.22.2.jar:2.22.2]
  206.         at org.apache.maven.surefire.booter.ForkedBooter.main(ForkedBooter.java:418) ~[surefire-booter-2.22.2.jar:2.22.2]
  207. Caused by: java.io.FileNotFoundException: C:\Users\mahim\git2\openmrs-core\liquibase\target\test-classes\org%5copenmrs%5cliquibase%5csnapshots%5cschema-only%5cliquibase-schema-only-SNAPSHOT.xml (The system cannot find the file specified)
  208.         at java.io.FileInputStream.open0(Native Method) ~[?:1.8.0_202]
  209.         at java.io.FileInputStream.open(FileInputStream.java:195) ~[?:1.8.0_202]
  210.         at java.io.FileInputStream.<init>(FileInputStream.java:138) ~[?:1.8.0_202]
  211.         at org.dom4j.io.SAXReader.read(SAXReader.java:304) ~[dom4j-2.1.3.jar:?]
  212.         ... 71 more
  213. ERROR - AbstractSnapshotTuner.readChangeLogResource(168) |2022-07-23T16:35:05,426| processing the resource '{}' raised an exception
  214. org.dom4j.DocumentException: C:\Users\mahim\git2\openmrs-core\liquibase\target\test-classes\org%5copenmrs%5cliquibase%5csnapshots%5cschema-only%5cliquibase-schema-only-SNAPSHOT.xml (The system cannot find the file specified)
  215.         at org.dom4j.io.SAXReader.read(SAXReader.java:327) ~[dom4j-2.1.3.jar:?]
  216.         at org.openmrs.liquibase.AbstractSnapshotTuner.readChangeLogResource(AbstractSnapshotTuner.java:165) ~[classes/:?]
  217.         at org.openmrs.liquibase.SchemaOnlyTunerTest.setup(SchemaOnlyTunerTest.java:57) ~[test-classes/:?]
  218.         at sun.reflect.NativeMethodAccessorImpl.invoke0(Native Method) ~[?:1.8.0_202]
  219.         at sun.reflect.NativeMethodAccessorImpl.invoke(NativeMethodAccessorImpl.java:62) ~[?:1.8.0_202]
  220.         at sun.reflect.DelegatingMethodAccessorImpl.invoke(DelegatingMethodAccessorImpl.java:43) ~[?:1.8.0_202]
  221.         at java.lang.reflect.Method.invoke(Method.java:498) ~[?:1.8.0_202]
  222.         at org.junit.platform.commons.util.ReflectionUtils.invokeMethod(ReflectionUtils.java:725) ~[junit-platform-commons-1.8.2.jar:1.8.2]
  223.         at org.junit.jupiter.engine.execution.MethodInvocation.proceed(MethodInvocation.java:60) ~[junit-jupiter-engine-5.8.2.jar:5.8.2]
  224.         at org.junit.jupiter.engine.execution.InvocationInterceptorChain$ValidatingInvocation.proceed(InvocationInterceptorChain.java:131) ~[junit-jupiter-engine-5.8.2.jar:5.8.2]
  225.         at org.junit.jupiter.engine.extension.TimeoutExtension.intercept(TimeoutExtension.java:149) ~[junit-jupiter-engine-5.8.2.jar:5.8.2]
  226.         at org.junit.jupiter.engine.extension.TimeoutExtension.interceptLifecycleMethod(TimeoutExtension.java:126) ~[junit-jupiter-engine-5.8.2.jar:5.8.2]
  227.         at org.junit.jupiter.engine.extension.TimeoutExtension.interceptBeforeEachMethod(TimeoutExtension.java:76) ~[junit-jupiter-engine-5.8.2.jar:5.8.2]
  228.         at org.junit.jupiter.engine.execution.ExecutableInvoker$ReflectiveInterceptorCall.lambda$ofVoidMethod$0(ExecutableInvoker.java:115) ~[junit-jupiter-engine-5.8.2.jar:5.8.2]
  229.         at org.junit.jupiter.engine.execution.ExecutableInvoker.lambda$invoke$0(ExecutableInvoker.java:105) ~[junit-jupiter-engine-5.8.2.jar:5.8.2]
  230.         at org.junit.jupiter.engine.execution.InvocationInterceptorChain$InterceptedInvocation.proceed(InvocationInterceptorChain.java:106) ~[junit-jupiter-engine-5.8.2.jar:5.8.2]
  231.         at org.junit.jupiter.engine.execution.InvocationInterceptorChain.proceed(InvocationInterceptorChain.java:64) ~[junit-jupiter-engine-5.8.2.jar:5.8.2]
  232.         at org.junit.jupiter.engine.execution.InvocationInterceptorChain.chainAndInvoke(InvocationInterceptorChain.java:45) ~[junit-jupiter-engine-5.8.2.jar:5.8.2]
  233.         at org.junit.jupiter.engine.execution.InvocationInterceptorChain.invoke(InvocationInterceptorChain.java:37) ~[junit-jupiter-engine-5.8.2.jar:5.8.2]
  234.         at org.junit.jupiter.engine.execution.ExecutableInvoker.invoke(ExecutableInvoker.java:104) ~[junit-jupiter-engine-5.8.2.jar:5.8.2]
  235.         at org.junit.jupiter.engine.execution.ExecutableInvoker.invoke(ExecutableInvoker.java:98) ~[junit-jupiter-engine-5.8.2.jar:5.8.2]
  236.         at org.junit.jupiter.engine.descriptor.ClassBasedTestDescriptor.invokeMethodInExtensionContext(ClassBasedTestDescriptor.java:506) ~[junit-jupiter-engine-5.8.2.jar:5.8.2]
  237.         at org.junit.jupiter.engine.descriptor.ClassBasedTestDescriptor.lambda$synthesizeBeforeEachMethodAdapter$21(ClassBasedTestDescriptor.java:491) ~[junit-jupiter-engine-5.8.2.jar:5.8.2]
  238.         at org.junit.jupiter.engine.descriptor.TestMethodTestDescriptor.lambda$invokeBeforeEachMethods$3(TestMethodTestDescriptor.java:171) ~[junit-jupiter-engine-5.8.2.jar:5.8.2]
  239.         at org.junit.jupiter.engine.descriptor.TestMethodTestDescriptor.lambda$invokeBeforeMethodsOrCallbacksUntilExceptionOccurs$6(TestMethodTestDescriptor.java:199) ~[junit-jupiter-engine-5.8.2.jar:5.8.2]
  240.         at org.junit.platform.engine.support.hierarchical.ThrowableCollector.execute(ThrowableCollector.java:73) ~[junit-platform-engine-1.8.2.jar:1.8.2]
  241.         at org.junit.jupiter.engine.descriptor.TestMethodTestDescriptor.invokeBeforeMethodsOrCallbacksUntilExceptionOccurs(TestMethodTestDescriptor.java:199) ~[junit-jupiter-engine-5.8.2.jar:5.8.2]
  242.         at org.junit.jupiter.engine.descriptor.TestMethodTestDescriptor.invokeBeforeEachMethods(TestMethodTestDescriptor.java:168) ~[junit-jupiter-engine-5.8.2.jar:5.8.2]
  243.         at org.junit.jupiter.engine.descriptor.TestMethodTestDescriptor.execute(TestMethodTestDescriptor.java:131) ~[junit-jupiter-engine-5.8.2.jar:5.8.2]
  244.         at org.junit.jupiter.engine.descriptor.TestMethodTestDescriptor.execute(TestMethodTestDescriptor.java:66) ~[junit-jupiter-engine-5.8.2.jar:5.8.2]
  245.         at org.junit.platform.engine.support.hierarchical.NodeTestTask.lambda$executeRecursively$6(NodeTestTask.java:151) ~[junit-platform-engine-1.8.2.jar:1.8.2]
  246.         at org.junit.platform.engine.support.hierarchical.ThrowableCollector.execute(ThrowableCollector.java:73) ~[junit-platform-engine-1.8.2.jar:1.8.2]
  247.         at org.junit.platform.engine.support.hierarchical.NodeTestTask.lambda$executeRecursively$8(NodeTestTask.java:141) ~[junit-platform-engine-1.8.2.jar:1.8.2]
  248.         at org.junit.platform.engine.support.hierarchical.Node.around(Node.java:137) ~[junit-platform-engine-1.8.2.jar:1.8.2]
  249.         at org.junit.platform.engine.support.hierarchical.NodeTestTask.lambda$executeRecursively$9(NodeTestTask.java:139) ~[junit-platform-engine-1.8.2.jar:1.8.2]
  250.         at org.junit.platform.engine.support.hierarchical.ThrowableCollector.execute(ThrowableCollector.java:73) ~[junit-platform-engine-1.8.2.jar:1.8.2]
  251.         at org.junit.platform.engine.support.hierarchical.NodeTestTask.executeRecursively(NodeTestTask.java:138) ~[junit-platform-engine-1.8.2.jar:1.8.2]
  252.         at org.junit.platform.engine.support.hierarchical.NodeTestTask.execute(NodeTestTask.java:95) ~[junit-platform-engine-1.8.2.jar:1.8.2]
  253.         at java.util.ArrayList.forEach(ArrayList.java:1257) ~[?:1.8.0_202]
  254.         at org.junit.platform.engine.support.hierarchical.SameThreadHierarchicalTestExecutorService.invokeAll(SameThreadHierarchicalTestExecutorService.java:41) ~[junit-platform-engine-1.8.2.jar:1.8.2]
  255.         at org.junit.platform.engine.support.hierarchical.NodeTestTask.lambda$executeRecursively$6(NodeTestTask.java:155) ~[junit-platform-engine-1.8.2.jar:1.8.2]
  256.         at org.junit.platform.engine.support.hierarchical.ThrowableCollector.execute(ThrowableCollector.java:73) ~[junit-platform-engine-1.8.2.jar:1.8.2]
  257.         at org.junit.platform.engine.support.hierarchical.NodeTestTask.lambda$executeRecursively$8(NodeTestTask.java:141) ~[junit-platform-engine-1.8.2.jar:1.8.2]
  258.         at org.junit.platform.engine.support.hierarchical.Node.around(Node.java:137) ~[junit-platform-engine-1.8.2.jar:1.8.2]
  259.         at org.junit.platform.engine.support.hierarchical.NodeTestTask.lambda$executeRecursively$9(NodeTestTask.java:139) ~[junit-platform-engine-1.8.2.jar:1.8.2]
  260.         at org.junit.platform.engine.support.hierarchical.ThrowableCollector.execute(ThrowableCollector.java:73) ~[junit-platform-engine-1.8.2.jar:1.8.2]
  261.         at org.junit.platform.engine.support.hierarchical.NodeTestTask.executeRecursively(NodeTestTask.java:138) ~[junit-platform-engine-1.8.2.jar:1.8.2]
  262.         at org.junit.platform.engine.support.hierarchical.NodeTestTask.execute(NodeTestTask.java:95) ~[junit-platform-engine-1.8.2.jar:1.8.2]
  263.         at java.util.ArrayList.forEach(ArrayList.java:1257) ~[?:1.8.0_202]
  264.         at org.junit.platform.engine.support.hierarchical.SameThreadHierarchicalTestExecutorService.invokeAll(SameThreadHierarchicalTestExecutorService.java:41) ~[junit-platform-engine-1.8.2.jar:1.8.2]
  265.         at org.junit.platform.engine.support.hierarchical.NodeTestTask.lambda$executeRecursively$6(NodeTestTask.java:155) ~[junit-platform-engine-1.8.2.jar:1.8.2]
  266.         at org.junit.platform.engine.support.hierarchical.ThrowableCollector.execute(ThrowableCollector.java:73) ~[junit-platform-engine-1.8.2.jar:1.8.2]
  267.         at org.junit.platform.engine.support.hierarchical.NodeTestTask.lambda$executeRecursively$8(NodeTestTask.java:141) ~[junit-platform-engine-1.8.2.jar:1.8.2]
  268.         at org.junit.platform.engine.support.hierarchical.Node.around(Node.java:137) ~[junit-platform-engine-1.8.2.jar:1.8.2]
  269.         at org.junit.platform.engine.support.hierarchical.NodeTestTask.lambda$executeRecursively$9(NodeTestTask.java:139) ~[junit-platform-engine-1.8.2.jar:1.8.2]
  270.         at org.junit.platform.engine.support.hierarchical.ThrowableCollector.execute(ThrowableCollector.java:73) ~[junit-platform-engine-1.8.2.jar:1.8.2]
  271.         at org.junit.platform.engine.support.hierarchical.NodeTestTask.executeRecursively(NodeTestTask.java:138) ~[junit-platform-engine-1.8.2.jar:1.8.2]
  272.         at org.junit.platform.engine.support.hierarchical.NodeTestTask.execute(NodeTestTask.java:95) ~[junit-platform-engine-1.8.2.jar:1.8.2]
  273.         at org.junit.platform.engine.support.hierarchical.SameThreadHierarchicalTestExecutorService.submit(SameThreadHierarchicalTestExecutorService.java:35) ~[junit-platform-engine-1.8.2.jar:1.8.2]
  274.         at org.junit.platform.engine.support.hierarchical.HierarchicalTestExecutor.execute(HierarchicalTestExecutor.java:57) ~[junit-platform-engine-1.8.2.jar:1.8.2]
  275.         at org.junit.platform.engine.support.hierarchical.HierarchicalTestEngine.execute(HierarchicalTestEngine.java:54) ~[junit-platform-engine-1.8.2.jar:1.8.2]
  276.         at org.junit.platform.launcher.core.DefaultLauncher.execute(DefaultLauncher.java:220) ~[junit-platform-launcher-1.3.1.jar:1.3.1]
  277.         at org.junit.platform.launcher.core.DefaultLauncher.lambda$execute$6(DefaultLauncher.java:188) ~[junit-platform-launcher-1.3.1.jar:1.3.1]
  278.         at org.junit.platform.launcher.core.DefaultLauncher.withInterceptedStreams(DefaultLauncher.java:202) ~[junit-platform-launcher-1.3.1.jar:1.3.1]
  279.         at org.junit.platform.launcher.core.DefaultLauncher.execute(DefaultLauncher.java:181) ~[junit-platform-launcher-1.3.1.jar:1.3.1]
  280.         at org.junit.platform.launcher.core.DefaultLauncher.execute(DefaultLauncher.java:128) ~[junit-platform-launcher-1.3.1.jar:1.3.1]
  281.         at org.apache.maven.surefire.junitplatform.JUnitPlatformProvider.invokeAllTests(JUnitPlatformProvider.java:150) ~[surefire-junit-platform-2.22.2.jar:2.22.2]
  282.         at org.apache.maven.surefire.junitplatform.JUnitPlatformProvider.invoke(JUnitPlatformProvider.java:124) ~[surefire-junit-platform-2.22.2.jar:2.22.2]
  283.         at org.apache.maven.surefire.booter.ForkedBooter.invokeProviderInSameClassLoader(ForkedBooter.java:384) ~[surefire-booter-2.22.2.jar:2.22.2]
  284.         at org.apache.maven.surefire.booter.ForkedBooter.runSuitesInProcess(ForkedBooter.java:345) ~[surefire-booter-2.22.2.jar:2.22.2]
  285.         at org.apache.maven.surefire.booter.ForkedBooter.execute(ForkedBooter.java:126) ~[surefire-booter-2.22.2.jar:2.22.2]
  286.         at org.apache.maven.surefire.booter.ForkedBooter.main(ForkedBooter.java:418) ~[surefire-booter-2.22.2.jar:2.22.2]
  287. Caused by: java.io.FileNotFoundException: C:\Users\mahim\git2\openmrs-core\liquibase\target\test-classes\org%5copenmrs%5cliquibase%5csnapshots%5cschema-only%5cliquibase-schema-only-SNAPSHOT.xml (The system cannot find the file specified)
  288.         at java.io.FileInputStream.open0(Native Method) ~[?:1.8.0_202]
  289.         at java.io.FileInputStream.open(FileInputStream.java:195) ~[?:1.8.0_202]
  290.         at java.io.FileInputStream.<init>(FileInputStream.java:138) ~[?:1.8.0_202]
  291.         at org.dom4j.io.SAXReader.read(SAXReader.java:304) ~[dom4j-2.1.3.jar:?]
  292.         ... 71 more
  293. ERROR - AbstractSnapshotTuner.readChangeLogResource(168) |2022-07-23T16:35:05,429| processing the resource '{}' raised an exception
  294. org.dom4j.DocumentException: C:\Users\mahim\git2\openmrs-core\liquibase\target\test-classes\org%5copenmrs%5cliquibase%5csnapshots%5cschema-only%5cliquibase-schema-only-SNAPSHOT.xml (The system cannot find the file specified)
  295.         at org.dom4j.io.SAXReader.read(SAXReader.java:327) ~[dom4j-2.1.3.jar:?]
  296.         at org.openmrs.liquibase.AbstractSnapshotTuner.readChangeLogResource(AbstractSnapshotTuner.java:165) ~[classes/:?]
  297.         at org.openmrs.liquibase.SchemaOnlyTunerTest.setup(SchemaOnlyTunerTest.java:57) ~[test-classes/:?]
  298.         at sun.reflect.NativeMethodAccessorImpl.invoke0(Native Method) ~[?:1.8.0_202]
  299.         at sun.reflect.NativeMethodAccessorImpl.invoke(NativeMethodAccessorImpl.java:62) ~[?:1.8.0_202]
  300.         at sun.reflect.DelegatingMethodAccessorImpl.invoke(DelegatingMethodAccessorImpl.java:43) ~[?:1.8.0_202]
  301.         at java.lang.reflect.Method.invoke(Method.java:498) ~[?:1.8.0_202]
  302.         at org.junit.platform.commons.util.ReflectionUtils.invokeMethod(ReflectionUtils.java:725) ~[junit-platform-commons-1.8.2.jar:1.8.2]
  303.         at org.junit.jupiter.engine.execution.MethodInvocation.proceed(MethodInvocation.java:60) ~[junit-jupiter-engine-5.8.2.jar:5.8.2]
  304.         at org.junit.jupiter.engine.execution.InvocationInterceptorChain$ValidatingInvocation.proceed(InvocationInterceptorChain.java:131) ~[junit-jupiter-engine-5.8.2.jar:5.8.2]
  305.         at org.junit.jupiter.engine.extension.TimeoutExtension.intercept(TimeoutExtension.java:149) ~[junit-jupiter-engine-5.8.2.jar:5.8.2]
  306.         at org.junit.jupiter.engine.extension.TimeoutExtension.interceptLifecycleMethod(TimeoutExtension.java:126) ~[junit-jupiter-engine-5.8.2.jar:5.8.2]
  307.         at org.junit.jupiter.engine.extension.TimeoutExtension.interceptBeforeEachMethod(TimeoutExtension.java:76) ~[junit-jupiter-engine-5.8.2.jar:5.8.2]
  308.         at org.junit.jupiter.engine.execution.ExecutableInvoker$ReflectiveInterceptorCall.lambda$ofVoidMethod$0(ExecutableInvoker.java:115) ~[junit-jupiter-engine-5.8.2.jar:5.8.2]
  309.         at org.junit.jupiter.engine.execution.ExecutableInvoker.lambda$invoke$0(ExecutableInvoker.java:105) ~[junit-jupiter-engine-5.8.2.jar:5.8.2]
  310.         at org.junit.jupiter.engine.execution.InvocationInterceptorChain$InterceptedInvocation.proceed(InvocationInterceptorChain.java:106) ~[junit-jupiter-engine-5.8.2.jar:5.8.2]
  311.         at org.junit.jupiter.engine.execution.InvocationInterceptorChain.proceed(InvocationInterceptorChain.java:64) ~[junit-jupiter-engine-5.8.2.jar:5.8.2]
  312.         at org.junit.jupiter.engine.execution.InvocationInterceptorChain.chainAndInvoke(InvocationInterceptorChain.java:45) ~[junit-jupiter-engine-5.8.2.jar:5.8.2]
  313.         at org.junit.jupiter.engine.execution.InvocationInterceptorChain.invoke(InvocationInterceptorChain.java:37) ~[junit-jupiter-engine-5.8.2.jar:5.8.2]
  314.         at org.junit.jupiter.engine.execution.ExecutableInvoker.invoke(ExecutableInvoker.java:104) ~[junit-jupiter-engine-5.8.2.jar:5.8.2]
  315.         at org.junit.jupiter.engine.execution.ExecutableInvoker.invoke(ExecutableInvoker.java:98) ~[junit-jupiter-engine-5.8.2.jar:5.8.2]
  316.         at org.junit.jupiter.engine.descriptor.ClassBasedTestDescriptor.invokeMethodInExtensionContext(ClassBasedTestDescriptor.java:506) ~[junit-jupiter-engine-5.8.2.jar:5.8.2]
  317.         at org.junit.jupiter.engine.descriptor.ClassBasedTestDescriptor.lambda$synthesizeBeforeEachMethodAdapter$21(ClassBasedTestDescriptor.java:491) ~[junit-jupiter-engine-5.8.2.jar:5.8.2]
  318.         at org.junit.jupiter.engine.descriptor.TestMethodTestDescriptor.lambda$invokeBeforeEachMethods$3(TestMethodTestDescriptor.java:171) ~[junit-jupiter-engine-5.8.2.jar:5.8.2]
  319.         at org.junit.jupiter.engine.descriptor.TestMethodTestDescriptor.lambda$invokeBeforeMethodsOrCallbacksUntilExceptionOccurs$6(TestMethodTestDescriptor.java:199) ~[junit-jupiter-engine-5.8.2.jar:5.8.2]
  320.         at org.junit.platform.engine.support.hierarchical.ThrowableCollector.execute(ThrowableCollector.java:73) ~[junit-platform-engine-1.8.2.jar:1.8.2]
  321.         at org.junit.jupiter.engine.descriptor.TestMethodTestDescriptor.invokeBeforeMethodsOrCallbacksUntilExceptionOccurs(TestMethodTestDescriptor.java:199) ~[junit-jupiter-engine-5.8.2.jar:5.8.2]
  322.         at org.junit.jupiter.engine.descriptor.TestMethodTestDescriptor.invokeBeforeEachMethods(TestMethodTestDescriptor.java:168) ~[junit-jupiter-engine-5.8.2.jar:5.8.2]
  323.         at org.junit.jupiter.engine.descriptor.TestMethodTestDescriptor.execute(TestMethodTestDescriptor.java:131) ~[junit-jupiter-engine-5.8.2.jar:5.8.2]
  324.         at org.junit.jupiter.engine.descriptor.TestMethodTestDescriptor.execute(TestMethodTestDescriptor.java:66) ~[junit-jupiter-engine-5.8.2.jar:5.8.2]
  325.         at org.junit.platform.engine.support.hierarchical.NodeTestTask.lambda$executeRecursively$6(NodeTestTask.java:151) ~[junit-platform-engine-1.8.2.jar:1.8.2]
  326.         at org.junit.platform.engine.support.hierarchical.ThrowableCollector.execute(ThrowableCollector.java:73) ~[junit-platform-engine-1.8.2.jar:1.8.2]
  327.         at org.junit.platform.engine.support.hierarchical.NodeTestTask.lambda$executeRecursively$8(NodeTestTask.java:141) ~[junit-platform-engine-1.8.2.jar:1.8.2]
  328.         at org.junit.platform.engine.support.hierarchical.Node.around(Node.java:137) ~[junit-platform-engine-1.8.2.jar:1.8.2]
  329.         at org.junit.platform.engine.support.hierarchical.NodeTestTask.lambda$executeRecursively$9(NodeTestTask.java:139) ~[junit-platform-engine-1.8.2.jar:1.8.2]
  330.         at org.junit.platform.engine.support.hierarchical.ThrowableCollector.execute(ThrowableCollector.java:73) ~[junit-platform-engine-1.8.2.jar:1.8.2]
  331.         at org.junit.platform.engine.support.hierarchical.NodeTestTask.executeRecursively(NodeTestTask.java:138) ~[junit-platform-engine-1.8.2.jar:1.8.2]
  332.         at org.junit.platform.engine.support.hierarchical.NodeTestTask.execute(NodeTestTask.java:95) ~[junit-platform-engine-1.8.2.jar:1.8.2]
  333.         at java.util.ArrayList.forEach(ArrayList.java:1257) ~[?:1.8.0_202]
  334.         at org.junit.platform.engine.support.hierarchical.SameThreadHierarchicalTestExecutorService.invokeAll(SameThreadHierarchicalTestExecutorService.java:41) ~[junit-platform-engine-1.8.2.jar:1.8.2]
  335.         at org.junit.platform.engine.support.hierarchical.NodeTestTask.lambda$executeRecursively$6(NodeTestTask.java:155) ~[junit-platform-engine-1.8.2.jar:1.8.2]
  336.         at org.junit.platform.engine.support.hierarchical.ThrowableCollector.execute(ThrowableCollector.java:73) ~[junit-platform-engine-1.8.2.jar:1.8.2]
  337.         at org.junit.platform.engine.support.hierarchical.NodeTestTask.lambda$executeRecursively$8(NodeTestTask.java:141) ~[junit-platform-engine-1.8.2.jar:1.8.2]
  338.         at org.junit.platform.engine.support.hierarchical.Node.around(Node.java:137) ~[junit-platform-engine-1.8.2.jar:1.8.2]
  339.         at org.junit.platform.engine.support.hierarchical.NodeTestTask.lambda$executeRecursively$9(NodeTestTask.java:139) ~[junit-platform-engine-1.8.2.jar:1.8.2]
  340.         at org.junit.platform.engine.support.hierarchical.ThrowableCollector.execute(ThrowableCollector.java:73) ~[junit-platform-engine-1.8.2.jar:1.8.2]
  341.         at org.junit.platform.engine.support.hierarchical.NodeTestTask.executeRecursively(NodeTestTask.java:138) ~[junit-platform-engine-1.8.2.jar:1.8.2]
  342.         at org.junit.platform.engine.support.hierarchical.NodeTestTask.execute(NodeTestTask.java:95) ~[junit-platform-engine-1.8.2.jar:1.8.2]
  343.         at java.util.ArrayList.forEach(ArrayList.java:1257) ~[?:1.8.0_202]
  344.         at org.junit.platform.engine.support.hierarchical.SameThreadHierarchicalTestExecutorService.invokeAll(SameThreadHierarchicalTestExecutorService.java:41) ~[junit-platform-engine-1.8.2.jar:1.8.2]
  345.         at org.junit.platform.engine.support.hierarchical.NodeTestTask.lambda$executeRecursively$6(NodeTestTask.java:155) ~[junit-platform-engine-1.8.2.jar:1.8.2]
  346.         at org.junit.platform.engine.support.hierarchical.ThrowableCollector.execute(ThrowableCollector.java:73) ~[junit-platform-engine-1.8.2.jar:1.8.2]
  347.         at org.junit.platform.engine.support.hierarchical.NodeTestTask.lambda$executeRecursively$8(NodeTestTask.java:141) ~[junit-platform-engine-1.8.2.jar:1.8.2]
  348.         at org.junit.platform.engine.support.hierarchical.Node.around(Node.java:137) ~[junit-platform-engine-1.8.2.jar:1.8.2]
  349.         at org.junit.platform.engine.support.hierarchical.NodeTestTask.lambda$executeRecursively$9(NodeTestTask.java:139) ~[junit-platform-engine-1.8.2.jar:1.8.2]
  350.         at org.junit.platform.engine.support.hierarchical.ThrowableCollector.execute(ThrowableCollector.java:73) ~[junit-platform-engine-1.8.2.jar:1.8.2]
  351.         at org.junit.platform.engine.support.hierarchical.NodeTestTask.executeRecursively(NodeTestTask.java:138) ~[junit-platform-engine-1.8.2.jar:1.8.2]
  352.         at org.junit.platform.engine.support.hierarchical.NodeTestTask.execute(NodeTestTask.java:95) ~[junit-platform-engine-1.8.2.jar:1.8.2]
  353.         at org.junit.platform.engine.support.hierarchical.SameThreadHierarchicalTestExecutorService.submit(SameThreadHierarchicalTestExecutorService.java:35) ~[junit-platform-engine-1.8.2.jar:1.8.2]
  354.         at org.junit.platform.engine.support.hierarchical.HierarchicalTestExecutor.execute(HierarchicalTestExecutor.java:57) ~[junit-platform-engine-1.8.2.jar:1.8.2]
  355.         at org.junit.platform.engine.support.hierarchical.HierarchicalTestEngine.execute(HierarchicalTestEngine.java:54) ~[junit-platform-engine-1.8.2.jar:1.8.2]
  356.         at org.junit.platform.launcher.core.DefaultLauncher.execute(DefaultLauncher.java:220) ~[junit-platform-launcher-1.3.1.jar:1.3.1]
  357.         at org.junit.platform.launcher.core.DefaultLauncher.lambda$execute$6(DefaultLauncher.java:188) ~[junit-platform-launcher-1.3.1.jar:1.3.1]
  358.         at org.junit.platform.launcher.core.DefaultLauncher.withInterceptedStreams(DefaultLauncher.java:202) ~[junit-platform-launcher-1.3.1.jar:1.3.1]
  359.         at org.junit.platform.launcher.core.DefaultLauncher.execute(DefaultLauncher.java:181) ~[junit-platform-launcher-1.3.1.jar:1.3.1]
  360.         at org.junit.platform.launcher.core.DefaultLauncher.execute(DefaultLauncher.java:128) ~[junit-platform-launcher-1.3.1.jar:1.3.1]
  361.         at org.apache.maven.surefire.junitplatform.JUnitPlatformProvider.invokeAllTests(JUnitPlatformProvider.java:150) ~[surefire-junit-platform-2.22.2.jar:2.22.2]
  362.         at org.apache.maven.surefire.junitplatform.JUnitPlatformProvider.invoke(JUnitPlatformProvider.java:124) ~[surefire-junit-platform-2.22.2.jar:2.22.2]
  363.         at org.apache.maven.surefire.booter.ForkedBooter.invokeProviderInSameClassLoader(ForkedBooter.java:384) ~[surefire-booter-2.22.2.jar:2.22.2]
  364.         at org.apache.maven.surefire.booter.ForkedBooter.runSuitesInProcess(ForkedBooter.java:345) ~[surefire-booter-2.22.2.jar:2.22.2]
  365.         at org.apache.maven.surefire.booter.ForkedBooter.execute(ForkedBooter.java:126) ~[surefire-booter-2.22.2.jar:2.22.2]
  366.         at org.apache.maven.surefire.booter.ForkedBooter.main(ForkedBooter.java:418) ~[surefire-booter-2.22.2.jar:2.22.2]
  367. Caused by: java.io.FileNotFoundException: C:\Users\mahim\git2\openmrs-core\liquibase\target\test-classes\org%5copenmrs%5cliquibase%5csnapshots%5cschema-only%5cliquibase-schema-only-SNAPSHOT.xml (The system cannot find the file specified)
  368.         at java.io.FileInputStream.open0(Native Method) ~[?:1.8.0_202]
  369.         at java.io.FileInputStream.open(FileInputStream.java:195) ~[?:1.8.0_202]
  370.         at java.io.FileInputStream.<init>(FileInputStream.java:138) ~[?:1.8.0_202]
  371.         at org.dom4j.io.SAXReader.read(SAXReader.java:304) ~[dom4j-2.1.3.jar:?]
  372.         ... 71 more
  373. ERROR - AbstractSnapshotTuner.readChangeLogResource(168) |2022-07-23T16:35:05,432| processing the resource '{}' raised an exception
  374. org.dom4j.DocumentException: C:\Users\mahim\git2\openmrs-core\liquibase\target\test-classes\org%5copenmrs%5cliquibase%5csnapshots%5cschema-only%5cliquibase-schema-only-SNAPSHOT.xml (The system cannot find the file specified)
  375.         at org.dom4j.io.SAXReader.read(SAXReader.java:327) ~[dom4j-2.1.3.jar:?]
  376.         at org.openmrs.liquibase.AbstractSnapshotTuner.readChangeLogResource(AbstractSnapshotTuner.java:165) ~[classes/:?]
  377.         at org.openmrs.liquibase.SchemaOnlyTunerTest.setup(SchemaOnlyTunerTest.java:57) ~[test-classes/:?]
  378.         at sun.reflect.NativeMethodAccessorImpl.invoke0(Native Method) ~[?:1.8.0_202]
  379.         at sun.reflect.NativeMethodAccessorImpl.invoke(NativeMethodAccessorImpl.java:62) ~[?:1.8.0_202]
  380.         at sun.reflect.DelegatingMethodAccessorImpl.invoke(DelegatingMethodAccessorImpl.java:43) ~[?:1.8.0_202]
  381.         at java.lang.reflect.Method.invoke(Method.java:498) ~[?:1.8.0_202]
  382.         at org.junit.platform.commons.util.ReflectionUtils.invokeMethod(ReflectionUtils.java:725) ~[junit-platform-commons-1.8.2.jar:1.8.2]
  383.         at org.junit.jupiter.engine.execution.MethodInvocation.proceed(MethodInvocation.java:60) ~[junit-jupiter-engine-5.8.2.jar:5.8.2]
  384.         at org.junit.jupiter.engine.execution.InvocationInterceptorChain$ValidatingInvocation.proceed(InvocationInterceptorChain.java:131) ~[junit-jupiter-engine-5.8.2.jar:5.8.2]
  385.         at org.junit.jupiter.engine.extension.TimeoutExtension.intercept(TimeoutExtension.java:149) ~[junit-jupiter-engine-5.8.2.jar:5.8.2]
  386.         at org.junit.jupiter.engine.extension.TimeoutExtension.interceptLifecycleMethod(TimeoutExtension.java:126) ~[junit-jupiter-engine-5.8.2.jar:5.8.2]
  387.         at org.junit.jupiter.engine.extension.TimeoutExtension.interceptBeforeEachMethod(TimeoutExtension.java:76) ~[junit-jupiter-engine-5.8.2.jar:5.8.2]
  388.         at org.junit.jupiter.engine.execution.ExecutableInvoker$ReflectiveInterceptorCall.lambda$ofVoidMethod$0(ExecutableInvoker.java:115) ~[junit-jupiter-engine-5.8.2.jar:5.8.2]
  389.         at org.junit.jupiter.engine.execution.ExecutableInvoker.lambda$invoke$0(ExecutableInvoker.java:105) ~[junit-jupiter-engine-5.8.2.jar:5.8.2]
  390.         at org.junit.jupiter.engine.execution.InvocationInterceptorChain$InterceptedInvocation.proceed(InvocationInterceptorChain.java:106) ~[junit-jupiter-engine-5.8.2.jar:5.8.2]
  391.         at org.junit.jupiter.engine.execution.InvocationInterceptorChain.proceed(InvocationInterceptorChain.java:64) ~[junit-jupiter-engine-5.8.2.jar:5.8.2]
  392.         at org.junit.jupiter.engine.execution.InvocationInterceptorChain.chainAndInvoke(InvocationInterceptorChain.java:45) ~[junit-jupiter-engine-5.8.2.jar:5.8.2]
  393.         at org.junit.jupiter.engine.execution.InvocationInterceptorChain.invoke(InvocationInterceptorChain.java:37) ~[junit-jupiter-engine-5.8.2.jar:5.8.2]
  394.         at org.junit.jupiter.engine.execution.ExecutableInvoker.invoke(ExecutableInvoker.java:104) ~[junit-jupiter-engine-5.8.2.jar:5.8.2]
  395.         at org.junit.jupiter.engine.execution.ExecutableInvoker.invoke(ExecutableInvoker.java:98) ~[junit-jupiter-engine-5.8.2.jar:5.8.2]
  396.         at org.junit.jupiter.engine.descriptor.ClassBasedTestDescriptor.invokeMethodInExtensionContext(ClassBasedTestDescriptor.java:506) ~[junit-jupiter-engine-5.8.2.jar:5.8.2]
  397.         at org.junit.jupiter.engine.descriptor.ClassBasedTestDescriptor.lambda$synthesizeBeforeEachMethodAdapter$21(ClassBasedTestDescriptor.java:491) ~[junit-jupiter-engine-5.8.2.jar:5.8.2]
  398.         at org.junit.jupiter.engine.descriptor.TestMethodTestDescriptor.lambda$invokeBeforeEachMethods$3(TestMethodTestDescriptor.java:171) ~[junit-jupiter-engine-5.8.2.jar:5.8.2]
  399.         at org.junit.jupiter.engine.descriptor.TestMethodTestDescriptor.lambda$invokeBeforeMethodsOrCallbacksUntilExceptionOccurs$6(TestMethodTestDescriptor.java:199) ~[junit-jupiter-engine-5.8.2.jar:5.8.2]
  400.         at org.junit.platform.engine.support.hierarchical.ThrowableCollector.execute(ThrowableCollector.java:73) ~[junit-platform-engine-1.8.2.jar:1.8.2]
  401.         at org.junit.jupiter.engine.descriptor.TestMethodTestDescriptor.invokeBeforeMethodsOrCallbacksUntilExceptionOccurs(TestMethodTestDescriptor.java:199) ~[junit-jupiter-engine-5.8.2.jar:5.8.2]
  402.         at org.junit.jupiter.engine.descriptor.TestMethodTestDescriptor.invokeBeforeEachMethods(TestMethodTestDescriptor.java:168) ~[junit-jupiter-engine-5.8.2.jar:5.8.2]
  403.         at org.junit.jupiter.engine.descriptor.TestMethodTestDescriptor.execute(TestMethodTestDescriptor.java:131) ~[junit-jupiter-engine-5.8.2.jar:5.8.2]
  404.         at org.junit.jupiter.engine.descriptor.TestMethodTestDescriptor.execute(TestMethodTestDescriptor.java:66) ~[junit-jupiter-engine-5.8.2.jar:5.8.2]
  405.         at org.junit.platform.engine.support.hierarchical.NodeTestTask.lambda$executeRecursively$6(NodeTestTask.java:151) ~[junit-platform-engine-1.8.2.jar:1.8.2]
  406.         at org.junit.platform.engine.support.hierarchical.ThrowableCollector.execute(ThrowableCollector.java:73) ~[junit-platform-engine-1.8.2.jar:1.8.2]
  407.         at org.junit.platform.engine.support.hierarchical.NodeTestTask.lambda$executeRecursively$8(NodeTestTask.java:141) ~[junit-platform-engine-1.8.2.jar:1.8.2]
  408.         at org.junit.platform.engine.support.hierarchical.Node.around(Node.java:137) ~[junit-platform-engine-1.8.2.jar:1.8.2]
  409.         at org.junit.platform.engine.support.hierarchical.NodeTestTask.lambda$executeRecursively$9(NodeTestTask.java:139) ~[junit-platform-engine-1.8.2.jar:1.8.2]
  410.         at org.junit.platform.engine.support.hierarchical.ThrowableCollector.execute(ThrowableCollector.java:73) ~[junit-platform-engine-1.8.2.jar:1.8.2]
  411.         at org.junit.platform.engine.support.hierarchical.NodeTestTask.executeRecursively(NodeTestTask.java:138) ~[junit-platform-engine-1.8.2.jar:1.8.2]
  412.         at org.junit.platform.engine.support.hierarchical.NodeTestTask.execute(NodeTestTask.java:95) ~[junit-platform-engine-1.8.2.jar:1.8.2]
  413.         at java.util.ArrayList.forEach(ArrayList.java:1257) ~[?:1.8.0_202]
  414.         at org.junit.platform.engine.support.hierarchical.SameThreadHierarchicalTestExecutorService.invokeAll(SameThreadHierarchicalTestExecutorService.java:41) ~[junit-platform-engine-1.8.2.jar:1.8.2]
  415.         at org.junit.platform.engine.support.hierarchical.NodeTestTask.lambda$executeRecursively$6(NodeTestTask.java:155) ~[junit-platform-engine-1.8.2.jar:1.8.2]
  416.         at org.junit.platform.engine.support.hierarchical.ThrowableCollector.execute(ThrowableCollector.java:73) ~[junit-platform-engine-1.8.2.jar:1.8.2]
  417.         at org.junit.platform.engine.support.hierarchical.NodeTestTask.lambda$executeRecursively$8(NodeTestTask.java:141) ~[junit-platform-engine-1.8.2.jar:1.8.2]
  418.         at org.junit.platform.engine.support.hierarchical.Node.around(Node.java:137) ~[junit-platform-engine-1.8.2.jar:1.8.2]
  419.         at org.junit.platform.engine.support.hierarchical.NodeTestTask.lambda$executeRecursively$9(NodeTestTask.java:139) ~[junit-platform-engine-1.8.2.jar:1.8.2]
  420.         at org.junit.platform.engine.support.hierarchical.ThrowableCollector.execute(ThrowableCollector.java:73) ~[junit-platform-engine-1.8.2.jar:1.8.2]
  421.         at org.junit.platform.engine.support.hierarchical.NodeTestTask.executeRecursively(NodeTestTask.java:138) ~[junit-platform-engine-1.8.2.jar:1.8.2]
  422.         at org.junit.platform.engine.support.hierarchical.NodeTestTask.execute(NodeTestTask.java:95) ~[junit-platform-engine-1.8.2.jar:1.8.2]
  423.         at java.util.ArrayList.forEach(ArrayList.java:1257) ~[?:1.8.0_202]
  424.         at org.junit.platform.engine.support.hierarchical.SameThreadHierarchicalTestExecutorService.invokeAll(SameThreadHierarchicalTestExecutorService.java:41) ~[junit-platform-engine-1.8.2.jar:1.8.2]
  425.         at org.junit.platform.engine.support.hierarchical.NodeTestTask.lambda$executeRecursively$6(NodeTestTask.java:155) ~[junit-platform-engine-1.8.2.jar:1.8.2]
  426.         at org.junit.platform.engine.support.hierarchical.ThrowableCollector.execute(ThrowableCollector.java:73) ~[junit-platform-engine-1.8.2.jar:1.8.2]
  427.         at org.junit.platform.engine.support.hierarchical.NodeTestTask.lambda$executeRecursively$8(NodeTestTask.java:141) ~[junit-platform-engine-1.8.2.jar:1.8.2]
  428.         at org.junit.platform.engine.support.hierarchical.Node.around(Node.java:137) ~[junit-platform-engine-1.8.2.jar:1.8.2]
  429.         at org.junit.platform.engine.support.hierarchical.NodeTestTask.lambda$executeRecursively$9(NodeTestTask.java:139) ~[junit-platform-engine-1.8.2.jar:1.8.2]
  430.         at org.junit.platform.engine.support.hierarchical.ThrowableCollector.execute(ThrowableCollector.java:73) ~[junit-platform-engine-1.8.2.jar:1.8.2]
  431.         at org.junit.platform.engine.support.hierarchical.NodeTestTask.executeRecursively(NodeTestTask.java:138) ~[junit-platform-engine-1.8.2.jar:1.8.2]
  432.         at org.junit.platform.engine.support.hierarchical.NodeTestTask.execute(NodeTestTask.java:95) ~[junit-platform-engine-1.8.2.jar:1.8.2]
  433.         at org.junit.platform.engine.support.hierarchical.SameThreadHierarchicalTestExecutorService.submit(SameThreadHierarchicalTestExecutorService.java:35) ~[junit-platform-engine-1.8.2.jar:1.8.2]
  434.         at org.junit.platform.engine.support.hierarchical.HierarchicalTestExecutor.execute(HierarchicalTestExecutor.java:57) ~[junit-platform-engine-1.8.2.jar:1.8.2]
  435.         at org.junit.platform.engine.support.hierarchical.HierarchicalTestEngine.execute(HierarchicalTestEngine.java:54) ~[junit-platform-engine-1.8.2.jar:1.8.2]
  436.         at org.junit.platform.launcher.core.DefaultLauncher.execute(DefaultLauncher.java:220) ~[junit-platform-launcher-1.3.1.jar:1.3.1]
  437.         at org.junit.platform.launcher.core.DefaultLauncher.lambda$execute$6(DefaultLauncher.java:188) ~[junit-platform-launcher-1.3.1.jar:1.3.1]
  438.         at org.junit.platform.launcher.core.DefaultLauncher.withInterceptedStreams(DefaultLauncher.java:202) ~[junit-platform-launcher-1.3.1.jar:1.3.1]
  439.         at org.junit.platform.launcher.core.DefaultLauncher.execute(DefaultLauncher.java:181) ~[junit-platform-launcher-1.3.1.jar:1.3.1]
  440.         at org.junit.platform.launcher.core.DefaultLauncher.execute(DefaultLauncher.java:128) ~[junit-platform-launcher-1.3.1.jar:1.3.1]
  441.         at org.apache.maven.surefire.junitplatform.JUnitPlatformProvider.invokeAllTests(JUnitPlatformProvider.java:150) ~[surefire-junit-platform-2.22.2.jar:2.22.2]
  442.         at org.apache.maven.surefire.junitplatform.JUnitPlatformProvider.invoke(JUnitPlatformProvider.java:124) ~[surefire-junit-platform-2.22.2.jar:2.22.2]
  443.         at org.apache.maven.surefire.booter.ForkedBooter.invokeProviderInSameClassLoader(ForkedBooter.java:384) ~[surefire-booter-2.22.2.jar:2.22.2]
  444.         at org.apache.maven.surefire.booter.ForkedBooter.runSuitesInProcess(ForkedBooter.java:345) ~[surefire-booter-2.22.2.jar:2.22.2]
  445.         at org.apache.maven.surefire.booter.ForkedBooter.execute(ForkedBooter.java:126) ~[surefire-booter-2.22.2.jar:2.22.2]
  446.         at org.apache.maven.surefire.booter.ForkedBooter.main(ForkedBooter.java:418) ~[surefire-booter-2.22.2.jar:2.22.2]
  447. Caused by: java.io.FileNotFoundException: C:\Users\mahim\git2\openmrs-core\liquibase\target\test-classes\org%5copenmrs%5cliquibase%5csnapshots%5cschema-only%5cliquibase-schema-only-SNAPSHOT.xml (The system cannot find the file specified)
  448.         at java.io.FileInputStream.open0(Native Method) ~[?:1.8.0_202]
  449.         at java.io.FileInputStream.open(FileInputStream.java:195) ~[?:1.8.0_202]
  450.         at java.io.FileInputStream.<init>(FileInputStream.java:138) ~[?:1.8.0_202]
  451.         at org.dom4j.io.SAXReader.read(SAXReader.java:304) ~[dom4j-2.1.3.jar:?]
  452.         ... 71 more
  453. ERROR - AbstractSnapshotTuner.readChangeLogResource(168) |2022-07-23T16:35:05,437| processing the resource '{}' raised an exception
  454. org.dom4j.DocumentException: C:\Users\mahim\git2\openmrs-core\liquibase\target\test-classes\org%5copenmrs%5cliquibase%5csnapshots%5cschema-only%5cliquibase-schema-only-SNAPSHOT.xml (The system cannot find the file specified)
  455.         at org.dom4j.io.SAXReader.read(SAXReader.java:327) ~[dom4j-2.1.3.jar:?]
  456.         at org.openmrs.liquibase.AbstractSnapshotTuner.readChangeLogResource(AbstractSnapshotTuner.java:165) ~[classes/:?]
  457.         at org.openmrs.liquibase.SchemaOnlyTunerTest.setup(SchemaOnlyTunerTest.java:57) ~[test-classes/:?]
  458.         at sun.reflect.NativeMethodAccessorImpl.invoke0(Native Method) ~[?:1.8.0_202]
  459.         at sun.reflect.NativeMethodAccessorImpl.invoke(NativeMethodAccessorImpl.java:62) ~[?:1.8.0_202]
  460.         at sun.reflect.DelegatingMethodAccessorImpl.invoke(DelegatingMethodAccessorImpl.java:43) ~[?:1.8.0_202]
  461.         at java.lang.reflect.Method.invoke(Method.java:498) ~[?:1.8.0_202]
  462.         at org.junit.platform.commons.util.ReflectionUtils.invokeMethod(ReflectionUtils.java:725) ~[junit-platform-commons-1.8.2.jar:1.8.2]
  463.         at org.junit.jupiter.engine.execution.MethodInvocation.proceed(MethodInvocation.java:60) ~[junit-jupiter-engine-5.8.2.jar:5.8.2]
  464.         at org.junit.jupiter.engine.execution.InvocationInterceptorChain$ValidatingInvocation.proceed(InvocationInterceptorChain.java:131) ~[junit-jupiter-engine-5.8.2.jar:5.8.2]
  465.         at org.junit.jupiter.engine.extension.TimeoutExtension.intercept(TimeoutExtension.java:149) ~[junit-jupiter-engine-5.8.2.jar:5.8.2]
  466.         at org.junit.jupiter.engine.extension.TimeoutExtension.interceptLifecycleMethod(TimeoutExtension.java:126) ~[junit-jupiter-engine-5.8.2.jar:5.8.2]
  467.         at org.junit.jupiter.engine.extension.TimeoutExtension.interceptBeforeEachMethod(TimeoutExtension.java:76) ~[junit-jupiter-engine-5.8.2.jar:5.8.2]
  468.         at org.junit.jupiter.engine.execution.ExecutableInvoker$ReflectiveInterceptorCall.lambda$ofVoidMethod$0(ExecutableInvoker.java:115) ~[junit-jupiter-engine-5.8.2.jar:5.8.2]
  469.         at org.junit.jupiter.engine.execution.ExecutableInvoker.lambda$invoke$0(ExecutableInvoker.java:105) ~[junit-jupiter-engine-5.8.2.jar:5.8.2]
  470.         at org.junit.jupiter.engine.execution.InvocationInterceptorChain$InterceptedInvocation.proceed(InvocationInterceptorChain.java:106) ~[junit-jupiter-engine-5.8.2.jar:5.8.2]
  471.         at org.junit.jupiter.engine.execution.InvocationInterceptorChain.proceed(InvocationInterceptorChain.java:64) ~[junit-jupiter-engine-5.8.2.jar:5.8.2]
  472.         at org.junit.jupiter.engine.execution.InvocationInterceptorChain.chainAndInvoke(InvocationInterceptorChain.java:45) ~[junit-jupiter-engine-5.8.2.jar:5.8.2]
  473.         at org.junit.jupiter.engine.execution.InvocationInterceptorChain.invoke(InvocationInterceptorChain.java:37) ~[junit-jupiter-engine-5.8.2.jar:5.8.2]
  474.         at org.junit.jupiter.engine.execution.ExecutableInvoker.invoke(ExecutableInvoker.java:104) ~[junit-jupiter-engine-5.8.2.jar:5.8.2]
  475.         at org.junit.jupiter.engine.execution.ExecutableInvoker.invoke(ExecutableInvoker.java:98) ~[junit-jupiter-engine-5.8.2.jar:5.8.2]
  476.         at org.junit.jupiter.engine.descriptor.ClassBasedTestDescriptor.invokeMethodInExtensionContext(ClassBasedTestDescriptor.java:506) ~[junit-jupiter-engine-5.8.2.jar:5.8.2]
  477.         at org.junit.jupiter.engine.descriptor.ClassBasedTestDescriptor.lambda$synthesizeBeforeEachMethodAdapter$21(ClassBasedTestDescriptor.java:491) ~[junit-jupiter-engine-5.8.2.jar:5.8.2]
  478.         at org.junit.jupiter.engine.descriptor.TestMethodTestDescriptor.lambda$invokeBeforeEachMethods$3(TestMethodTestDescriptor.java:171) ~[junit-jupiter-engine-5.8.2.jar:5.8.2]
  479.         at org.junit.jupiter.engine.descriptor.TestMethodTestDescriptor.lambda$invokeBeforeMethodsOrCallbacksUntilExceptionOccurs$6(TestMethodTestDescriptor.java:199) ~[junit-jupiter-engine-5.8.2.jar:5.8.2]
  480.         at org.junit.platform.engine.support.hierarchical.ThrowableCollector.execute(ThrowableCollector.java:73) ~[junit-platform-engine-1.8.2.jar:1.8.2]
  481.         at org.junit.jupiter.engine.descriptor.TestMethodTestDescriptor.invokeBeforeMethodsOrCallbacksUntilExceptionOccurs(TestMethodTestDescriptor.java:199) ~[junit-jupiter-engine-5.8.2.jar:5.8.2]
  482.         at org.junit.jupiter.engine.descriptor.TestMethodTestDescriptor.invokeBeforeEachMethods(TestMethodTestDescriptor.java:168) ~[junit-jupiter-engine-5.8.2.jar:5.8.2]
  483.         at org.junit.jupiter.engine.descriptor.TestMethodTestDescriptor.execute(TestMethodTestDescriptor.java:131) ~[junit-jupiter-engine-5.8.2.jar:5.8.2]
  484.         at org.junit.jupiter.engine.descriptor.TestMethodTestDescriptor.execute(TestMethodTestDescriptor.java:66) ~[junit-jupiter-engine-5.8.2.jar:5.8.2]
  485.         at org.junit.platform.engine.support.hierarchical.NodeTestTask.lambda$executeRecursively$6(NodeTestTask.java:151) ~[junit-platform-engine-1.8.2.jar:1.8.2]
  486.         at org.junit.platform.engine.support.hierarchical.ThrowableCollector.execute(ThrowableCollector.java:73) ~[junit-platform-engine-1.8.2.jar:1.8.2]
  487.         at org.junit.platform.engine.support.hierarchical.NodeTestTask.lambda$executeRecursively$8(NodeTestTask.java:141) ~[junit-platform-engine-1.8.2.jar:1.8.2]
  488.         at org.junit.platform.engine.support.hierarchical.Node.around(Node.java:137) ~[junit-platform-engine-1.8.2.jar:1.8.2]
  489.         at org.junit.platform.engine.support.hierarchical.NodeTestTask.lambda$executeRecursively$9(NodeTestTask.java:139) ~[junit-platform-engine-1.8.2.jar:1.8.2]
  490.         at org.junit.platform.engine.support.hierarchical.ThrowableCollector.execute(ThrowableCollector.java:73) ~[junit-platform-engine-1.8.2.jar:1.8.2]
  491.         at org.junit.platform.engine.support.hierarchical.NodeTestTask.executeRecursively(NodeTestTask.java:138) ~[junit-platform-engine-1.8.2.jar:1.8.2]
  492.         at org.junit.platform.engine.support.hierarchical.NodeTestTask.execute(NodeTestTask.java:95) ~[junit-platform-engine-1.8.2.jar:1.8.2]
  493.         at java.util.ArrayList.forEach(ArrayList.java:1257) ~[?:1.8.0_202]
  494.         at org.junit.platform.engine.support.hierarchical.SameThreadHierarchicalTestExecutorService.invokeAll(SameThreadHierarchicalTestExecutorService.java:41) ~[junit-platform-engine-1.8.2.jar:1.8.2]
  495.         at org.junit.platform.engine.support.hierarchical.NodeTestTask.lambda$executeRecursively$6(NodeTestTask.java:155) ~[junit-platform-engine-1.8.2.jar:1.8.2]
  496.         at org.junit.platform.engine.support.hierarchical.ThrowableCollector.execute(ThrowableCollector.java:73) ~[junit-platform-engine-1.8.2.jar:1.8.2]
  497.         at org.junit.platform.engine.support.hierarchical.NodeTestTask.lambda$executeRecursively$8(NodeTestTask.java:141) ~[junit-platform-engine-1.8.2.jar:1.8.2]
  498.         at org.junit.platform.engine.support.hierarchical.Node.around(Node.java:137) ~[junit-platform-engine-1.8.2.jar:1.8.2]
  499.         at org.junit.platform.engine.support.hierarchical.NodeTestTask.lambda$executeRecursively$9(NodeTestTask.java:139) ~[junit-platform-engine-1.8.2.jar:1.8.2]
  500.         at org.junit.platform.engine.support.hierarchical.ThrowableCollector.execute(ThrowableCollector.java:73) ~[junit-platform-engine-1.8.2.jar:1.8.2]
  501.         at org.junit.platform.engine.support.hierarchical.NodeTestTask.executeRecursively(NodeTestTask.java:138) ~[junit-platform-engine-1.8.2.jar:1.8.2]
  502.         at org.junit.platform.engine.support.hierarchical.NodeTestTask.execute(NodeTestTask.java:95) ~[junit-platform-engine-1.8.2.jar:1.8.2]
  503.         at java.util.ArrayList.forEach(ArrayList.java:1257) ~[?:1.8.0_202]
  504.         at org.junit.platform.engine.support.hierarchical.SameThreadHierarchicalTestExecutorService.invokeAll(SameThreadHierarchicalTestExecutorService.java:41) ~[junit-platform-engine-1.8.2.jar:1.8.2]
  505.         at org.junit.platform.engine.support.hierarchical.NodeTestTask.lambda$executeRecursively$6(NodeTestTask.java:155) ~[junit-platform-engine-1.8.2.jar:1.8.2]
  506.         at org.junit.platform.engine.support.hierarchical.ThrowableCollector.execute(ThrowableCollector.java:73) ~[junit-platform-engine-1.8.2.jar:1.8.2]
  507.         at org.junit.platform.engine.support.hierarchical.NodeTestTask.lambda$executeRecursively$8(NodeTestTask.java:141) ~[junit-platform-engine-1.8.2.jar:1.8.2]
  508.         at org.junit.platform.engine.support.hierarchical.Node.around(Node.java:137) ~[junit-platform-engine-1.8.2.jar:1.8.2]
  509.         at org.junit.platform.engine.support.hierarchical.NodeTestTask.lambda$executeRecursively$9(NodeTestTask.java:139) ~[junit-platform-engine-1.8.2.jar:1.8.2]
  510.         at org.junit.platform.engine.support.hierarchical.ThrowableCollector.execute(ThrowableCollector.java:73) ~[junit-platform-engine-1.8.2.jar:1.8.2]
  511.         at org.junit.platform.engine.support.hierarchical.NodeTestTask.executeRecursively(NodeTestTask.java:138) ~[junit-platform-engine-1.8.2.jar:1.8.2]
  512.         at org.junit.platform.engine.support.hierarchical.NodeTestTask.execute(NodeTestTask.java:95) ~[junit-platform-engine-1.8.2.jar:1.8.2]
  513.         at org.junit.platform.engine.support.hierarchical.SameThreadHierarchicalTestExecutorService.submit(SameThreadHierarchicalTestExecutorService.java:35) ~[junit-platform-engine-1.8.2.jar:1.8.2]
  514.         at org.junit.platform.engine.support.hierarchical.HierarchicalTestExecutor.execute(HierarchicalTestExecutor.java:57) ~[junit-platform-engine-1.8.2.jar:1.8.2]
  515.         at org.junit.platform.engine.support.hierarchical.HierarchicalTestEngine.execute(HierarchicalTestEngine.java:54) ~[junit-platform-engine-1.8.2.jar:1.8.2]
  516.         at org.junit.platform.launcher.core.DefaultLauncher.execute(DefaultLauncher.java:220) ~[junit-platform-launcher-1.3.1.jar:1.3.1]
  517.         at org.junit.platform.launcher.core.DefaultLauncher.lambda$execute$6(DefaultLauncher.java:188) ~[junit-platform-launcher-1.3.1.jar:1.3.1]
  518.         at org.junit.platform.launcher.core.DefaultLauncher.withInterceptedStreams(DefaultLauncher.java:202) ~[junit-platform-launcher-1.3.1.jar:1.3.1]
  519.         at org.junit.platform.launcher.core.DefaultLauncher.execute(DefaultLauncher.java:181) ~[junit-platform-launcher-1.3.1.jar:1.3.1]
  520.         at org.junit.platform.launcher.core.DefaultLauncher.execute(DefaultLauncher.java:128) ~[junit-platform-launcher-1.3.1.jar:1.3.1]
  521.         at org.apache.maven.surefire.junitplatform.JUnitPlatformProvider.invokeAllTests(JUnitPlatformProvider.java:150) ~[surefire-junit-platform-2.22.2.jar:2.22.2]
  522.         at org.apache.maven.surefire.junitplatform.JUnitPlatformProvider.invoke(JUnitPlatformProvider.java:124) ~[surefire-junit-platform-2.22.2.jar:2.22.2]
  523.         at org.apache.maven.surefire.booter.ForkedBooter.invokeProviderInSameClassLoader(ForkedBooter.java:384) ~[surefire-booter-2.22.2.jar:2.22.2]
  524.         at org.apache.maven.surefire.booter.ForkedBooter.runSuitesInProcess(ForkedBooter.java:345) ~[surefire-booter-2.22.2.jar:2.22.2]
  525.         at org.apache.maven.surefire.booter.ForkedBooter.execute(ForkedBooter.java:126) ~[surefire-booter-2.22.2.jar:2.22.2]
  526.         at org.apache.maven.surefire.booter.ForkedBooter.main(ForkedBooter.java:418) ~[surefire-booter-2.22.2.jar:2.22.2]
  527. Caused by: java.io.FileNotFoundException: C:\Users\mahim\git2\openmrs-core\liquibase\target\test-classes\org%5copenmrs%5cliquibase%5csnapshots%5cschema-only%5cliquibase-schema-only-SNAPSHOT.xml (The system cannot find the file specified)
  528.         at java.io.FileInputStream.open0(Native Method) ~[?:1.8.0_202]
  529.         at java.io.FileInputStream.open(FileInputStream.java:195) ~[?:1.8.0_202]
  530.         at java.io.FileInputStream.<init>(FileInputStream.java:138) ~[?:1.8.0_202]
  531.         at org.dom4j.io.SAXReader.read(SAXReader.java:304) ~[dom4j-2.1.3.jar:?]
  532.         ... 71 more
  533. ERROR - AbstractSnapshotTuner.readChangeLogResource(168) |2022-07-23T16:35:05,442| processing the resource '{}' raised an exception
  534. org.dom4j.DocumentException: C:\Users\mahim\git2\openmrs-core\liquibase\target\test-classes\org%5copenmrs%5cliquibase%5csnapshots%5cschema-only%5cliquibase-schema-only-SNAPSHOT.xml (The system cannot find the file specified)
  535.         at org.dom4j.io.SAXReader.read(SAXReader.java:327) ~[dom4j-2.1.3.jar:?]
  536.         at org.openmrs.liquibase.AbstractSnapshotTuner.readChangeLogResource(AbstractSnapshotTuner.java:165) ~[classes/:?]
  537.         at org.openmrs.liquibase.SchemaOnlyTunerTest.setup(SchemaOnlyTunerTest.java:57) ~[test-classes/:?]
  538.         at sun.reflect.NativeMethodAccessorImpl.invoke0(Native Method) ~[?:1.8.0_202]
  539.         at sun.reflect.NativeMethodAccessorImpl.invoke(NativeMethodAccessorImpl.java:62) ~[?:1.8.0_202]
  540.         at sun.reflect.DelegatingMethodAccessorImpl.invoke(DelegatingMethodAccessorImpl.java:43) ~[?:1.8.0_202]
  541.         at java.lang.reflect.Method.invoke(Method.java:498) ~[?:1.8.0_202]
  542.         at org.junit.platform.commons.util.ReflectionUtils.invokeMethod(ReflectionUtils.java:725) ~[junit-platform-commons-1.8.2.jar:1.8.2]
  543.         at org.junit.jupiter.engine.execution.MethodInvocation.proceed(MethodInvocation.java:60) ~[junit-jupiter-engine-5.8.2.jar:5.8.2]
  544.         at org.junit.jupiter.engine.execution.InvocationInterceptorChain$ValidatingInvocation.proceed(InvocationInterceptorChain.java:131) ~[junit-jupiter-engine-5.8.2.jar:5.8.2]
  545.         at org.junit.jupiter.engine.extension.TimeoutExtension.intercept(TimeoutExtension.java:149) ~[junit-jupiter-engine-5.8.2.jar:5.8.2]
  546.         at org.junit.jupiter.engine.extension.TimeoutExtension.interceptLifecycleMethod(TimeoutExtension.java:126) ~[junit-jupiter-engine-5.8.2.jar:5.8.2]
  547.         at org.junit.jupiter.engine.extension.TimeoutExtension.interceptBeforeEachMethod(TimeoutExtension.java:76) ~[junit-jupiter-engine-5.8.2.jar:5.8.2]
  548.         at org.junit.jupiter.engine.execution.ExecutableInvoker$ReflectiveInterceptorCall.lambda$ofVoidMethod$0(ExecutableInvoker.java:115) ~[junit-jupiter-engine-5.8.2.jar:5.8.2]
  549.         at org.junit.jupiter.engine.execution.ExecutableInvoker.lambda$invoke$0(ExecutableInvoker.java:105) ~[junit-jupiter-engine-5.8.2.jar:5.8.2]
  550.         at org.junit.jupiter.engine.execution.InvocationInterceptorChain$InterceptedInvocation.proceed(InvocationInterceptorChain.java:106) ~[junit-jupiter-engine-5.8.2.jar:5.8.2]
  551.         at org.junit.jupiter.engine.execution.InvocationInterceptorChain.proceed(InvocationInterceptorChain.java:64) ~[junit-jupiter-engine-5.8.2.jar:5.8.2]
  552.         at org.junit.jupiter.engine.execution.InvocationInterceptorChain.chainAndInvoke(InvocationInterceptorChain.java:45) ~[junit-jupiter-engine-5.8.2.jar:5.8.2]
  553.         at org.junit.jupiter.engine.execution.InvocationInterceptorChain.invoke(InvocationInterceptorChain.java:37) ~[junit-jupiter-engine-5.8.2.jar:5.8.2]
  554.         at org.junit.jupiter.engine.execution.ExecutableInvoker.invoke(ExecutableInvoker.java:104) ~[junit-jupiter-engine-5.8.2.jar:5.8.2]
  555.         at org.junit.jupiter.engine.execution.ExecutableInvoker.invoke(ExecutableInvoker.java:98) ~[junit-jupiter-engine-5.8.2.jar:5.8.2]
  556.         at org.junit.jupiter.engine.descriptor.ClassBasedTestDescriptor.invokeMethodInExtensionContext(ClassBasedTestDescriptor.java:506) ~[junit-jupiter-engine-5.8.2.jar:5.8.2]
  557.         at org.junit.jupiter.engine.descriptor.ClassBasedTestDescriptor.lambda$synthesizeBeforeEachMethodAdapter$21(ClassBasedTestDescriptor.java:491) ~[junit-jupiter-engine-5.8.2.jar:5.8.2]
  558.         at org.junit.jupiter.engine.descriptor.TestMethodTestDescriptor.lambda$invokeBeforeEachMethods$3(TestMethodTestDescriptor.java:171) ~[junit-jupiter-engine-5.8.2.jar:5.8.2]
  559.         at org.junit.jupiter.engine.descriptor.TestMethodTestDescriptor.lambda$invokeBeforeMethodsOrCallbacksUntilExceptionOccurs$6(TestMethodTestDescriptor.java:199) ~[junit-jupiter-engine-5.8.2.jar:5.8.2]
  560.         at org.junit.platform.engine.support.hierarchical.ThrowableCollector.execute(ThrowableCollector.java:73) ~[junit-platform-engine-1.8.2.jar:1.8.2]
  561.         at org.junit.jupiter.engine.descriptor.TestMethodTestDescriptor.invokeBeforeMethodsOrCallbacksUntilExceptionOccurs(TestMethodTestDescriptor.java:199) ~[junit-jupiter-engine-5.8.2.jar:5.8.2]
  562.         at org.junit.jupiter.engine.descriptor.TestMethodTestDescriptor.invokeBeforeEachMethods(TestMethodTestDescriptor.java:168) ~[junit-jupiter-engine-5.8.2.jar:5.8.2]
  563.         at org.junit.jupiter.engine.descriptor.TestMethodTestDescriptor.execute(TestMethodTestDescriptor.java:131) ~[junit-jupiter-engine-5.8.2.jar:5.8.2]
  564.         at org.junit.jupiter.engine.descriptor.TestMethodTestDescriptor.execute(TestMethodTestDescriptor.java:66) ~[junit-jupiter-engine-5.8.2.jar:5.8.2]
  565.         at org.junit.platform.engine.support.hierarchical.NodeTestTask.lambda$executeRecursively$6(NodeTestTask.java:151) ~[junit-platform-engine-1.8.2.jar:1.8.2]
  566.         at org.junit.platform.engine.support.hierarchical.ThrowableCollector.execute(ThrowableCollector.java:73) ~[junit-platform-engine-1.8.2.jar:1.8.2]
  567.         at org.junit.platform.engine.support.hierarchical.NodeTestTask.lambda$executeRecursively$8(NodeTestTask.java:141) ~[junit-platform-engine-1.8.2.jar:1.8.2]
  568.         at org.junit.platform.engine.support.hierarchical.Node.around(Node.java:137) ~[junit-platform-engine-1.8.2.jar:1.8.2]
  569.         at org.junit.platform.engine.support.hierarchical.NodeTestTask.lambda$executeRecursively$9(NodeTestTask.java:139) ~[junit-platform-engine-1.8.2.jar:1.8.2]
  570.         at org.junit.platform.engine.support.hierarchical.ThrowableCollector.execute(ThrowableCollector.java:73) ~[junit-platform-engine-1.8.2.jar:1.8.2]
  571.         at org.junit.platform.engine.support.hierarchical.NodeTestTask.executeRecursively(NodeTestTask.java:138) ~[junit-platform-engine-1.8.2.jar:1.8.2]
  572.         at org.junit.platform.engine.support.hierarchical.NodeTestTask.execute(NodeTestTask.java:95) ~[junit-platform-engine-1.8.2.jar:1.8.2]
  573.         at java.util.ArrayList.forEach(ArrayList.java:1257) ~[?:1.8.0_202]
  574.         at org.junit.platform.engine.support.hierarchical.SameThreadHierarchicalTestExecutorService.invokeAll(SameThreadHierarchicalTestExecutorService.java:41) ~[junit-platform-engine-1.8.2.jar:1.8.2]
  575.         at org.junit.platform.engine.support.hierarchical.NodeTestTask.lambda$executeRecursively$6(NodeTestTask.java:155) ~[junit-platform-engine-1.8.2.jar:1.8.2]
  576.         at org.junit.platform.engine.support.hierarchical.ThrowableCollector.execute(ThrowableCollector.java:73) ~[junit-platform-engine-1.8.2.jar:1.8.2]
  577.         at org.junit.platform.engine.support.hierarchical.NodeTestTask.lambda$executeRecursively$8(NodeTestTask.java:141) ~[junit-platform-engine-1.8.2.jar:1.8.2]
  578.         at org.junit.platform.engine.support.hierarchical.Node.around(Node.java:137) ~[junit-platform-engine-1.8.2.jar:1.8.2]
  579.         at org.junit.platform.engine.support.hierarchical.NodeTestTask.lambda$executeRecursively$9(NodeTestTask.java:139) ~[junit-platform-engine-1.8.2.jar:1.8.2]
  580.         at org.junit.platform.engine.support.hierarchical.ThrowableCollector.execute(ThrowableCollector.java:73) ~[junit-platform-engine-1.8.2.jar:1.8.2]
  581.         at org.junit.platform.engine.support.hierarchical.NodeTestTask.executeRecursively(NodeTestTask.java:138) ~[junit-platform-engine-1.8.2.jar:1.8.2]
  582.         at org.junit.platform.engine.support.hierarchical.NodeTestTask.execute(NodeTestTask.java:95) ~[junit-platform-engine-1.8.2.jar:1.8.2]
  583.         at java.util.ArrayList.forEach(ArrayList.java:1257) ~[?:1.8.0_202]
  584.         at org.junit.platform.engine.support.hierarchical.SameThreadHierarchicalTestExecutorService.invokeAll(SameThreadHierarchicalTestExecutorService.java:41) ~[junit-platform-engine-1.8.2.jar:1.8.2]
  585.         at org.junit.platform.engine.support.hierarchical.NodeTestTask.lambda$executeRecursively$6(NodeTestTask.java:155) ~[junit-platform-engine-1.8.2.jar:1.8.2]
  586.         at org.junit.platform.engine.support.hierarchical.ThrowableCollector.execute(ThrowableCollector.java:73) ~[junit-platform-engine-1.8.2.jar:1.8.2]
  587.         at org.junit.platform.engine.support.hierarchical.NodeTestTask.lambda$executeRecursively$8(NodeTestTask.java:141) ~[junit-platform-engine-1.8.2.jar:1.8.2]
  588.         at org.junit.platform.engine.support.hierarchical.Node.around(Node.java:137) ~[junit-platform-engine-1.8.2.jar:1.8.2]
  589.         at org.junit.platform.engine.support.hierarchical.NodeTestTask.lambda$executeRecursively$9(NodeTestTask.java:139) ~[junit-platform-engine-1.8.2.jar:1.8.2]
  590.         at org.junit.platform.engine.support.hierarchical.ThrowableCollector.execute(ThrowableCollector.java:73) ~[junit-platform-engine-1.8.2.jar:1.8.2]
  591.         at org.junit.platform.engine.support.hierarchical.NodeTestTask.executeRecursively(NodeTestTask.java:138) ~[junit-platform-engine-1.8.2.jar:1.8.2]
  592.         at org.junit.platform.engine.support.hierarchical.NodeTestTask.execute(NodeTestTask.java:95) ~[junit-platform-engine-1.8.2.jar:1.8.2]
  593.         at org.junit.platform.engine.support.hierarchical.SameThreadHierarchicalTestExecutorService.submit(SameThreadHierarchicalTestExecutorService.java:35) ~[junit-platform-engine-1.8.2.jar:1.8.2]
  594.         at org.junit.platform.engine.support.hierarchical.HierarchicalTestExecutor.execute(HierarchicalTestExecutor.java:57) ~[junit-platform-engine-1.8.2.jar:1.8.2]
  595.         at org.junit.platform.engine.support.hierarchical.HierarchicalTestEngine.execute(HierarchicalTestEngine.java:54) ~[junit-platform-engine-1.8.2.jar:1.8.2]
  596.         at org.junit.platform.launcher.core.DefaultLauncher.execute(DefaultLauncher.java:220) ~[junit-platform-launcher-1.3.1.jar:1.3.1]
  597.         at org.junit.platform.launcher.core.DefaultLauncher.lambda$execute$6(DefaultLauncher.java:188) ~[junit-platform-launcher-1.3.1.jar:1.3.1]
  598.         at org.junit.platform.launcher.core.DefaultLauncher.withInterceptedStreams(DefaultLauncher.java:202) ~[junit-platform-launcher-1.3.1.jar:1.3.1]
  599.         at org.junit.platform.launcher.core.DefaultLauncher.execute(DefaultLauncher.java:181) ~[junit-platform-launcher-1.3.1.jar:1.3.1]
  600.         at org.junit.platform.launcher.core.DefaultLauncher.execute(DefaultLauncher.java:128) ~[junit-platform-launcher-1.3.1.jar:1.3.1]
  601.         at org.apache.maven.surefire.junitplatform.JUnitPlatformProvider.invokeAllTests(JUnitPlatformProvider.java:150) ~[surefire-junit-platform-2.22.2.jar:2.22.2]
  602.         at org.apache.maven.surefire.junitplatform.JUnitPlatformProvider.invoke(JUnitPlatformProvider.java:124) ~[surefire-junit-platform-2.22.2.jar:2.22.2]
  603.         at org.apache.maven.surefire.booter.ForkedBooter.invokeProviderInSameClassLoader(ForkedBooter.java:384) ~[surefire-booter-2.22.2.jar:2.22.2]
  604.         at org.apache.maven.surefire.booter.ForkedBooter.runSuitesInProcess(ForkedBooter.java:345) ~[surefire-booter-2.22.2.jar:2.22.2]
  605.         at org.apache.maven.surefire.booter.ForkedBooter.execute(ForkedBooter.java:126) ~[surefire-booter-2.22.2.jar:2.22.2]
  606.         at org.apache.maven.surefire.booter.ForkedBooter.main(ForkedBooter.java:418) ~[surefire-booter-2.22.2.jar:2.22.2]
  607. Caused by: java.io.FileNotFoundException: C:\Users\mahim\git2\openmrs-core\liquibase\target\test-classes\org%5copenmrs%5cliquibase%5csnapshots%5cschema-only%5cliquibase-schema-only-SNAPSHOT.xml (The system cannot find the file specified)
  608.         at java.io.FileInputStream.open0(Native Method) ~[?:1.8.0_202]
  609.         at java.io.FileInputStream.open(FileInputStream.java:195) ~[?:1.8.0_202]
  610.         at java.io.FileInputStream.<init>(FileInputStream.java:138) ~[?:1.8.0_202]
  611.         at org.dom4j.io.SAXReader.read(SAXReader.java:304) ~[dom4j-2.1.3.jar:?]
  612.         ... 71 more
  613. [ERROR] Tests run: 7, Failures: 0, Errors: 7, Skipped: 0, Time elapsed: 0.031 s <<< FAILURE! - in org.openmrs.liquibase.SchemaOnlyTunerTest
  614. [ERROR] shouldDetectWrongNumberOfLongtextNodes  Time elapsed: 0.005 s  <<< ERROR!
  615. org.dom4j.DocumentException: C:\Users\mahim\git2\openmrs-core\liquibase\target\test-classes\org%5copenmrs%5cliquibase%5csnapshots%5cschema-only%5cliquibase-schema-only-SNAPSHOT.xml (The system cannot find the file specified)
  616.         at org.openmrs.liquibase.SchemaOnlyTunerTest.setup(SchemaOnlyTunerTest.java:57)
  617. Caused by: java.io.FileNotFoundException: C:\Users\mahim\git2\openmrs-core\liquibase\target\test-classes\org%5copenmrs%5cliquibase%5csnapshots%5cschema-only%5cliquibase-schema-only-SNAPSHOT.xml (The system cannot find the file specified)
  618.         at org.openmrs.liquibase.SchemaOnlyTunerTest.setup(SchemaOnlyTunerTest.java:57)
  619.  
  620. [ERROR] shouldReplaceBitTypeWithBooleanType  Time elapsed: 0.003 s  <<< ERROR!
  621. org.dom4j.DocumentException: C:\Users\mahim\git2\openmrs-core\liquibase\target\test-classes\org%5copenmrs%5cliquibase%5csnapshots%5cschema-only%5cliquibase-schema-only-SNAPSHOT.xml (The system cannot find the file specified)
  622.         at org.openmrs.liquibase.SchemaOnlyTunerTest.setup(SchemaOnlyTunerTest.java:57)
  623. Caused by: java.io.FileNotFoundException: C:\Users\mahim\git2\openmrs-core\liquibase\target\test-classes\org%5copenmrs%5cliquibase%5csnapshots%5cschema-only%5cliquibase-schema-only-SNAPSHOT.xml (The system cannot find the file specified)
  624.         at org.openmrs.liquibase.SchemaOnlyTunerTest.setup(SchemaOnlyTunerTest.java:57)
  625.  
  626. [ERROR] shouldCreateUpdatedChangeLogFile{Path}  Time elapsed: 0.005 s  <<< ERROR!
  627. org.dom4j.DocumentException: C:\Users\mahim\git2\openmrs-core\liquibase\target\test-classes\org%5copenmrs%5cliquibase%5csnapshots%5cschema-only%5cliquibase-schema-only-SNAPSHOT.xml (The system cannot find the file specified)
  628.         at org.openmrs.liquibase.SchemaOnlyTunerTest.setup(SchemaOnlyTunerTest.java:57)
  629. Caused by: java.io.FileNotFoundException: C:\Users\mahim\git2\openmrs-core\liquibase\target\test-classes\org%5copenmrs%5cliquibase%5csnapshots%5cschema-only%5cliquibase-schema-only-SNAPSHOT.xml (The system cannot find the file specified)
  630.         at org.openmrs.liquibase.SchemaOnlyTunerTest.setup(SchemaOnlyTunerTest.java:57)
  631.  
  632. [ERROR] shouldReplaceLongtextTypeWithClobType  Time elapsed: 0.005 s  <<< ERROR!
  633. org.dom4j.DocumentException: C:\Users\mahim\git2\openmrs-core\liquibase\target\test-classes\org%5copenmrs%5cliquibase%5csnapshots%5cschema-only%5cliquibase-schema-only-SNAPSHOT.xml (The system cannot find the file specified)
  634.         at org.openmrs.liquibase.SchemaOnlyTunerTest.setup(SchemaOnlyTunerTest.java:57)
  635. Caused by: java.io.FileNotFoundException: C:\Users\mahim\git2\openmrs-core\liquibase\target\test-classes\org%5copenmrs%5cliquibase%5csnapshots%5cschema-only%5cliquibase-schema-only-SNAPSHOT.xml (The system cannot find the file specified)
  636.         at org.openmrs.liquibase.SchemaOnlyTunerTest.setup(SchemaOnlyTunerTest.java:57)
  637.  
  638. [ERROR] shouldDetectWrongGrandParentNodeOfLongtextNode  Time elapsed: 0.007 s  <<< ERROR!
  639. org.dom4j.DocumentException: C:\Users\mahim\git2\openmrs-core\liquibase\target\test-classes\org%5copenmrs%5cliquibase%5csnapshots%5cschema-only%5cliquibase-schema-only-SNAPSHOT.xml (The system cannot find the file specified)
  640.         at org.openmrs.liquibase.SchemaOnlyTunerTest.setup(SchemaOnlyTunerTest.java:57)
  641. Caused by: java.io.FileNotFoundException: C:\Users\mahim\git2\openmrs-core\liquibase\target\test-classes\org%5copenmrs%5cliquibase%5csnapshots%5cschema-only%5cliquibase-schema-only-SNAPSHOT.xml (The system cannot find the file specified)
  642.         at org.openmrs.liquibase.SchemaOnlyTunerTest.setup(SchemaOnlyTunerTest.java:57)
  643.  
  644. [ERROR] shouldAssertLongtextNode  Time elapsed: 0.002 s  <<< ERROR!
  645. org.dom4j.DocumentException: C:\Users\mahim\git2\openmrs-core\liquibase\target\test-classes\org%5copenmrs%5cliquibase%5csnapshots%5cschema-only%5cliquibase-schema-only-SNAPSHOT.xml (The system cannot find the file specified)
  646.         at org.openmrs.liquibase.SchemaOnlyTunerTest.setup(SchemaOnlyTunerTest.java:57)
  647. Caused by: java.io.FileNotFoundException: C:\Users\mahim\git2\openmrs-core\liquibase\target\test-classes\org%5copenmrs%5cliquibase%5csnapshots%5cschema-only%5cliquibase-schema-only-SNAPSHOT.xml (The system cannot find the file specified)
  648.         at org.openmrs.liquibase.SchemaOnlyTunerTest.setup(SchemaOnlyTunerTest.java:57)
  649.  
  650. [ERROR] shouldDetachChangeSetsForLiquibaseTables  Time elapsed: 0.004 s  <<< ERROR!
  651. org.dom4j.DocumentException: C:\Users\mahim\git2\openmrs-core\liquibase\target\test-classes\org%5copenmrs%5cliquibase%5csnapshots%5cschema-only%5cliquibase-schema-only-SNAPSHOT.xml (The system cannot find the file specified)
  652.         at org.openmrs.liquibase.SchemaOnlyTunerTest.setup(SchemaOnlyTunerTest.java:57)
  653. Caused by: java.io.FileNotFoundException: C:\Users\mahim\git2\openmrs-core\liquibase\target\test-classes\org%5copenmrs%5cliquibase%5csnapshots%5cschema-only%5cliquibase-schema-only-SNAPSHOT.xml (The system cannot find the file specified)
  654.         at org.openmrs.liquibase.SchemaOnlyTunerTest.setup(SchemaOnlyTunerTest.java:57)
  655.  
  656. [INFO]
  657. [INFO] Results:
  658. [INFO]
  659. [ERROR] Errors:
  660. [ERROR]   CoreDataTunerTest.setup:63 » Document C:\Users\mahim\git2\openmrs-core\liquiba...
  661. [ERROR]   CoreDataTunerTest.setup:63 » Document C:\Users\mahim\git2\openmrs-core\liquiba...
  662. [ERROR]   CoreDataTunerTest.setup:63 » Document C:\Users\mahim\git2\openmrs-core\liquiba...
  663. [ERROR]   CoreDataTunerTest.setup:63 » Document C:\Users\mahim\git2\openmrs-core\liquiba...
  664. [ERROR]   CoreDataTunerTest.setup:63 » Document C:\Users\mahim\git2\openmrs-core\liquiba...
  665. [ERROR]   CoreDataTunerTest.setup:63 » Document C:\Users\mahim\git2\openmrs-core\liquiba...
  666. [ERROR]   CoreDataTunerTest.setup:63 » Document C:\Users\mahim\git2\openmrs-core\liquiba...
  667. [ERROR]   CoreDataTunerTest.setup:63 » Document C:\Users\mahim\git2\openmrs-core\liquiba...
  668. [ERROR]   SchemaOnlyTunerTest.setup:57 » Document C:\Users\mahim\git2\openmrs-core\liqui...
  669. [ERROR]   SchemaOnlyTunerTest.setup:57 » Document C:\Users\mahim\git2\openmrs-core\liqui...
  670. [ERROR]   SchemaOnlyTunerTest.setup:57 » Document C:\Users\mahim\git2\openmrs-core\liqui...
  671. [ERROR]   SchemaOnlyTunerTest.setup:57 » Document C:\Users\mahim\git2\openmrs-core\liqui...
  672. [ERROR]   SchemaOnlyTunerTest.setup:57 » Document C:\Users\mahim\git2\openmrs-core\liqui...
  673. [ERROR]   SchemaOnlyTunerTest.setup:57 » Document C:\Users\mahim\git2\openmrs-core\liqui...
  674. [ERROR]   SchemaOnlyTunerTest.setup:57 » Document C:\Users\mahim\git2\openmrs-core\liqui...
  675. [INFO]
  676. [ERROR] Tests run: 22, Failures: 0, Errors: 15, Skipped: 0
  677. [INFO]
  678. [INFO] ------------------------------------------------------------------------
  679. [INFO] Reactor Summary for OpenMRS 2.6.0-SNAPSHOT:
  680. [INFO]
  681. [INFO] OpenMRS ............................................ SUCCESS [  2.787 s]
  682. [INFO] openmrs-tools ...................................... SUCCESS [  1.869 s]
  683. [INFO] openmrs-test ....................................... SUCCESS [  0.345 s]
  684. [INFO] openmrs-api ........................................ SUCCESS [10:20 min]
  685. [INFO] openmrs-web ........................................ SUCCESS [ 21.859 s]
  686. [INFO] openmrs-webapp ..................................... SUCCESS [  3.766 s]
  687. [INFO] openmrs-liquibase .................................. FAILURE [  3.419 s]
  688. [INFO] ------------------------------------------------------------------------
  689. [INFO] BUILD FAILURE
  690. [INFO] ------------------------------------------------------------------------
  691. [INFO] Total time:  10:55 min
  692. [INFO] Finished at: 2022-07-23T16:35:06+01:00
  693. [INFO] ------------------------------------------------------------------------
  694. [ERROR] Failed to execute goal org.apache.maven.plugins:maven-surefire-plugin:2.22.2:test (default-test) on project openmrs-liquibase: There are test failures.
  695. [ERROR]
  696. [ERROR] Please refer to C:\Users\mahim\git2\openmrs-core\liquibase\target\surefire-reports for the individual test results.
  697. [ERROR] Please refer to dump files (if any exist) [date].dump, [date]-jvmRun[N].dump and [date].dumpstream.
  698. [ERROR] -> [Help 1]
  699. [ERROR]
  700. [ERROR] To see the full stack trace of the errors, re-run Maven with the -e switch.
  701. [ERROR] Re-run Maven using the -X switch to enable full debug logging.
  702. [ERROR]
  703. [ERROR] For more information about the errors and possible solutions, please read the following articles:
  704. [ERROR] [Help 1] http://cwiki.apache.org/confluence/display/MAVEN/MojoFailureException
  705. [ERROR]
  706. [ERROR] After correcting the problems, you can resume the build with the command
  707. [ERROR]   mvn <args> -rf :openmrs-liquibase
Advertisement
Add Comment
Please, Sign In to add comment
Advertisement