Guest User

Ughh'

a guest
Jan 19th, 2020
213
Never
Not a member of Pastebin yet? Sign Up, it unlocks many cool features!
  1.  
  2. > Task :runClient FAILED
  3.  
  4. FAILURE: Build failed with an exception.
  5.  
  6. * What went wrong:
  7. Execution failed for task ':runClient'.
  8. > Process 'command 'C:\Program Files\Java\jdk1.8.0_241\bin\java.exe'' finished with non-zero exit value 1
  9.  
  10. * Try:
  11. Run with --stacktrace option to get the stack trace. Run with --info or --debug option to get more log output. Run with --scan to get full insights.
  12.  
  13. * Get more help at https://help.gradle.org
  14.  
  15. Deprecated Gradle features were used in this build, making it incompatible with Gradle 5.0.
  16. Use '--warning-mode all' to show the individual deprecation warnings.
  17. See https://docs.gradle.org/4.9/userguide/command_line_interface.html#sec:command_line_warnings
  18.  
  19. BUILD FAILED in 23s
  20. 6 actionable tasks: 2 executed, 4 up-to-date
RAW Paste Data

Adblocker detected! Please consider disabling it...

We've detected AdBlock Plus or some other adblocking software preventing Pastebin.com from fully loading.

We don't have any obnoxious sound, or popup ads, we actively block these annoying types of ads!

Please add Pastebin.com to your ad blocker whitelist or disable your adblocking software.

×