Guest User

Untitled

a guest
Jun 17th, 2021
12
Never
Not a member of Pastebin yet? Sign Up, it unlocks many cool features!
  1. Command line: -mp -release -static -static-runtime -confirm-license -opengl dynamic -optimize-size -opensource -no-feature-d3d12 -nomake tools -nomake examples -nomake tests -ssl -openssl -openssl-linked -I C:\Qt\OpenSSL\OpenSSL-1.1.1\static\x64\Release\include -L C:\Qt\OpenSSL\OpenSSL-1.1.1\static\x64\Release\lib -prefix C:\Qt\QtStatic\x64\5.15.2-NoD3D\msvc
  2. executing config test verifyspec
  3. + cd /d C:\qt-everywhere-src-5.15.2\config.tests\verifyspec && C:\qt-everywhere-src-5.15.2\qtbase\bin\qmake.exe "CONFIG -= qt debug_and_release app_bundle lib_bundle" "CONFIG += static warn_off console single_arch" "QMAKE_LIBDIR += C:\\Qt\\OpenSSL\\OpenSSL-1.1.1\\static\\x64\\Release\\lib" "INCLUDEPATH += C:\\Qt\\OpenSSL\\OpenSSL-1.1.1\\static\\x64\\Release\\include" C:/qt-everywhere-src-5.15.2/qtbase/config.tests/verifyspec
  4. + cd /d C:\qt-everywhere-src-5.15.2\config.tests\verifyspec && set MAKEFLAGS=& nmake clean && set MAKEFLAGS=& nmake
  5. > Microsoft (R) Program Maintenance Utility Version 14.16.27045.0
  6. > Copyright (C) Microsoft Corporation. All rights reserved.
  7. > del verifyspec.obj
  8. > Microsoft (R) Program Maintenance Utility Version 14.16.27045.0
  9. > Copyright (C) Microsoft Corporation. All rights reserved.
  10. > cl -c -nologo -Zc:wchar_t -FS -Zc:rvalueCast -Zc:inline -Zc:strictStrings -Zc:throwingNew -Zc:referenceBinding -Zc:__cplusplus -O2 -MT -W0 -EHsc -DUNICODE -D_UNICODE -DWIN32 -D_ENABLE_EXTENDED_ALIGNED_STORAGE -DWIN64 -DNDEBUG -IC:\qt-everywhere-src-5.15.2\qtbase\config.tests\verifyspec -I. -IC:\Qt\OpenSSL\OpenSSL-1.1.1\static\x64\Release\include -IC:\qt-everywhere-src-5.15.2\qtbase\mkspecs\win32-msvc -Fo @C:\Users\MyUser\AppData\Local\Temp\nm5B55.tmp
  11. > verifyspec.cpp
  12. > link /NOLOGO /DYNAMICBASE /NXCOMPAT /OPT:REF /INCREMENTAL:NO /SUBSYSTEM:CONSOLE "/MANIFESTDEPENDENCY:type='win32' name='Microsoft.Windows.Common-Controls' version='6.0.0.0' publicKeyToken='6595b64144ccf1df' language='*' processorArchitecture='*'" /MANIFEST:embed /OUT:verifyspec.exe @C:\Users\MyUser\AppData\Local\Temp\nm5B85.tmp
  13. test config.qtbase.tests.verifyspec succeeded
  14. executing config test architecture
  15. + cd /d C:\qt-everywhere-src-5.15.2\config.tests\arch && C:\qt-everywhere-src-5.15.2\qtbase\bin\qmake.exe "CONFIG -= qt debug_and_release app_bundle lib_bundle" "CONFIG += static warn_off console single_arch" "QMAKE_LIBDIR += C:\\Qt\\OpenSSL\\OpenSSL-1.1.1\\static\\x64\\Release\\lib" "INCLUDEPATH += C:\\Qt\\OpenSSL\\OpenSSL-1.1.1\\static\\x64\\Release\\include" C:/qt-everywhere-src-5.15.2/qtbase/config.tests/arch
  16. + cd /d C:\qt-everywhere-src-5.15.2\config.tests\arch && set MAKEFLAGS=& nmake clean && set MAKEFLAGS=& nmake
  17. > Microsoft (R) Program Maintenance Utility Version 14.16.27045.0
  18. > Copyright (C) Microsoft Corporation. All rights reserved.
  19. > del arch.obj
  20. > Microsoft (R) Program Maintenance Utility Version 14.16.27045.0
  21. > Copyright (C) Microsoft Corporation. All rights reserved.
  22. > cl -c -nologo -Zc:wchar_t -FS -Zc:rvalueCast -Zc:inline -Zc:strictStrings -Zc:throwingNew -Zc:referenceBinding -Zc:__cplusplus -O2 -MT -W0 -EHsc -DUNICODE -D_UNICODE -DWIN32 -D_ENABLE_EXTENDED_ALIGNED_STORAGE -DWIN64 -DNDEBUG -IC:\qt-everywhere-src-5.15.2\qtbase\config.tests\arch -I. -IC:\Qt\OpenSSL\OpenSSL-1.1.1\static\x64\Release\include -IC:\qt-everywhere-src-5.15.2\qtbase\mkspecs\win32-msvc -Fo @C:\Users\MyUser\AppData\Local\Temp\nm5C30.tmp
  23. > arch.cpp
  24. > link /NOLOGO /DYNAMICBASE /NXCOMPAT /OPT:REF /INCREMENTAL:NO /SUBSYSTEM:CONSOLE "/MANIFESTDEPENDENCY:type='win32' name='Microsoft.Windows.Common-Controls' version='6.0.0.0' publicKeyToken='6595b64144ccf1df' language='*' processorArchitecture='*'" /MANIFEST:embed /OUT:arch.exe @C:\Users\MyUser\AppData\Local\Temp\nm5C60.tmp
  25. Detected architecture: x86_64 (sse sse2)
  26. test config.qtbase.tests.architecture gave result x86_64
  27. executing config test sse2
  28. + cd /d C:\qt-everywhere-src-5.15.2\config.tests\x86_simd && C:\qt-everywhere-src-5.15.2\qtbase\bin\qmake.exe "CONFIG -= qt debug_and_release app_bundle lib_bundle" "CONFIG += static warn_off console single_arch" "QMAKE_LIBDIR += C:\\Qt\\OpenSSL\\OpenSSL-1.1.1\\static\\x64\\Release\\lib" "INCLUDEPATH += C:\\Qt\\OpenSSL\\OpenSSL-1.1.1\\static\\x64\\Release\\include" "CONFIG+=add_cflags" "DEFINES+=NO_ATTRIBUTE" "SIMD=sse2" C:/qt-everywhere-src-5.15.2/qtbase/config.tests/x86_simd
  29. + cd /d C:\qt-everywhere-src-5.15.2\config.tests\x86_simd && set MAKEFLAGS=& nmake clean && set MAKEFLAGS=& nmake
  30. > Microsoft (R) Program Maintenance Utility Version 14.16.27045.0
  31. > Copyright (C) Microsoft Corporation. All rights reserved.
  32. > del main.obj
  33. > Microsoft (R) Program Maintenance Utility Version 14.16.27045.0
  34. > Copyright (C) Microsoft Corporation. All rights reserved.
  35. > cl -c -nologo -Zc:wchar_t -FS -Zc:rvalueCast -Zc:inline -Zc:strictStrings -Zc:throwingNew -Zc:referenceBinding -Zc:__cplusplus -O2 -MT -W0 -EHsc -DUNICODE -D_UNICODE -DWIN32 -D_ENABLE_EXTENDED_ALIGNED_STORAGE -DWIN64 -DNO_ATTRIBUTE -DQT_COMPILER_SUPPORTS_SSE2 -DNDEBUG -IC:\qt-everywhere-src-5.15.2\qtbase\config.tests\x86_simd -I. -IC:\Qt\OpenSSL\OpenSSL-1.1.1\static\x64\Release\include -IC:\qt-everywhere-src-5.15.2\qtbase\mkspecs\win32-msvc -Fo @C:\Users\MyUser\AppData\Local\Temp\nm5D49.tmp
  36. > main.cpp
  37. > link /NOLOGO /DYNAMICBASE /NXCOMPAT /OPT:REF /INCREMENTAL:NO /SUBSYSTEM:CONSOLE "/MANIFESTDEPENDENCY:type='win32' name='Microsoft.Windows.Common-Controls' version='6.0.0.0' publicKeyToken='6595b64144ccf1df' language='*' processorArchitecture='*'" /MANIFEST:embed /OUT:x86_simd.exe @C:\Users\MyUser\AppData\Local\Temp\nm5D89.tmp
  38. test config.qtbase.tests.sse2 succeeded
  39. executing config test aesni
  40. + cd /d C:\qt-everywhere-src-5.15.2\config.tests\x86_simd && C:\qt-everywhere-src-5.15.2\qtbase\bin\qmake.exe "CONFIG -= qt debug_and_release app_bundle lib_bundle" "CONFIG += static warn_off console single_arch" "QMAKE_LIBDIR += C:\\Qt\\OpenSSL\\OpenSSL-1.1.1\\static\\x64\\Release\\lib" "INCLUDEPATH += C:\\Qt\\OpenSSL\\OpenSSL-1.1.1\\static\\x64\\Release\\include" "CONFIG+=add_cflags" "DEFINES+=NO_ATTRIBUTE" "SIMD=aesni" C:/qt-everywhere-src-5.15.2/qtbase/config.tests/x86_simd
  41. + cd /d C:\qt-everywhere-src-5.15.2\config.tests\x86_simd && set MAKEFLAGS=& nmake clean && set MAKEFLAGS=& nmake
  42. > Microsoft (R) Program Maintenance Utility Version 14.16.27045.0
  43. > Copyright (C) Microsoft Corporation. All rights reserved.
  44. > del main.obj
  45. > Microsoft (R) Program Maintenance Utility Version 14.16.27045.0
  46. > Copyright (C) Microsoft Corporation. All rights reserved.
  47. > cl -c -nologo -Zc:wchar_t -FS -Zc:rvalueCast -Zc:inline -Zc:strictStrings -Zc:throwingNew -Zc:referenceBinding -Zc:__cplusplus -O2 -MT -W0 -EHsc -DUNICODE -D_UNICODE -DWIN32 -D_ENABLE_EXTENDED_ALIGNED_STORAGE -DWIN64 -DNO_ATTRIBUTE -DQT_COMPILER_SUPPORTS_AESNI -DNDEBUG -IC:\qt-everywhere-src-5.15.2\qtbase\config.tests\x86_simd -I. -IC:\Qt\OpenSSL\OpenSSL-1.1.1\static\x64\Release\include -IC:\qt-everywhere-src-5.15.2\qtbase\mkspecs\win32-msvc -Fo @C:\Users\MyUser\AppData\Local\Temp\nm5E34.tmp
  48. > main.cpp
  49. > link /NOLOGO /DYNAMICBASE /NXCOMPAT /OPT:REF /INCREMENTAL:NO /SUBSYSTEM:CONSOLE "/MANIFESTDEPENDENCY:type='win32' name='Microsoft.Windows.Common-Controls' version='6.0.0.0' publicKeyToken='6595b64144ccf1df' language='*' processorArchitecture='*'" /MANIFEST:embed /OUT:x86_simd.exe @C:\Users\MyUser\AppData\Local\Temp\nm5E73.tmp
  50. test config.qtbase.tests.aesni succeeded
  51. executing config test alloca_h
  52. + cd /d C:\qt-everywhere-src-5.15.2\config.tests\alloca_h && C:\qt-everywhere-src-5.15.2\qtbase\bin\qmake.exe "CONFIG -= qt debug_and_release app_bundle lib_bundle" "CONFIG += static warn_off console single_arch" "QMAKE_LIBDIR += C:\\Qt\\OpenSSL\\OpenSSL-1.1.1\\static\\x64\\Release\\lib" "INCLUDEPATH += C:\\Qt\\OpenSSL\\OpenSSL-1.1.1\\static\\x64\\Release\\include" C:/qt-everywhere-src-5.15.2/config.tests/alloca_h
  53. + cd /d C:\qt-everywhere-src-5.15.2\config.tests\alloca_h && set MAKEFLAGS=& nmake clean && set MAKEFLAGS=& nmake
  54. > Microsoft (R) Program Maintenance Utility Version 14.16.27045.0
  55. > Copyright (C) Microsoft Corporation. All rights reserved.
  56. > del main.obj
  57. > Could Not Find C:\qt-everywhere-src-5.15.2\config.tests\alloca_h\main.obj
  58. > Microsoft (R) Program Maintenance Utility Version 14.16.27045.0
  59. > Copyright (C) Microsoft Corporation. All rights reserved.
  60. > cl -c -nologo -Zc:wchar_t -FS -Zc:rvalueCast -Zc:inline -Zc:strictStrings -Zc:throwingNew -Zc:referenceBinding -Zc:__cplusplus -O2 -MT -W0 -EHsc -DUNICODE -D_UNICODE -DWIN32 -D_ENABLE_EXTENDED_ALIGNED_STORAGE -DWIN64 -DNDEBUG -I. -IC:\Qt\OpenSSL\OpenSSL-1.1.1\static\x64\Release\include -IC:\qt-everywhere-src-5.15.2\qtbase\mkspecs\win32-msvc -Fo @C:\Users\MyUser\AppData\Local\Temp\nm5F1E.tmp
  61. > main.cpp
  62. > .\main.cpp(2): fatal error C1083: Cannot open include file: 'alloca.h': No such file or directory
  63. > NMAKE : fatal error U1077: '"C:\Program Files (x86)\Microsoft Visual Studio\2017\Professional\VC\Tools\MSVC\14.16.27023\bin\HostX64\x64\cl.EXE"' : return code '0x2'
  64. > Stop.
  65. test config.qtbase.tests.alloca_h FAILED
  66. executing config test alloca_malloc_h
  67. + cd /d C:\qt-everywhere-src-5.15.2\config.tests\alloca_malloc_h && C:\qt-everywhere-src-5.15.2\qtbase\bin\qmake.exe "CONFIG -= qt debug_and_release app_bundle lib_bundle" "CONFIG += static warn_off console single_arch" "QMAKE_LIBDIR += C:\\Qt\\OpenSSL\\OpenSSL-1.1.1\\static\\x64\\Release\\lib" "INCLUDEPATH += C:\\Qt\\OpenSSL\\OpenSSL-1.1.1\\static\\x64\\Release\\include" C:/qt-everywhere-src-5.15.2/config.tests/alloca_malloc_h
  68. + cd /d C:\qt-everywhere-src-5.15.2\config.tests\alloca_malloc_h && set MAKEFLAGS=& nmake clean && set MAKEFLAGS=& nmake
  69. > Microsoft (R) Program Maintenance Utility Version 14.16.27045.0
  70. > Copyright (C) Microsoft Corporation. All rights reserved.
  71. > del main.obj
  72. > Microsoft (R) Program Maintenance Utility Version 14.16.27045.0
  73. > Copyright (C) Microsoft Corporation. All rights reserved.
  74. > cl -c -nologo -Zc:wchar_t -FS -Zc:rvalueCast -Zc:inline -Zc:strictStrings -Zc:throwingNew -Zc:referenceBinding -Zc:__cplusplus -O2 -MT -W0 -EHsc -DUNICODE -D_UNICODE -DWIN32 -D_ENABLE_EXTENDED_ALIGNED_STORAGE -DWIN64 -DNDEBUG -I. -IC:\Qt\OpenSSL\OpenSSL-1.1.1\static\x64\Release\include -IC:\qt-everywhere-src-5.15.2\qtbase\mkspecs\win32-msvc -Fo @C:\Users\MyUser\AppData\Local\Temp\nm5FAB.tmp
  75. > main.cpp
  76. > link /NOLOGO /DYNAMICBASE /NXCOMPAT /OPT:REF /INCREMENTAL:NO /SUBSYSTEM:CONSOLE "/MANIFESTDEPENDENCY:type='win32' name='Microsoft.Windows.Common-Controls' version='6.0.0.0' publicKeyToken='6595b64144ccf1df' language='*' processorArchitecture='*'" /MANIFEST:embed /OUT:alloca_malloc_h.exe @C:\Users\MyUser\AppData\Local\Temp\nm5FDB.tmp
  77. test config.qtbase.tests.alloca_malloc_h succeeded
  78. executing config test sse3
  79. + cd /d C:\qt-everywhere-src-5.15.2\config.tests\x86_simd && C:\qt-everywhere-src-5.15.2\qtbase\bin\qmake.exe "CONFIG -= qt debug_and_release app_bundle lib_bundle" "CONFIG += static warn_off console single_arch" "QMAKE_LIBDIR += C:\\Qt\\OpenSSL\\OpenSSL-1.1.1\\static\\x64\\Release\\lib" "INCLUDEPATH += C:\\Qt\\OpenSSL\\OpenSSL-1.1.1\\static\\x64\\Release\\include" "CONFIG+=add_cflags" "DEFINES+=NO_ATTRIBUTE" "SIMD=sse3" C:/qt-everywhere-src-5.15.2/qtbase/config.tests/x86_simd
  80. + cd /d C:\qt-everywhere-src-5.15.2\config.tests\x86_simd && set MAKEFLAGS=& nmake clean && set MAKEFLAGS=& nmake
  81. > Microsoft (R) Program Maintenance Utility Version 14.16.27045.0
  82. > Copyright (C) Microsoft Corporation. All rights reserved.
  83. > del main.obj
  84. > Microsoft (R) Program Maintenance Utility Version 14.16.27045.0
  85. > Copyright (C) Microsoft Corporation. All rights reserved.
  86. > cl -c -nologo -Zc:wchar_t -FS -Zc:rvalueCast -Zc:inline -Zc:strictStrings -Zc:throwingNew -Zc:referenceBinding -Zc:__cplusplus -O2 -MT -W0 -EHsc -DUNICODE -D_UNICODE -DWIN32 -D_ENABLE_EXTENDED_ALIGNED_STORAGE -DWIN64 -DNO_ATTRIBUTE -DQT_COMPILER_SUPPORTS_SSE3 -DNDEBUG -IC:\qt-everywhere-src-5.15.2\qtbase\config.tests\x86_simd -I. -IC:\Qt\OpenSSL\OpenSSL-1.1.1\static\x64\Release\include -IC:\qt-everywhere-src-5.15.2\qtbase\mkspecs\win32-msvc -Fo @C:\Users\MyUser\AppData\Local\Temp\nm6086.tmp
  87. > main.cpp
  88. > link /NOLOGO /DYNAMICBASE /NXCOMPAT /OPT:REF /INCREMENTAL:NO /SUBSYSTEM:CONSOLE "/MANIFESTDEPENDENCY:type='win32' name='Microsoft.Windows.Common-Controls' version='6.0.0.0' publicKeyToken='6595b64144ccf1df' language='*' processorArchitecture='*'" /MANIFEST:embed /OUT:x86_simd.exe @C:\Users\MyUser\AppData\Local\Temp\nm60C5.tmp
  89. test config.qtbase.tests.sse3 succeeded
  90. executing config test ssse3
  91. + cd /d C:\qt-everywhere-src-5.15.2\config.tests\x86_simd && C:\qt-everywhere-src-5.15.2\qtbase\bin\qmake.exe "CONFIG -= qt debug_and_release app_bundle lib_bundle" "CONFIG += static warn_off console single_arch" "QMAKE_LIBDIR += C:\\Qt\\OpenSSL\\OpenSSL-1.1.1\\static\\x64\\Release\\lib" "INCLUDEPATH += C:\\Qt\\OpenSSL\\OpenSSL-1.1.1\\static\\x64\\Release\\include" "CONFIG+=add_cflags" "DEFINES+=NO_ATTRIBUTE" "SIMD=ssse3" C:/qt-everywhere-src-5.15.2/qtbase/config.tests/x86_simd
  92. + cd /d C:\qt-everywhere-src-5.15.2\config.tests\x86_simd && set MAKEFLAGS=& nmake clean && set MAKEFLAGS=& nmake
  93. > Microsoft (R) Program Maintenance Utility Version 14.16.27045.0
  94. > Copyright (C) Microsoft Corporation. All rights reserved.
  95. > del main.obj
  96. > Microsoft (R) Program Maintenance Utility Version 14.16.27045.0
  97. > Copyright (C) Microsoft Corporation. All rights reserved.
  98. > cl -c -nologo -Zc:wchar_t -FS -Zc:rvalueCast -Zc:inline -Zc:strictStrings -Zc:throwingNew -Zc:referenceBinding -Zc:__cplusplus -O2 -MT -W0 -EHsc -DUNICODE -D_UNICODE -DWIN32 -D_ENABLE_EXTENDED_ALIGNED_STORAGE -DWIN64 -DNO_ATTRIBUTE -DQT_COMPILER_SUPPORTS_SSSE3 -DNDEBUG -IC:\qt-everywhere-src-5.15.2\qtbase\config.tests\x86_simd -I. -IC:\Qt\OpenSSL\OpenSSL-1.1.1\static\x64\Release\include -IC:\qt-everywhere-src-5.15.2\qtbase\mkspecs\win32-msvc -Fo @C:\Users\MyUser\AppData\Local\Temp\nm6170.tmp
  99. > main.cpp
  100. > link /NOLOGO /DYNAMICBASE /NXCOMPAT /OPT:REF /INCREMENTAL:NO /SUBSYSTEM:CONSOLE "/MANIFESTDEPENDENCY:type='win32' name='Microsoft.Windows.Common-Controls' version='6.0.0.0' publicKeyToken='6595b64144ccf1df' language='*' processorArchitecture='*'" /MANIFEST:embed /OUT:x86_simd.exe @C:\Users\MyUser\AppData\Local\Temp\nm61AF.tmp
  101. test config.qtbase.tests.ssse3 succeeded
  102. executing config test sse4_1
  103. + cd /d C:\qt-everywhere-src-5.15.2\config.tests\x86_simd && C:\qt-everywhere-src-5.15.2\qtbase\bin\qmake.exe "CONFIG -= qt debug_and_release app_bundle lib_bundle" "CONFIG += static warn_off console single_arch" "QMAKE_LIBDIR += C:\\Qt\\OpenSSL\\OpenSSL-1.1.1\\static\\x64\\Release\\lib" "INCLUDEPATH += C:\\Qt\\OpenSSL\\OpenSSL-1.1.1\\static\\x64\\Release\\include" "CONFIG+=add_cflags" "DEFINES+=NO_ATTRIBUTE" "SIMD=sse4_1" C:/qt-everywhere-src-5.15.2/qtbase/config.tests/x86_simd
  104. + cd /d C:\qt-everywhere-src-5.15.2\config.tests\x86_simd && set MAKEFLAGS=& nmake clean && set MAKEFLAGS=& nmake
  105. > Microsoft (R) Program Maintenance Utility Version 14.16.27045.0
  106. > Copyright (C) Microsoft Corporation. All rights reserved.
  107. > del main.obj
  108. > Microsoft (R) Program Maintenance Utility Version 14.16.27045.0
  109. > Copyright (C) Microsoft Corporation. All rights reserved.
  110. > cl -c -nologo -Zc:wchar_t -FS -Zc:rvalueCast -Zc:inline -Zc:strictStrings -Zc:throwingNew -Zc:referenceBinding -Zc:__cplusplus -O2 -MT -W0 -EHsc -DUNICODE -D_UNICODE -DWIN32 -D_ENABLE_EXTENDED_ALIGNED_STORAGE -DWIN64 -DNO_ATTRIBUTE -DQT_COMPILER_SUPPORTS_SSE4_1 -DNDEBUG -IC:\qt-everywhere-src-5.15.2\qtbase\config.tests\x86_simd -I. -IC:\Qt\OpenSSL\OpenSSL-1.1.1\static\x64\Release\include -IC:\qt-everywhere-src-5.15.2\qtbase\mkspecs\win32-msvc -Fo @C:\Users\MyUser\AppData\Local\Temp\nm625A.tmp
  111. > main.cpp
  112. > link /NOLOGO /DYNAMICBASE /NXCOMPAT /OPT:REF /INCREMENTAL:NO /SUBSYSTEM:CONSOLE "/MANIFESTDEPENDENCY:type='win32' name='Microsoft.Windows.Common-Controls' version='6.0.0.0' publicKeyToken='6595b64144ccf1df' language='*' processorArchitecture='*'" /MANIFEST:embed /OUT:x86_simd.exe @C:\Users\MyUser\AppData\Local\Temp\nm629A.tmp
  113. test config.qtbase.tests.sse4_1 succeeded
  114. executing config test sse4_2
  115. + cd /d C:\qt-everywhere-src-5.15.2\config.tests\x86_simd && C:\qt-everywhere-src-5.15.2\qtbase\bin\qmake.exe "CONFIG -= qt debug_and_release app_bundle lib_bundle" "CONFIG += static warn_off console single_arch" "QMAKE_LIBDIR += C:\\Qt\\OpenSSL\\OpenSSL-1.1.1\\static\\x64\\Release\\lib" "INCLUDEPATH += C:\\Qt\\OpenSSL\\OpenSSL-1.1.1\\static\\x64\\Release\\include" "CONFIG+=add_cflags" "DEFINES+=NO_ATTRIBUTE" "SIMD=sse4_2" C:/qt-everywhere-src-5.15.2/qtbase/config.tests/x86_simd
  116. + cd /d C:\qt-everywhere-src-5.15.2\config.tests\x86_simd && set MAKEFLAGS=& nmake clean && set MAKEFLAGS=& nmake
  117. > Microsoft (R) Program Maintenance Utility Version 14.16.27045.0
  118. > Copyright (C) Microsoft Corporation. All rights reserved.
  119. > del main.obj
  120. > Microsoft (R) Program Maintenance Utility Version 14.16.27045.0
  121. > Copyright (C) Microsoft Corporation. All rights reserved.
  122. > cl -c -nologo -Zc:wchar_t -FS -Zc:rvalueCast -Zc:inline -Zc:strictStrings -Zc:throwingNew -Zc:referenceBinding -Zc:__cplusplus -O2 -MT -W0 -EHsc -DUNICODE -D_UNICODE -DWIN32 -D_ENABLE_EXTENDED_ALIGNED_STORAGE -DWIN64 -DNO_ATTRIBUTE -DQT_COMPILER_SUPPORTS_SSE4_2 -DNDEBUG -IC:\qt-everywhere-src-5.15.2\qtbase\config.tests\x86_simd -I. -IC:\Qt\OpenSSL\OpenSSL-1.1.1\static\x64\Release\include -IC:\qt-everywhere-src-5.15.2\qtbase\mkspecs\win32-msvc -Fo @C:\Users\MyUser\AppData\Local\Temp\nm6354.tmp
  123. > main.cpp
  124. > link /NOLOGO /DYNAMICBASE /NXCOMPAT /OPT:REF /INCREMENTAL:NO /SUBSYSTEM:CONSOLE "/MANIFESTDEPENDENCY:type='win32' name='Microsoft.Windows.Common-Controls' version='6.0.0.0' publicKeyToken='6595b64144ccf1df' language='*' processorArchitecture='*'" /MANIFEST:embed /OUT:x86_simd.exe @C:\Users\MyUser\AppData\Local\Temp\nm6384.tmp
  125. test config.qtbase.tests.sse4_2 succeeded
  126. executing config test avx
  127. + cd /d C:\qt-everywhere-src-5.15.2\config.tests\x86_simd && C:\qt-everywhere-src-5.15.2\qtbase\bin\qmake.exe "CONFIG -= qt debug_and_release app_bundle lib_bundle" "CONFIG += static warn_off console single_arch" "QMAKE_LIBDIR += C:\\Qt\\OpenSSL\\OpenSSL-1.1.1\\static\\x64\\Release\\lib" "INCLUDEPATH += C:\\Qt\\OpenSSL\\OpenSSL-1.1.1\\static\\x64\\Release\\include" "CONFIG+=add_cflags" "DEFINES+=NO_ATTRIBUTE" "SIMD=avx" C:/qt-everywhere-src-5.15.2/qtbase/config.tests/x86_simd
  128. + cd /d C:\qt-everywhere-src-5.15.2\config.tests\x86_simd && set MAKEFLAGS=& nmake clean && set MAKEFLAGS=& nmake
  129. > Microsoft (R) Program Maintenance Utility Version 14.16.27045.0
  130. > Copyright (C) Microsoft Corporation. All rights reserved.
  131. > del main.obj
  132. > Microsoft (R) Program Maintenance Utility Version 14.16.27045.0
  133. > Copyright (C) Microsoft Corporation. All rights reserved.
  134. > cl -c -nologo -Zc:wchar_t -FS -Zc:rvalueCast -Zc:inline -Zc:strictStrings -Zc:throwingNew -Zc:referenceBinding -Zc:__cplusplus -arch:AVX -O2 -MT -W0 -EHsc -DUNICODE -D_UNICODE -DWIN32 -D_ENABLE_EXTENDED_ALIGNED_STORAGE -DWIN64 -DNO_ATTRIBUTE -DQT_COMPILER_SUPPORTS_AVX -DNDEBUG -IC:\qt-everywhere-src-5.15.2\qtbase\config.tests\x86_simd -I. -IC:\Qt\OpenSSL\OpenSSL-1.1.1\static\x64\Release\include -IC:\qt-everywhere-src-5.15.2\qtbase\mkspecs\win32-msvc -Fo @C:\Users\MyUser\AppData\Local\Temp\nm643F.tmp
  135. > main.cpp
  136. > link /NOLOGO /DYNAMICBASE /NXCOMPAT /OPT:REF /INCREMENTAL:NO /SUBSYSTEM:CONSOLE "/MANIFESTDEPENDENCY:type='win32' name='Microsoft.Windows.Common-Controls' version='6.0.0.0' publicKeyToken='6595b64144ccf1df' language='*' processorArchitecture='*'" /MANIFEST:embed /OUT:x86_simd.exe @C:\Users\MyUser\AppData\Local\Temp\nm646F.tmp
  137. test config.qtbase.tests.avx succeeded
  138. executing config test avx2
  139. + cd /d C:\qt-everywhere-src-5.15.2\config.tests\x86_simd && C:\qt-everywhere-src-5.15.2\qtbase\bin\qmake.exe "CONFIG -= qt debug_and_release app_bundle lib_bundle" "CONFIG += static warn_off console single_arch" "QMAKE_LIBDIR += C:\\Qt\\OpenSSL\\OpenSSL-1.1.1\\static\\x64\\Release\\lib" "INCLUDEPATH += C:\\Qt\\OpenSSL\\OpenSSL-1.1.1\\static\\x64\\Release\\include" "CONFIG+=add_cflags" "DEFINES+=NO_ATTRIBUTE" "SIMD=avx2" C:/qt-everywhere-src-5.15.2/qtbase/config.tests/x86_simd
  140. + cd /d C:\qt-everywhere-src-5.15.2\config.tests\x86_simd && set MAKEFLAGS=& nmake clean && set MAKEFLAGS=& nmake
  141. > Microsoft (R) Program Maintenance Utility Version 14.16.27045.0
  142. > Copyright (C) Microsoft Corporation. All rights reserved.
  143. > del main.obj
  144. > Microsoft (R) Program Maintenance Utility Version 14.16.27045.0
  145. > Copyright (C) Microsoft Corporation. All rights reserved.
  146. > cl -c -nologo -Zc:wchar_t -FS -Zc:rvalueCast -Zc:inline -Zc:strictStrings -Zc:throwingNew -Zc:referenceBinding -Zc:__cplusplus -arch:AVX2 -O2 -MT -W0 -EHsc -DUNICODE -D_UNICODE -DWIN32 -D_ENABLE_EXTENDED_ALIGNED_STORAGE -DWIN64 -DNO_ATTRIBUTE -DQT_COMPILER_SUPPORTS_AVX2 -DNDEBUG -IC:\qt-everywhere-src-5.15.2\qtbase\config.tests\x86_simd -I. -IC:\Qt\OpenSSL\OpenSSL-1.1.1\static\x64\Release\include -IC:\qt-everywhere-src-5.15.2\qtbase\mkspecs\win32-msvc -Fo @C:\Users\MyUser\AppData\Local\Temp\nm6529.tmp
  147. > main.cpp
  148. > link /NOLOGO /DYNAMICBASE /NXCOMPAT /OPT:REF /INCREMENTAL:NO /SUBSYSTEM:CONSOLE "/MANIFESTDEPENDENCY:type='win32' name='Microsoft.Windows.Common-Controls' version='6.0.0.0' publicKeyToken='6595b64144ccf1df' language='*' processorArchitecture='*'" /MANIFEST:embed /OUT:x86_simd.exe @C:\Users\MyUser\AppData\Local\Temp\nm6569.tmp
  149. test config.qtbase.tests.avx2 succeeded
  150. executing config test avx512f
  151. + cd /d C:\qt-everywhere-src-5.15.2\config.tests\x86_simd && C:\qt-everywhere-src-5.15.2\qtbase\bin\qmake.exe "CONFIG -= qt debug_and_release app_bundle lib_bundle" "CONFIG += static warn_off console single_arch" "QMAKE_LIBDIR += C:\\Qt\\OpenSSL\\OpenSSL-1.1.1\\static\\x64\\Release\\lib" "INCLUDEPATH += C:\\Qt\\OpenSSL\\OpenSSL-1.1.1\\static\\x64\\Release\\include" "CONFIG+=add_cflags" "DEFINES+=NO_ATTRIBUTE" "SIMD=avx512f" C:/qt-everywhere-src-5.15.2/qtbase/config.tests/x86_simd
  152. + cd /d C:\qt-everywhere-src-5.15.2\config.tests\x86_simd && set MAKEFLAGS=& nmake clean && set MAKEFLAGS=& nmake
  153. > Microsoft (R) Program Maintenance Utility Version 14.16.27045.0
  154. > Copyright (C) Microsoft Corporation. All rights reserved.
  155. > del main.obj
  156. > Microsoft (R) Program Maintenance Utility Version 14.16.27045.0
  157. > Copyright (C) Microsoft Corporation. All rights reserved.
  158. > cl -c -nologo -Zc:wchar_t -FS -Zc:rvalueCast -Zc:inline -Zc:strictStrings -Zc:throwingNew -Zc:referenceBinding -Zc:__cplusplus -arch:AVX512 -O2 -MT -W0 -EHsc -DUNICODE -D_UNICODE -DWIN32 -D_ENABLE_EXTENDED_ALIGNED_STORAGE -DWIN64 -DNO_ATTRIBUTE -DQT_COMPILER_SUPPORTS_AVX512F -DNDEBUG -IC:\qt-everywhere-src-5.15.2\qtbase\config.tests\x86_simd -I. -IC:\Qt\OpenSSL\OpenSSL-1.1.1\static\x64\Release\include -IC:\qt-everywhere-src-5.15.2\qtbase\mkspecs\win32-msvc -Fo @C:\Users\MyUser\AppData\Local\Temp\nm6613.tmp
  159. > main.cpp
  160. > link /NOLOGO /DYNAMICBASE /NXCOMPAT /OPT:REF /INCREMENTAL:NO /SUBSYSTEM:CONSOLE "/MANIFESTDEPENDENCY:type='win32' name='Microsoft.Windows.Common-Controls' version='6.0.0.0' publicKeyToken='6595b64144ccf1df' language='*' processorArchitecture='*'" /MANIFEST:embed /OUT:x86_simd.exe @C:\Users\MyUser\AppData\Local\Temp\nm6653.tmp
  161. test config.qtbase.tests.avx512f succeeded
  162. executing config test avx512bw
  163. + cd /d C:\qt-everywhere-src-5.15.2\config.tests\x86_simd && C:\qt-everywhere-src-5.15.2\qtbase\bin\qmake.exe "CONFIG -= qt debug_and_release app_bundle lib_bundle" "CONFIG += static warn_off console single_arch" "QMAKE_LIBDIR += C:\\Qt\\OpenSSL\\OpenSSL-1.1.1\\static\\x64\\Release\\lib" "INCLUDEPATH += C:\\Qt\\OpenSSL\\OpenSSL-1.1.1\\static\\x64\\Release\\include" "CONFIG+=add_cflags" "DEFINES+=NO_ATTRIBUTE" "SIMD=avx512bw" C:/qt-everywhere-src-5.15.2/qtbase/config.tests/x86_simd
  164. + cd /d C:\qt-everywhere-src-5.15.2\config.tests\x86_simd && set MAKEFLAGS=& nmake clean && set MAKEFLAGS=& nmake
  165. > Microsoft (R) Program Maintenance Utility Version 14.16.27045.0
  166. > Copyright (C) Microsoft Corporation. All rights reserved.
  167. > del main.obj
  168. > Microsoft (R) Program Maintenance Utility Version 14.16.27045.0
  169. > Copyright (C) Microsoft Corporation. All rights reserved.
  170. > cl -c -nologo -Zc:wchar_t -FS -Zc:rvalueCast -Zc:inline -Zc:strictStrings -Zc:throwingNew -Zc:referenceBinding -Zc:__cplusplus -arch:AVX512 -O2 -MT -W0 -EHsc -DUNICODE -D_UNICODE -DWIN32 -D_ENABLE_EXTENDED_ALIGNED_STORAGE -DWIN64 -DNO_ATTRIBUTE -DQT_COMPILER_SUPPORTS_AVX512BW -DNDEBUG -IC:\qt-everywhere-src-5.15.2\qtbase\config.tests\x86_simd -I. -IC:\Qt\OpenSSL\OpenSSL-1.1.1\static\x64\Release\include -IC:\qt-everywhere-src-5.15.2\qtbase\mkspecs\win32-msvc -Fo @C:\Users\MyUser\AppData\Local\Temp\nm670D.tmp
  171. > main.cpp
  172. > link /NOLOGO /DYNAMICBASE /NXCOMPAT /OPT:REF /INCREMENTAL:NO /SUBSYSTEM:CONSOLE "/MANIFESTDEPENDENCY:type='win32' name='Microsoft.Windows.Common-Controls' version='6.0.0.0' publicKeyToken='6595b64144ccf1df' language='*' processorArchitecture='*'" /MANIFEST:embed /OUT:x86_simd.exe @C:\Users\MyUser\AppData\Local\Temp\nm673D.tmp
  173. test config.qtbase.tests.avx512bw succeeded
  174. executing config test avx512cd
  175. + cd /d C:\qt-everywhere-src-5.15.2\config.tests\x86_simd && C:\qt-everywhere-src-5.15.2\qtbase\bin\qmake.exe "CONFIG -= qt debug_and_release app_bundle lib_bundle" "CONFIG += static warn_off console single_arch" "QMAKE_LIBDIR += C:\\Qt\\OpenSSL\\OpenSSL-1.1.1\\static\\x64\\Release\\lib" "INCLUDEPATH += C:\\Qt\\OpenSSL\\OpenSSL-1.1.1\\static\\x64\\Release\\include" "CONFIG+=add_cflags" "DEFINES+=NO_ATTRIBUTE" "SIMD=avx512cd" C:/qt-everywhere-src-5.15.2/qtbase/config.tests/x86_simd
  176. + cd /d C:\qt-everywhere-src-5.15.2\config.tests\x86_simd && set MAKEFLAGS=& nmake clean && set MAKEFLAGS=& nmake
  177. > Microsoft (R) Program Maintenance Utility Version 14.16.27045.0
  178. > Copyright (C) Microsoft Corporation. All rights reserved.
  179. > del main.obj
  180. > Microsoft (R) Program Maintenance Utility Version 14.16.27045.0
  181. > Copyright (C) Microsoft Corporation. All rights reserved.
  182. > cl -c -nologo -Zc:wchar_t -FS -Zc:rvalueCast -Zc:inline -Zc:strictStrings -Zc:throwingNew -Zc:referenceBinding -Zc:__cplusplus -arch:AVX512 -O2 -MT -W0 -EHsc -DUNICODE -D_UNICODE -DWIN32 -D_ENABLE_EXTENDED_ALIGNED_STORAGE -DWIN64 -DNO_ATTRIBUTE -DQT_COMPILER_SUPPORTS_AVX512CD -DNDEBUG -IC:\qt-everywhere-src-5.15.2\qtbase\config.tests\x86_simd -I. -IC:\Qt\OpenSSL\OpenSSL-1.1.1\static\x64\Release\include -IC:\qt-everywhere-src-5.15.2\qtbase\mkspecs\win32-msvc -Fo @C:\Users\MyUser\AppData\Local\Temp\nm67E8.tmp
  183. > main.cpp
  184. > link /NOLOGO /DYNAMICBASE /NXCOMPAT /OPT:REF /INCREMENTAL:NO /SUBSYSTEM:CONSOLE "/MANIFESTDEPENDENCY:type='win32' name='Microsoft.Windows.Common-Controls' version='6.0.0.0' publicKeyToken='6595b64144ccf1df' language='*' processorArchitecture='*'" /MANIFEST:embed /OUT:x86_simd.exe @C:\Users\MyUser\AppData\Local\Temp\nm6828.tmp
  185. test config.qtbase.tests.avx512cd succeeded
  186. executing config test avx512dq
  187. + cd /d C:\qt-everywhere-src-5.15.2\config.tests\x86_simd && C:\qt-everywhere-src-5.15.2\qtbase\bin\qmake.exe "CONFIG -= qt debug_and_release app_bundle lib_bundle" "CONFIG += static warn_off console single_arch" "QMAKE_LIBDIR += C:\\Qt\\OpenSSL\\OpenSSL-1.1.1\\static\\x64\\Release\\lib" "INCLUDEPATH += C:\\Qt\\OpenSSL\\OpenSSL-1.1.1\\static\\x64\\Release\\include" "CONFIG+=add_cflags" "DEFINES+=NO_ATTRIBUTE" "SIMD=avx512dq" C:/qt-everywhere-src-5.15.2/qtbase/config.tests/x86_simd
  188. + cd /d C:\qt-everywhere-src-5.15.2\config.tests\x86_simd && set MAKEFLAGS=& nmake clean && set MAKEFLAGS=& nmake
  189. > Microsoft (R) Program Maintenance Utility Version 14.16.27045.0
  190. > Copyright (C) Microsoft Corporation. All rights reserved.
  191. > del main.obj
  192. > Microsoft (R) Program Maintenance Utility Version 14.16.27045.0
  193. > Copyright (C) Microsoft Corporation. All rights reserved.
  194. > cl -c -nologo -Zc:wchar_t -FS -Zc:rvalueCast -Zc:inline -Zc:strictStrings -Zc:throwingNew -Zc:referenceBinding -Zc:__cplusplus -arch:AVX512 -O2 -MT -W0 -EHsc -DUNICODE -D_UNICODE -DWIN32 -D_ENABLE_EXTENDED_ALIGNED_STORAGE -DWIN64 -DNO_ATTRIBUTE -DQT_COMPILER_SUPPORTS_AVX512DQ -DNDEBUG -IC:\qt-everywhere-src-5.15.2\qtbase\config.tests\x86_simd -I. -IC:\Qt\OpenSSL\OpenSSL-1.1.1\static\x64\Release\include -IC:\qt-everywhere-src-5.15.2\qtbase\mkspecs\win32-msvc -Fo @C:\Users\MyUser\AppData\Local\Temp\nm68D3.tmp
  195. > main.cpp
  196. > link /NOLOGO /DYNAMICBASE /NXCOMPAT /OPT:REF /INCREMENTAL:NO /SUBSYSTEM:CONSOLE "/MANIFESTDEPENDENCY:type='win32' name='Microsoft.Windows.Common-Controls' version='6.0.0.0' publicKeyToken='6595b64144ccf1df' language='*' processorArchitecture='*'" /MANIFEST:embed /OUT:x86_simd.exe @C:\Users\MyUser\AppData\Local\Temp\nm6912.tmp
  197. test config.qtbase.tests.avx512dq succeeded
  198. executing config test avx512er
  199. + cd /d C:\qt-everywhere-src-5.15.2\config.tests\x86_simd && C:\qt-everywhere-src-5.15.2\qtbase\bin\qmake.exe "CONFIG -= qt debug_and_release app_bundle lib_bundle" "CONFIG += static warn_off console single_arch" "QMAKE_LIBDIR += C:\\Qt\\OpenSSL\\OpenSSL-1.1.1\\static\\x64\\Release\\lib" "INCLUDEPATH += C:\\Qt\\OpenSSL\\OpenSSL-1.1.1\\static\\x64\\Release\\include" "CONFIG+=add_cflags" "DEFINES+=NO_ATTRIBUTE" "SIMD=avx512er" C:/qt-everywhere-src-5.15.2/qtbase/config.tests/x86_simd
  200. + cd /d C:\qt-everywhere-src-5.15.2\config.tests\x86_simd && set MAKEFLAGS=& nmake clean && set MAKEFLAGS=& nmake
  201. > Microsoft (R) Program Maintenance Utility Version 14.16.27045.0
  202. > Copyright (C) Microsoft Corporation. All rights reserved.
  203. > del main.obj
  204. > Microsoft (R) Program Maintenance Utility Version 14.16.27045.0
  205. > Copyright (C) Microsoft Corporation. All rights reserved.
  206. > cl -c -nologo -Zc:wchar_t -FS -Zc:rvalueCast -Zc:inline -Zc:strictStrings -Zc:throwingNew -Zc:referenceBinding -Zc:__cplusplus -arch:AVX512 -O2 -MT -W0 -EHsc -DUNICODE -D_UNICODE -DWIN32 -D_ENABLE_EXTENDED_ALIGNED_STORAGE -DWIN64 -DNO_ATTRIBUTE -DQT_COMPILER_SUPPORTS_AVX512ER -DNDEBUG -IC:\qt-everywhere-src-5.15.2\qtbase\config.tests\x86_simd -I. -IC:\Qt\OpenSSL\OpenSSL-1.1.1\static\x64\Release\include -IC:\qt-everywhere-src-5.15.2\qtbase\mkspecs\win32-msvc -Fo @C:\Users\MyUser\AppData\Local\Temp\nm69CD.tmp
  207. > main.cpp
  208. > link /NOLOGO /DYNAMICBASE /NXCOMPAT /OPT:REF /INCREMENTAL:NO /SUBSYSTEM:CONSOLE "/MANIFESTDEPENDENCY:type='win32' name='Microsoft.Windows.Common-Controls' version='6.0.0.0' publicKeyToken='6595b64144ccf1df' language='*' processorArchitecture='*'" /MANIFEST:embed /OUT:x86_simd.exe @C:\Users\MyUser\AppData\Local\Temp\nm6A0C.tmp
  209. test config.qtbase.tests.avx512er succeeded
  210. executing config test avx512ifma
  211. + cd /d C:\qt-everywhere-src-5.15.2\config.tests\x86_simd && C:\qt-everywhere-src-5.15.2\qtbase\bin\qmake.exe "CONFIG -= qt debug_and_release app_bundle lib_bundle" "CONFIG += static warn_off console single_arch" "QMAKE_LIBDIR += C:\\Qt\\OpenSSL\\OpenSSL-1.1.1\\static\\x64\\Release\\lib" "INCLUDEPATH += C:\\Qt\\OpenSSL\\OpenSSL-1.1.1\\static\\x64\\Release\\include" "CONFIG+=add_cflags" "DEFINES+=NO_ATTRIBUTE" "SIMD=avx512ifma" C:/qt-everywhere-src-5.15.2/qtbase/config.tests/x86_simd
  212. + cd /d C:\qt-everywhere-src-5.15.2\config.tests\x86_simd && set MAKEFLAGS=& nmake clean && set MAKEFLAGS=& nmake
  213. > Microsoft (R) Program Maintenance Utility Version 14.16.27045.0
  214. > Copyright (C) Microsoft Corporation. All rights reserved.
  215. > del main.obj
  216. > Microsoft (R) Program Maintenance Utility Version 14.16.27045.0
  217. > Copyright (C) Microsoft Corporation. All rights reserved.
  218. > cl -c -nologo -Zc:wchar_t -FS -Zc:rvalueCast -Zc:inline -Zc:strictStrings -Zc:throwingNew -Zc:referenceBinding -Zc:__cplusplus -arch:AVX512 -O2 -MT -W0 -EHsc -DUNICODE -D_UNICODE -DWIN32 -D_ENABLE_EXTENDED_ALIGNED_STORAGE -DWIN64 -DNO_ATTRIBUTE -DQT_COMPILER_SUPPORTS_AVX512IFMA -DNDEBUG -IC:\qt-everywhere-src-5.15.2\qtbase\config.tests\x86_simd -I. -IC:\Qt\OpenSSL\OpenSSL-1.1.1\static\x64\Release\include -IC:\qt-everywhere-src-5.15.2\qtbase\mkspecs\win32-msvc -Fo @C:\Users\MyUser\AppData\Local\Temp\nm6AB7.tmp
  219. > main.cpp
  220. > link /NOLOGO /DYNAMICBASE /NXCOMPAT /OPT:REF /INCREMENTAL:NO /SUBSYSTEM:CONSOLE "/MANIFESTDEPENDENCY:type='win32' name='Microsoft.Windows.Common-Controls' version='6.0.0.0' publicKeyToken='6595b64144ccf1df' language='*' processorArchitecture='*'" /MANIFEST:embed /OUT:x86_simd.exe @C:\Users\MyUser\AppData\Local\Temp\nm6AF6.tmp
  221. test config.qtbase.tests.avx512ifma succeeded
  222. executing config test avx512pf
  223. + cd /d C:\qt-everywhere-src-5.15.2\config.tests\x86_simd && C:\qt-everywhere-src-5.15.2\qtbase\bin\qmake.exe "CONFIG -= qt debug_and_release app_bundle lib_bundle" "CONFIG += static warn_off console single_arch" "QMAKE_LIBDIR += C:\\Qt\\OpenSSL\\OpenSSL-1.1.1\\static\\x64\\Release\\lib" "INCLUDEPATH += C:\\Qt\\OpenSSL\\OpenSSL-1.1.1\\static\\x64\\Release\\include" "CONFIG+=add_cflags" "DEFINES+=NO_ATTRIBUTE" "SIMD=avx512pf" C:/qt-everywhere-src-5.15.2/qtbase/config.tests/x86_simd
  224. + cd /d C:\qt-everywhere-src-5.15.2\config.tests\x86_simd && set MAKEFLAGS=& nmake clean && set MAKEFLAGS=& nmake
  225. > Microsoft (R) Program Maintenance Utility Version 14.16.27045.0
  226. > Copyright (C) Microsoft Corporation. All rights reserved.
  227. > del main.obj
  228. > Microsoft (R) Program Maintenance Utility Version 14.16.27045.0
  229. > Copyright (C) Microsoft Corporation. All rights reserved.
  230. > cl -c -nologo -Zc:wchar_t -FS -Zc:rvalueCast -Zc:inline -Zc:strictStrings -Zc:throwingNew -Zc:referenceBinding -Zc:__cplusplus -arch:AVX512 -O2 -MT -W0 -EHsc -DUNICODE -D_UNICODE -DWIN32 -D_ENABLE_EXTENDED_ALIGNED_STORAGE -DWIN64 -DNO_ATTRIBUTE -DQT_COMPILER_SUPPORTS_AVX512PF -DNDEBUG -IC:\qt-everywhere-src-5.15.2\qtbase\config.tests\x86_simd -I. -IC:\Qt\OpenSSL\OpenSSL-1.1.1\static\x64\Release\include -IC:\qt-everywhere-src-5.15.2\qtbase\mkspecs\win32-msvc -Fo @C:\Users\MyUser\AppData\Local\Temp\nm6BA1.tmp
  231. > main.cpp
  232. > link /NOLOGO /DYNAMICBASE /NXCOMPAT /OPT:REF /INCREMENTAL:NO /SUBSYSTEM:CONSOLE "/MANIFESTDEPENDENCY:type='win32' name='Microsoft.Windows.Common-Controls' version='6.0.0.0' publicKeyToken='6595b64144ccf1df' language='*' processorArchitecture='*'" /MANIFEST:embed /OUT:x86_simd.exe @C:\Users\MyUser\AppData\Local\Temp\nm6BD1.tmp
  233. test config.qtbase.tests.avx512pf succeeded
  234. executing config test avx512vbmi
  235. + cd /d C:\qt-everywhere-src-5.15.2\config.tests\x86_simd && C:\qt-everywhere-src-5.15.2\qtbase\bin\qmake.exe "CONFIG -= qt debug_and_release app_bundle lib_bundle" "CONFIG += static warn_off console single_arch" "QMAKE_LIBDIR += C:\\Qt\\OpenSSL\\OpenSSL-1.1.1\\static\\x64\\Release\\lib" "INCLUDEPATH += C:\\Qt\\OpenSSL\\OpenSSL-1.1.1\\static\\x64\\Release\\include" "CONFIG+=add_cflags" "DEFINES+=NO_ATTRIBUTE" "SIMD=avx512vbmi" C:/qt-everywhere-src-5.15.2/qtbase/config.tests/x86_simd
  236. + cd /d C:\qt-everywhere-src-5.15.2\config.tests\x86_simd && set MAKEFLAGS=& nmake clean && set MAKEFLAGS=& nmake
  237. > Microsoft (R) Program Maintenance Utility Version 14.16.27045.0
  238. > Copyright (C) Microsoft Corporation. All rights reserved.
  239. > del main.obj
  240. > Microsoft (R) Program Maintenance Utility Version 14.16.27045.0
  241. > Copyright (C) Microsoft Corporation. All rights reserved.
  242. > cl -c -nologo -Zc:wchar_t -FS -Zc:rvalueCast -Zc:inline -Zc:strictStrings -Zc:throwingNew -Zc:referenceBinding -Zc:__cplusplus -arch:AVX512 -O2 -MT -W0 -EHsc -DUNICODE -D_UNICODE -DWIN32 -D_ENABLE_EXTENDED_ALIGNED_STORAGE -DWIN64 -DNO_ATTRIBUTE -DQT_COMPILER_SUPPORTS_AVX512VBMI -DNDEBUG -IC:\qt-everywhere-src-5.15.2\qtbase\config.tests\x86_simd -I. -IC:\Qt\OpenSSL\OpenSSL-1.1.1\static\x64\Release\include -IC:\qt-everywhere-src-5.15.2\qtbase\mkspecs\win32-msvc -Fo @C:\Users\MyUser\AppData\Local\Temp\nm6C8C.tmp
  243. > main.cpp
  244. > link /NOLOGO /DYNAMICBASE /NXCOMPAT /OPT:REF /INCREMENTAL:NO /SUBSYSTEM:CONSOLE "/MANIFESTDEPENDENCY:type='win32' name='Microsoft.Windows.Common-Controls' version='6.0.0.0' publicKeyToken='6595b64144ccf1df' language='*' processorArchitecture='*'" /MANIFEST:embed /OUT:x86_simd.exe @C:\Users\MyUser\AppData\Local\Temp\nm6CBC.tmp
  245. test config.qtbase.tests.avx512vbmi succeeded
  246. executing config test avx512vl
  247. + cd /d C:\qt-everywhere-src-5.15.2\config.tests\x86_simd && C:\qt-everywhere-src-5.15.2\qtbase\bin\qmake.exe "CONFIG -= qt debug_and_release app_bundle lib_bundle" "CONFIG += static warn_off console single_arch" "QMAKE_LIBDIR += C:\\Qt\\OpenSSL\\OpenSSL-1.1.1\\static\\x64\\Release\\lib" "INCLUDEPATH += C:\\Qt\\OpenSSL\\OpenSSL-1.1.1\\static\\x64\\Release\\include" "CONFIG+=add_cflags" "DEFINES+=NO_ATTRIBUTE" "SIMD=avx512vl" C:/qt-everywhere-src-5.15.2/qtbase/config.tests/x86_simd
  248. + cd /d C:\qt-everywhere-src-5.15.2\config.tests\x86_simd && set MAKEFLAGS=& nmake clean && set MAKEFLAGS=& nmake
  249. > Microsoft (R) Program Maintenance Utility Version 14.16.27045.0
  250. > Copyright (C) Microsoft Corporation. All rights reserved.
  251. > del main.obj
  252. > Microsoft (R) Program Maintenance Utility Version 14.16.27045.0
  253. > Copyright (C) Microsoft Corporation. All rights reserved.
  254. > cl -c -nologo -Zc:wchar_t -FS -Zc:rvalueCast -Zc:inline -Zc:strictStrings -Zc:throwingNew -Zc:referenceBinding -Zc:__cplusplus -arch:AVX512 -O2 -MT -W0 -EHsc -DUNICODE -D_UNICODE -DWIN32 -D_ENABLE_EXTENDED_ALIGNED_STORAGE -DWIN64 -DNO_ATTRIBUTE -DQT_COMPILER_SUPPORTS_AVX512VL -DNDEBUG -IC:\qt-everywhere-src-5.15.2\qtbase\config.tests\x86_simd -I. -IC:\Qt\OpenSSL\OpenSSL-1.1.1\static\x64\Release\include -IC:\qt-everywhere-src-5.15.2\qtbase\mkspecs\win32-msvc -Fo @C:\Users\MyUser\AppData\Local\Temp\nm6D76.tmp
  255. > main.cpp
  256. > link /NOLOGO /DYNAMICBASE /NXCOMPAT /OPT:REF /INCREMENTAL:NO /SUBSYSTEM:CONSOLE "/MANIFESTDEPENDENCY:type='win32' name='Microsoft.Windows.Common-Controls' version='6.0.0.0' publicKeyToken='6595b64144ccf1df' language='*' processorArchitecture='*'" /MANIFEST:embed /OUT:x86_simd.exe @C:\Users\MyUser\AppData\Local\Temp\nm6DB6.tmp
  257. test config.qtbase.tests.avx512vl succeeded
  258. executing config test cxx14
  259. + cd /d C:\qt-everywhere-src-5.15.2\config.tests\cxx14 && C:\qt-everywhere-src-5.15.2\qtbase\bin\qmake.exe "CONFIG -= qt debug_and_release app_bundle lib_bundle" "CONFIG += static warn_off console single_arch" "QMAKE_LIBDIR += C:\\Qt\\OpenSSL\\OpenSSL-1.1.1\\static\\x64\\Release\\lib" "INCLUDEPATH += C:\\Qt\\OpenSSL\\OpenSSL-1.1.1\\static\\x64\\Release\\include" C:/qt-everywhere-src-5.15.2/config.tests/cxx14
  260. + cd /d C:\qt-everywhere-src-5.15.2\config.tests\cxx14 && set MAKEFLAGS=& nmake clean && set MAKEFLAGS=& nmake
  261. > Microsoft (R) Program Maintenance Utility Version 14.16.27045.0
  262. > Copyright (C) Microsoft Corporation. All rights reserved.
  263. > del main.obj
  264. > Microsoft (R) Program Maintenance Utility Version 14.16.27045.0
  265. > Copyright (C) Microsoft Corporation. All rights reserved.
  266. > cl -c -nologo -Zc:wchar_t -FS -Zc:rvalueCast -Zc:inline -Zc:strictStrings -Zc:throwingNew -Zc:referenceBinding -Zc:__cplusplus -O2 -MT -std:c++14 -W0 -EHsc -DUNICODE -D_UNICODE -DWIN32 -D_ENABLE_EXTENDED_ALIGNED_STORAGE -DWIN64 -DNDEBUG -I. -IC:\Qt\OpenSSL\OpenSSL-1.1.1\static\x64\Release\include -IC:\qt-everywhere-src-5.15.2\qtbase\mkspecs\win32-msvc -Fo @C:\Users\MyUser\AppData\Local\Temp\nm6E60.tmp
  267. > main.cpp
  268. > link /NOLOGO /DYNAMICBASE /NXCOMPAT /OPT:REF /INCREMENTAL:NO /SUBSYSTEM:CONSOLE "/MANIFESTDEPENDENCY:type='win32' name='Microsoft.Windows.Common-Controls' version='6.0.0.0' publicKeyToken='6595b64144ccf1df' language='*' processorArchitecture='*'" /MANIFEST:embed /OUT:cxx14.exe @C:\Users\MyUser\AppData\Local\Temp\nm6E81.tmp
  269. test config.qtbase.tests.cxx14 succeeded
  270. executing config test cxx17
  271. + cd /d C:\qt-everywhere-src-5.15.2\config.tests\cxx17 && C:\qt-everywhere-src-5.15.2\qtbase\bin\qmake.exe "CONFIG -= qt debug_and_release app_bundle lib_bundle" "CONFIG += static warn_off console single_arch" "QMAKE_LIBDIR += C:\\Qt\\OpenSSL\\OpenSSL-1.1.1\\static\\x64\\Release\\lib" "INCLUDEPATH += C:\\Qt\\OpenSSL\\OpenSSL-1.1.1\\static\\x64\\Release\\include" C:/qt-everywhere-src-5.15.2/config.tests/cxx17
  272. + cd /d C:\qt-everywhere-src-5.15.2\config.tests\cxx17 && set MAKEFLAGS=& nmake clean && set MAKEFLAGS=& nmake
  273. > Microsoft (R) Program Maintenance Utility Version 14.16.27045.0
  274. > Copyright (C) Microsoft Corporation. All rights reserved.
  275. > del main.obj
  276. > Microsoft (R) Program Maintenance Utility Version 14.16.27045.0
  277. > Copyright (C) Microsoft Corporation. All rights reserved.
  278. > cl -c -nologo -Zc:wchar_t -FS -Zc:rvalueCast -Zc:inline -Zc:strictStrings -Zc:throwingNew -Zc:referenceBinding -Zc:__cplusplus -O2 -MT -std:c++17 -W0 -EHsc -DUNICODE -D_UNICODE -DWIN32 -D_ENABLE_EXTENDED_ALIGNED_STORAGE -DWIN64 -DNDEBUG -I. -IC:\Qt\OpenSSL\OpenSSL-1.1.1\static\x64\Release\include -IC:\qt-everywhere-src-5.15.2\qtbase\mkspecs\win32-msvc -Fo @C:\Users\MyUser\AppData\Local\Temp\nm6F3B.tmp
  279. > main.cpp
  280. > link /NOLOGO /DYNAMICBASE /NXCOMPAT /OPT:REF /INCREMENTAL:NO /SUBSYSTEM:CONSOLE "/MANIFESTDEPENDENCY:type='win32' name='Microsoft.Windows.Common-Controls' version='6.0.0.0' publicKeyToken='6595b64144ccf1df' language='*' processorArchitecture='*'" /MANIFEST:embed /OUT:cxx17.exe @C:\Users\MyUser\AppData\Local\Temp\nm6FD8.tmp
  281. test config.qtbase.tests.cxx17 succeeded
  282. executing config test c99
  283. + cd /d C:\qt-everywhere-src-5.15.2\config.tests\c99 && C:\qt-everywhere-src-5.15.2\qtbase\bin\qmake.exe "CONFIG -= qt debug_and_release app_bundle lib_bundle" "CONFIG += static warn_off console single_arch" "QMAKE_LIBDIR += C:\\Qt\\OpenSSL\\OpenSSL-1.1.1\\static\\x64\\Release\\lib" "INCLUDEPATH += C:\\Qt\\OpenSSL\\OpenSSL-1.1.1\\static\\x64\\Release\\include" C:/qt-everywhere-src-5.15.2/config.tests/c99
  284. + cd /d C:\qt-everywhere-src-5.15.2\config.tests\c99 && set MAKEFLAGS=& nmake clean && set MAKEFLAGS=& nmake
  285. > Microsoft (R) Program Maintenance Utility Version 14.16.27045.0
  286. > Copyright (C) Microsoft Corporation. All rights reserved.
  287. > del main.obj
  288. > Could Not Find C:\qt-everywhere-src-5.15.2\config.tests\c99\main.obj
  289. > Microsoft (R) Program Maintenance Utility Version 14.16.27045.0
  290. > Copyright (C) Microsoft Corporation. All rights reserved.
  291. > cl -c -nologo -Zc:wchar_t -FS -Zc:strictStrings -O2 -MT -W0 -DUNICODE -D_UNICODE -DWIN32 -D_ENABLE_EXTENDED_ALIGNED_STORAGE -DWIN64 -DNDEBUG -I. -IC:\Qt\OpenSSL\OpenSSL-1.1.1\static\x64\Release\include -IC:\qt-everywhere-src-5.15.2\qtbase\mkspecs\win32-msvc -Fo @C:\Users\MyUser\AppData\Local\Temp\nm7093.tmp
  292. > main.c
  293. > .\main.c(5): fatal error C1189: #error: __STDC_VERSION__ must be >= 199901L
  294. > NMAKE : fatal error U1077: '"C:\Program Files (x86)\Microsoft Visual Studio\2017\Professional\VC\Tools\MSVC\14.16.27023\bin\HostX64\x64\cl.EXE"' : return code '0x2'
  295. > Stop.
  296. test config.qtbase.tests.c99 FAILED
  297. Global lib dirs: [C:\\Qt\\OpenSSL\\OpenSSL-1.1.1\\static\\x64\\Release\\lib] ["C:\\Program Files (x86)\\Microsoft Visual Studio\\2017\\Professional\\VC\\Tools\\MSVC\\14.16.27023\\ATLMFC\\lib\\x64" "C:\\Program Files (x86)\\Microsoft Visual Studio\\2017\\Professional\\VC\\Tools\\MSVC\\14.16.27023\\lib\\x64" "C:\\Program Files (x86)\\Windows Kits\\NETFXSDK\\4.6.1\\lib\\um\\x64" "C:\\Program Files (x86)\\Windows Kits\\10\\lib\\10.0.18362.0\\ucrt\\x64" "C:\\Program Files (x86)\\Windows Kits\\10\\lib\\10.0.18362.0\\um\\x64"]
  298. Global inc dirs: [C:\\Qt\\OpenSSL\\OpenSSL-1.1.1\\static\\x64\\Release\\include] ["C:\\Program Files (x86)\\Microsoft Visual Studio\\2017\\Professional\\VC\\Tools\\MSVC\\14.16.27023\\ATLMFC\\include" "C:\\Program Files (x86)\\Microsoft Visual Studio\\2017\\Professional\\VC\\Tools\\MSVC\\14.16.27023\\include" "C:\\Program Files (x86)\\Windows Kits\\NETFXSDK\\4.6.1\\include\\um" "C:\\Program Files (x86)\\Windows Kits\\10\\include\\10.0.18362.0\\ucrt" "C:\\Program Files (x86)\\Windows Kits\\10\\include\\10.0.18362.0\\shared" "C:\\Program Files (x86)\\Windows Kits\\10\\include\\10.0.18362.0\\um" "C:\\Program Files (x86)\\Windows Kits\\10\\include\\10.0.18362.0\\winrt" "C:\\Program Files (x86)\\Windows Kits\\10\\include\\10.0.18362.0\\cppwinrt"]
  299. looking for library dbus
  300. Trying source 0 (type pkgConfig) of library dbus ...
  301. pkg-config use disabled globally.
  302. => source produced no result.
  303. Trying source 1 (type inline) of library dbus ...
  304. dbus/dbus.h not found in [] and global paths.
  305. => source produced no result.
  306. Trying source 2 (type inline) of library dbus ...
  307. => source failed condition '!config.win32'.
  308. test config.qtbase.libraries.dbus FAILED
  309. executing config test f16c
  310. + cd /d C:\qt-everywhere-src-5.15.2\config.tests\x86_simd && C:\qt-everywhere-src-5.15.2\qtbase\bin\qmake.exe "CONFIG -= qt debug_and_release app_bundle lib_bundle" "CONFIG += static warn_off console single_arch" "QMAKE_LIBDIR += C:\\Qt\\OpenSSL\\OpenSSL-1.1.1\\static\\x64\\Release\\lib" "INCLUDEPATH += C:\\Qt\\OpenSSL\\OpenSSL-1.1.1\\static\\x64\\Release\\include" "CONFIG+=add_cflags" "DEFINES+=NO_ATTRIBUTE" "SIMD=f16c" C:/qt-everywhere-src-5.15.2/qtbase/config.tests/x86_simd
  311. + cd /d C:\qt-everywhere-src-5.15.2\config.tests\x86_simd && set MAKEFLAGS=& nmake clean && set MAKEFLAGS=& nmake
  312. > Microsoft (R) Program Maintenance Utility Version 14.16.27045.0
  313. > Copyright (C) Microsoft Corporation. All rights reserved.
  314. > del main.obj
  315. > Microsoft (R) Program Maintenance Utility Version 14.16.27045.0
  316. > Copyright (C) Microsoft Corporation. All rights reserved.
  317. > cl -c -nologo -Zc:wchar_t -FS -Zc:rvalueCast -Zc:inline -Zc:strictStrings -Zc:throwingNew -Zc:referenceBinding -Zc:__cplusplus -arch:AVX -O2 -MT -W0 -EHsc -DUNICODE -D_UNICODE -DWIN32 -D_ENABLE_EXTENDED_ALIGNED_STORAGE -DWIN64 -DNO_ATTRIBUTE -DQT_COMPILER_SUPPORTS_F16C -DNDEBUG -IC:\qt-everywhere-src-5.15.2\qtbase\config.tests\x86_simd -I. -IC:\Qt\OpenSSL\OpenSSL-1.1.1\static\x64\Release\include -IC:\qt-everywhere-src-5.15.2\qtbase\mkspecs\win32-msvc -Fo @C:\Users\MyUser\AppData\Local\Temp\nm7110.tmp
  318. > main.cpp
  319. > link /NOLOGO /DYNAMICBASE /NXCOMPAT /OPT:REF /INCREMENTAL:NO /SUBSYSTEM:CONSOLE "/MANIFESTDEPENDENCY:type='win32' name='Microsoft.Windows.Common-Controls' version='6.0.0.0' publicKeyToken='6595b64144ccf1df' language='*' processorArchitecture='*'" /MANIFEST:embed /OUT:x86_simd.exe @C:\Users\MyUser\AppData\Local\Temp\nm714F.tmp
  320. test config.qtbase.tests.f16c succeeded
  321. executing config test gc_binaries
  322. + cd /d C:\qt-everywhere-src-5.15.2\config.tests\gc_binaries && C:\qt-everywhere-src-5.15.2\qtbase\bin\qmake.exe "CONFIG -= qt debug_and_release app_bundle lib_bundle" "CONFIG += static warn_off console single_arch" "QMAKE_LIBDIR += C:\\Qt\\OpenSSL\\OpenSSL-1.1.1\\static\\x64\\Release\\lib" "INCLUDEPATH += C:\\Qt\\OpenSSL\\OpenSSL-1.1.1\\static\\x64\\Release\\include" C:/qt-everywhere-src-5.15.2/config.tests/gc_binaries
  323. > Project ERROR: Nope
  324. test config.qtbase.tests.gc_binaries FAILED
  325. looking for library host_dbus
  326. Trying source 0 (type pkgConfig) of library host_dbus ...
  327. pkg-config use disabled globally.
  328. => source produced no result.
  329. Trying source 1 (type inline) of library host_dbus ...
  330. => source accepted.
  331. test config.qtbase.libraries.host_dbus succeeded
  332. executing config test incredibuild_xge
  333. Searching for file BuildConsole.exe.
  334. Not found.
  335. test config.qtbase.tests.incredibuild_xge FAILED
  336. executing config test intelcet
  337. + cd /d C:\qt-everywhere-src-5.15.2\config.tests\intelcet && C:\qt-everywhere-src-5.15.2\qtbase\bin\qmake.exe "CONFIG -= qt debug_and_release app_bundle lib_bundle" "CONFIG += static warn_off console single_arch" "QMAKE_LIBDIR += C:\\Qt\\OpenSSL\\OpenSSL-1.1.1\\static\\x64\\Release\\lib" "INCLUDEPATH += C:\\Qt\\OpenSSL\\OpenSSL-1.1.1\\static\\x64\\Release\\include" C:/qt-everywhere-src-5.15.2/config.tests/intelcet
  338. + cd /d C:\qt-everywhere-src-5.15.2\config.tests\intelcet && set MAKEFLAGS=& nmake clean && set MAKEFLAGS=& nmake
  339. > Microsoft (R) Program Maintenance Utility Version 14.16.27045.0
  340. > Copyright (C) Microsoft Corporation. All rights reserved.
  341. > del main.obj
  342. > Could Not Find C:\qt-everywhere-src-5.15.2\config.tests\intelcet\main.obj
  343. > Microsoft (R) Program Maintenance Utility Version 14.16.27045.0
  344. > Copyright (C) Microsoft Corporation. All rights reserved.
  345. > cl -c -nologo -Zc:wchar_t -FS -Zc:rvalueCast -Zc:inline -Zc:strictStrings -Zc:throwingNew -Zc:referenceBinding -Zc:__cplusplus -O2 -MT -W0 -EHsc -DUNICODE -D_UNICODE -DWIN32 -D_ENABLE_EXTENDED_ALIGNED_STORAGE -DWIN64 -DNDEBUG -I. -IC:\Qt\OpenSSL\OpenSSL-1.1.1\static\x64\Release\include -IC:\qt-everywhere-src-5.15.2\qtbase\mkspecs\win32-msvc -Fo @C:\Users\MyUser\AppData\Local\Temp\nm7229.tmp
  346. > main.cpp
  347. > .\main.cpp(7): fatal error C1189: #error: Intel CET not available
  348. > NMAKE : fatal error U1077: '"C:\Program Files (x86)\Microsoft Visual Studio\2017\Professional\VC\Tools\MSVC\14.16.27023\bin\HostX64\x64\cl.EXE"' : return code '0x2'
  349. > Stop.
  350. test config.qtbase.tests.intelcet FAILED
  351. looking for library libudev
  352. Trying source 0 (type pkgConfig) of library libudev ...
  353. pkg-config use disabled globally.
  354. => source produced no result.
  355. Trying source 1 (type inline) of library libudev ...
  356. libudev.h not found in [] and global paths.
  357. => source produced no result.
  358. test config.qtbase.libraries.libudev FAILED
  359. executing config test posix_fallocate
  360. + cd /d C:\qt-everywhere-src-5.15.2\config.tests\posix_fallocate && C:\qt-everywhere-src-5.15.2\qtbase\bin\qmake.exe "CONFIG -= qt debug_and_release app_bundle lib_bundle" "CONFIG += static warn_off console single_arch" "QMAKE_LIBDIR += C:\\Qt\\OpenSSL\\OpenSSL-1.1.1\\static\\x64\\Release\\lib" "INCLUDEPATH += C:\\Qt\\OpenSSL\\OpenSSL-1.1.1\\static\\x64\\Release\\include" C:/qt-everywhere-src-5.15.2/config.tests/posix_fallocate
  361. + cd /d C:\qt-everywhere-src-5.15.2\config.tests\posix_fallocate && set MAKEFLAGS=& nmake clean && set MAKEFLAGS=& nmake
  362. > Microsoft (R) Program Maintenance Utility Version 14.16.27045.0
  363. > Copyright (C) Microsoft Corporation. All rights reserved.
  364. > del main.obj
  365. > Could Not Find C:\qt-everywhere-src-5.15.2\config.tests\posix_fallocate\main.obj
  366. > Microsoft (R) Program Maintenance Utility Version 14.16.27045.0
  367. > Copyright (C) Microsoft Corporation. All rights reserved.
  368. > cl -c -nologo -Zc:wchar_t -FS -Zc:rvalueCast -Zc:inline -Zc:strictStrings -Zc:throwingNew -Zc:referenceBinding -Zc:__cplusplus -O2 -MT -W0 -EHsc -DUNICODE -D_UNICODE -DWIN32 -D_ENABLE_EXTENDED_ALIGNED_STORAGE -DWIN64 -DNDEBUG -I. -IC:\Qt\OpenSSL\OpenSSL-1.1.1\static\x64\Release\include -IC:\qt-everywhere-src-5.15.2\qtbase\mkspecs\win32-msvc -Fo @C:\Users\MyUser\AppData\Local\Temp\nm72B6.tmp
  369. > main.cpp
  370. > .\main.cpp(3): fatal error C1083: Cannot open include file: 'unistd.h': No such file or directory
  371. > NMAKE : fatal error U1077: '"C:\Program Files (x86)\Microsoft Visual Studio\2017\Professional\VC\Tools\MSVC\14.16.27023\bin\HostX64\x64\cl.EXE"' : return code '0x2'
  372. > Stop.
  373. test config.qtbase.tests.posix_fallocate FAILED
  374. executing config test precompile_header
  375. + cd /d C:\qt-everywhere-src-5.15.2\config.tests\precompile_header && C:\qt-everywhere-src-5.15.2\qtbase\bin\qmake.exe "CONFIG -= qt debug_and_release app_bundle lib_bundle" "CONFIG += static warn_off console single_arch" "QMAKE_LIBDIR += C:\\Qt\\OpenSSL\\OpenSSL-1.1.1\\static\\x64\\Release\\lib" "INCLUDEPATH += C:\\Qt\\OpenSSL\\OpenSSL-1.1.1\\static\\x64\\Release\\include" C:/qt-everywhere-src-5.15.2/config.tests/precompile_header
  376. + cd /d C:\qt-everywhere-src-5.15.2\config.tests\precompile_header && set MAKEFLAGS=& nmake clean && set MAKEFLAGS=& nmake
  377. > Microsoft (R) Program Maintenance Utility Version 14.16.27045.0
  378. > Copyright (C) Microsoft Corporation. All rights reserved.
  379. > del main.obj .pch\precompile_header_pch.obj
  380. > del .pch\precompile_header_pch.pch
  381. > Microsoft (R) Program Maintenance Utility Version 14.16.27045.0
  382. > Copyright (C) Microsoft Corporation. All rights reserved.
  383. > cl -c -Yc -Fp.pch\precompile_header_pch.pch -Fo.pch\precompile_header_pch.obj -nologo -Zc:wchar_t -FS -Zc:rvalueCast -Zc:inline -Zc:strictStrings -Zc:throwingNew -Zc:referenceBinding -Zc:__cplusplus -O2 -MT -W0 -EHsc -DUNICODE -D_UNICODE -DWIN32 -D_ENABLE_EXTENDED_ALIGNED_STORAGE -DWIN64 -DNDEBUG -I. -IC:\Qt\OpenSSL\OpenSSL-1.1.1\static\x64\Release\include -IC:\qt-everywhere-src-5.15.2\qtbase\mkspecs\win32-msvc -TP header.h
  384. > header.h
  385. > cl -c -FIheader.h -Yuheader.h -Fp.pch\precompile_header_pch.pch -nologo -Zc:wchar_t -FS -Zc:rvalueCast -Zc:inline -Zc:strictStrings -Zc:throwingNew -Zc:referenceBinding -Zc:__cplusplus -O2 -MT -W0 -EHsc -DUNICODE -D_UNICODE -DWIN32 -D_ENABLE_EXTENDED_ALIGNED_STORAGE -DWIN64 -DNDEBUG -I. -IC:\Qt\OpenSSL\OpenSSL-1.1.1\static\x64\Release\include -IC:\qt-everywhere-src-5.15.2\qtbase\mkspecs\win32-msvc -Fo @C:\Users\MyUser\AppData\Local\Temp\nm7371.tmp
  386. > main.cpp
  387. > link /NOLOGO /DYNAMICBASE /NXCOMPAT /OPT:REF /INCREMENTAL:NO /SUBSYSTEM:CONSOLE "/MANIFESTDEPENDENCY:type='win32' name='Microsoft.Windows.Common-Controls' version='6.0.0.0' publicKeyToken='6595b64144ccf1df' language='*' processorArchitecture='*'" /MANIFEST:embed /OUT:precompile_header.exe @C:\Users\MyUser\AppData\Local\Temp\nm7392.tmp
  388. test config.qtbase.tests.precompile_header succeeded
  389. executing config test rdrnd
  390. + cd /d C:\qt-everywhere-src-5.15.2\config.tests\x86_simd && C:\qt-everywhere-src-5.15.2\qtbase\bin\qmake.exe "CONFIG -= qt debug_and_release app_bundle lib_bundle" "CONFIG += static warn_off console single_arch" "QMAKE_LIBDIR += C:\\Qt\\OpenSSL\\OpenSSL-1.1.1\\static\\x64\\Release\\lib" "INCLUDEPATH += C:\\Qt\\OpenSSL\\OpenSSL-1.1.1\\static\\x64\\Release\\include" "CONFIG+=add_cflags" "DEFINES+=NO_ATTRIBUTE" "SIMD=rdrnd" C:/qt-everywhere-src-5.15.2/qtbase/config.tests/x86_simd
  391. + cd /d C:\qt-everywhere-src-5.15.2\config.tests\x86_simd && set MAKEFLAGS=& nmake clean && set MAKEFLAGS=& nmake
  392. > Microsoft (R) Program Maintenance Utility Version 14.16.27045.0
  393. > Copyright (C) Microsoft Corporation. All rights reserved.
  394. > del main.obj
  395. > Microsoft (R) Program Maintenance Utility Version 14.16.27045.0
  396. > Copyright (C) Microsoft Corporation. All rights reserved.
  397. > cl -c -nologo -Zc:wchar_t -FS -Zc:rvalueCast -Zc:inline -Zc:strictStrings -Zc:throwingNew -Zc:referenceBinding -Zc:__cplusplus -O2 -MT -W0 -EHsc -DUNICODE -D_UNICODE -DWIN32 -D_ENABLE_EXTENDED_ALIGNED_STORAGE -DWIN64 -DNO_ATTRIBUTE -DQT_COMPILER_SUPPORTS_RDRND -DNDEBUG -IC:\qt-everywhere-src-5.15.2\qtbase\config.tests\x86_simd -I. -IC:\Qt\OpenSSL\OpenSSL-1.1.1\static\x64\Release\include -IC:\qt-everywhere-src-5.15.2\qtbase\mkspecs\win32-msvc -Fo @C:\Users\MyUser\AppData\Local\Temp\nm743C.tmp
  398. > main.cpp
  399. > link /NOLOGO /DYNAMICBASE /NXCOMPAT /OPT:REF /INCREMENTAL:NO /SUBSYSTEM:CONSOLE "/MANIFESTDEPENDENCY:type='win32' name='Microsoft.Windows.Common-Controls' version='6.0.0.0' publicKeyToken='6595b64144ccf1df' language='*' processorArchitecture='*'" /MANIFEST:embed /OUT:x86_simd.exe @C:\Users\MyUser\AppData\Local\Temp\nm747C.tmp
  400. test config.qtbase.tests.rdrnd succeeded
  401. executing config test rdseed
  402. + cd /d C:\qt-everywhere-src-5.15.2\config.tests\x86_simd && C:\qt-everywhere-src-5.15.2\qtbase\bin\qmake.exe "CONFIG -= qt debug_and_release app_bundle lib_bundle" "CONFIG += static warn_off console single_arch" "QMAKE_LIBDIR += C:\\Qt\\OpenSSL\\OpenSSL-1.1.1\\static\\x64\\Release\\lib" "INCLUDEPATH += C:\\Qt\\OpenSSL\\OpenSSL-1.1.1\\static\\x64\\Release\\include" "CONFIG+=add_cflags" "DEFINES+=NO_ATTRIBUTE" "SIMD=rdseed" C:/qt-everywhere-src-5.15.2/qtbase/config.tests/x86_simd
  403. + cd /d C:\qt-everywhere-src-5.15.2\config.tests\x86_simd && set MAKEFLAGS=& nmake clean && set MAKEFLAGS=& nmake
  404. > Microsoft (R) Program Maintenance Utility Version 14.16.27045.0
  405. > Copyright (C) Microsoft Corporation. All rights reserved.
  406. > del main.obj
  407. > Microsoft (R) Program Maintenance Utility Version 14.16.27045.0
  408. > Copyright (C) Microsoft Corporation. All rights reserved.
  409. > cl -c -nologo -Zc:wchar_t -FS -Zc:rvalueCast -Zc:inline -Zc:strictStrings -Zc:throwingNew -Zc:referenceBinding -Zc:__cplusplus -O2 -MT -W0 -EHsc -DUNICODE -D_UNICODE -DWIN32 -D_ENABLE_EXTENDED_ALIGNED_STORAGE -DWIN64 -DNO_ATTRIBUTE -DQT_COMPILER_SUPPORTS_RDSEED -DNDEBUG -IC:\qt-everywhere-src-5.15.2\qtbase\config.tests\x86_simd -I. -IC:\Qt\OpenSSL\OpenSSL-1.1.1\static\x64\Release\include -IC:\qt-everywhere-src-5.15.2\qtbase\mkspecs\win32-msvc -Fo @C:\Users\MyUser\AppData\Local\Temp\nm7536.tmp
  410. > main.cpp
  411. > link /NOLOGO /DYNAMICBASE /NXCOMPAT /OPT:REF /INCREMENTAL:NO /SUBSYSTEM:CONSOLE "/MANIFESTDEPENDENCY:type='win32' name='Microsoft.Windows.Common-Controls' version='6.0.0.0' publicKeyToken='6595b64144ccf1df' language='*' processorArchitecture='*'" /MANIFEST:embed /OUT:x86_simd.exe @C:\Users\MyUser\AppData\Local\Temp\nm7576.tmp
  412. test config.qtbase.tests.rdseed succeeded
  413. executing config test shani
  414. + cd /d C:\qt-everywhere-src-5.15.2\config.tests\x86_simd && C:\qt-everywhere-src-5.15.2\qtbase\bin\qmake.exe "CONFIG -= qt debug_and_release app_bundle lib_bundle" "CONFIG += static warn_off console single_arch" "QMAKE_LIBDIR += C:\\Qt\\OpenSSL\\OpenSSL-1.1.1\\static\\x64\\Release\\lib" "INCLUDEPATH += C:\\Qt\\OpenSSL\\OpenSSL-1.1.1\\static\\x64\\Release\\include" "CONFIG+=add_cflags" "DEFINES+=NO_ATTRIBUTE" "SIMD=shani" C:/qt-everywhere-src-5.15.2/qtbase/config.tests/x86_simd
  415. + cd /d C:\qt-everywhere-src-5.15.2\config.tests\x86_simd && set MAKEFLAGS=& nmake clean && set MAKEFLAGS=& nmake
  416. > Microsoft (R) Program Maintenance Utility Version 14.16.27045.0
  417. > Copyright (C) Microsoft Corporation. All rights reserved.
  418. > del main.obj
  419. > Microsoft (R) Program Maintenance Utility Version 14.16.27045.0
  420. > Copyright (C) Microsoft Corporation. All rights reserved.
  421. > cl -c -nologo -Zc:wchar_t -FS -Zc:rvalueCast -Zc:inline -Zc:strictStrings -Zc:throwingNew -Zc:referenceBinding -Zc:__cplusplus -O2 -MT -W0 -EHsc -DUNICODE -D_UNICODE -DWIN32 -D_ENABLE_EXTENDED_ALIGNED_STORAGE -DWIN64 -DNO_ATTRIBUTE -DQT_COMPILER_SUPPORTS_SHANI -DNDEBUG -IC:\qt-everywhere-src-5.15.2\qtbase\config.tests\x86_simd -I. -IC:\Qt\OpenSSL\OpenSSL-1.1.1\static\x64\Release\include -IC:\qt-everywhere-src-5.15.2\qtbase\mkspecs\win32-msvc -Fo @C:\Users\MyUser\AppData\Local\Temp\nm7621.tmp
  422. > main.cpp
  423. > link /NOLOGO /DYNAMICBASE /NXCOMPAT /OPT:REF /INCREMENTAL:NO /SUBSYSTEM:CONSOLE "/MANIFESTDEPENDENCY:type='win32' name='Microsoft.Windows.Common-Controls' version='6.0.0.0' publicKeyToken='6595b64144ccf1df' language='*' processorArchitecture='*'" /MANIFEST:embed /OUT:x86_simd.exe @C:\Users\MyUser\AppData\Local\Temp\nm7660.tmp
  424. test config.qtbase.tests.shani succeeded
  425. executing config test signaling_nan
  426. + cd /d C:\qt-everywhere-src-5.15.2\config.tests\signaling_nan && C:\qt-everywhere-src-5.15.2\qtbase\bin\qmake.exe "CONFIG -= qt debug_and_release app_bundle lib_bundle" "CONFIG += static warn_off console single_arch" "QMAKE_LIBDIR += C:\\Qt\\OpenSSL\\OpenSSL-1.1.1\\static\\x64\\Release\\lib" "INCLUDEPATH += C:\\Qt\\OpenSSL\\OpenSSL-1.1.1\\static\\x64\\Release\\include" C:/qt-everywhere-src-5.15.2/config.tests/signaling_nan
  427. + cd /d C:\qt-everywhere-src-5.15.2\config.tests\signaling_nan && set MAKEFLAGS=& nmake clean && set MAKEFLAGS=& nmake
  428. > Microsoft (R) Program Maintenance Utility Version 14.16.27045.0
  429. > Copyright (C) Microsoft Corporation. All rights reserved.
  430. > del main.obj
  431. > Microsoft (R) Program Maintenance Utility Version 14.16.27045.0
  432. > Copyright (C) Microsoft Corporation. All rights reserved.
  433. > cl -c -nologo -Zc:wchar_t -FS -Zc:rvalueCast -Zc:inline -Zc:strictStrings -Zc:throwingNew -Zc:referenceBinding -Zc:__cplusplus -O2 -MT -W0 -EHsc -DUNICODE -D_UNICODE -DWIN32 -D_ENABLE_EXTENDED_ALIGNED_STORAGE -DWIN64 -DNDEBUG -I. -IC:\Qt\OpenSSL\OpenSSL-1.1.1\static\x64\Release\include -IC:\qt-everywhere-src-5.15.2\qtbase\mkspecs\win32-msvc -Fo @C:\Users\MyUser\AppData\Local\Temp\nm770B.tmp
  434. > main.cpp
  435. > link /NOLOGO /DYNAMICBASE /NXCOMPAT /OPT:REF /INCREMENTAL:NO /SUBSYSTEM:CONSOLE "/MANIFESTDEPENDENCY:type='win32' name='Microsoft.Windows.Common-Controls' version='6.0.0.0' publicKeyToken='6595b64144ccf1df' language='*' processorArchitecture='*'" /MANIFEST:embed /OUT:signaling_nan.exe @C:\Users\MyUser\AppData\Local\Temp\nm775A.tmp
  436. test config.qtbase.tests.signaling_nan succeeded
  437. executing config test stl
  438. + cd /d C:\qt-everywhere-src-5.15.2\config.tests\stl && C:\qt-everywhere-src-5.15.2\qtbase\bin\qmake.exe "CONFIG -= qt debug_and_release app_bundle lib_bundle" "CONFIG += static warn_off console single_arch" "QMAKE_LIBDIR += C:\\Qt\\OpenSSL\\OpenSSL-1.1.1\\static\\x64\\Release\\lib" "INCLUDEPATH += C:\\Qt\\OpenSSL\\OpenSSL-1.1.1\\static\\x64\\Release\\include" C:/qt-everywhere-src-5.15.2/qtbase/config.tests/stl
  439. + cd /d C:\qt-everywhere-src-5.15.2\config.tests\stl && set MAKEFLAGS=& nmake clean && set MAKEFLAGS=& nmake
  440. > Microsoft (R) Program Maintenance Utility Version 14.16.27045.0
  441. > Copyright (C) Microsoft Corporation. All rights reserved.
  442. > del stltest.obj
  443. > Microsoft (R) Program Maintenance Utility Version 14.16.27045.0
  444. > Copyright (C) Microsoft Corporation. All rights reserved.
  445. > cl -c -nologo -Zc:wchar_t -FS -Zc:rvalueCast -Zc:inline -Zc:strictStrings -Zc:throwingNew -Zc:referenceBinding -Zc:__cplusplus -O2 -MT -W0 -EHsc -DUNICODE -D_UNICODE -DWIN32 -D_ENABLE_EXTENDED_ALIGNED_STORAGE -DWIN64 -DNDEBUG -IC:\qt-everywhere-src-5.15.2\qtbase\config.tests\stl -I. -IC:\Qt\OpenSSL\OpenSSL-1.1.1\static\x64\Release\include -IC:\qt-everywhere-src-5.15.2\qtbase\mkspecs\win32-msvc -Fo @C:\Users\MyUser\AppData\Local\Temp\nm7815.tmp
  446. > stltest.cpp
  447. > link /NOLOGO /DYNAMICBASE /NXCOMPAT /OPT:REF /INCREMENTAL:NO /SUBSYSTEM:CONSOLE "/MANIFESTDEPENDENCY:type='win32' name='Microsoft.Windows.Common-Controls' version='6.0.0.0' publicKeyToken='6595b64144ccf1df' language='*' processorArchitecture='*'" /MANIFEST:embed /OUT:stl.exe @C:\Users\MyUser\AppData\Local\Temp\nm795E.tmp
  448. test config.qtbase.tests.stl succeeded
  449. looking for library zlib
  450. Trying source 0 (type inline) of library zlib ...
  451. zlib.h not found in [] and global paths.
  452. => source produced no result.
  453. Trying source 1 (type inline) of library zlib ...
  454. zlib.h not found in [] and global paths.
  455. => source produced no result.
  456. Trying source 2 (type inline) of library zlib ...
  457. => source failed condition '!config.msvc'.
  458. Trying source 3 (type inline) of library zlib ...
  459. => source failed condition 'config.wasm'.
  460. test config.qtbase.libraries.zlib FAILED
  461. executing config test x86SimdAlways
  462. + cd /d C:\qt-everywhere-src-5.15.2\config.tests\x86_simd && C:\qt-everywhere-src-5.15.2\qtbase\bin\qmake.exe "CONFIG -= qt debug_and_release app_bundle lib_bundle" "CONFIG += static warn_off console single_arch" "QMAKE_LIBDIR += C:\\Qt\\OpenSSL\\OpenSSL-1.1.1\\static\\x64\\Release\\lib" "INCLUDEPATH += C:\\Qt\\OpenSSL\\OpenSSL-1.1.1\\static\\x64\\Release\\include" "SIMD=aesni avx avx2 avx512bw avx512cd avx512dq avx512er avx512f avx512ifma avx512pf avx512vbmi avx512vl f16c rdrnd rdseed shani sse2 sse3 sse4_1 sse4_2 ssse3" C:/qt-everywhere-src-5.15.2/qtbase/config.tests/x86_simd
  463. + cd /d C:\qt-everywhere-src-5.15.2\config.tests\x86_simd && set MAKEFLAGS=& nmake clean && set MAKEFLAGS=& nmake
  464. > Microsoft (R) Program Maintenance Utility Version 14.16.27045.0
  465. > Copyright (C) Microsoft Corporation. All rights reserved.
  466. > del main.obj
  467. > Microsoft (R) Program Maintenance Utility Version 14.16.27045.0
  468. > Copyright (C) Microsoft Corporation. All rights reserved.
  469. > cl -c -nologo -Zc:wchar_t -FS -Zc:rvalueCast -Zc:inline -Zc:strictStrings -Zc:throwingNew -Zc:referenceBinding -Zc:__cplusplus -O2 -MT -W0 -EHsc -DUNICODE -D_UNICODE -DWIN32 -D_ENABLE_EXTENDED_ALIGNED_STORAGE -DWIN64 -DQT_COMPILER_SUPPORTS_AESNI -DQT_COMPILER_SUPPORTS_AVX -DQT_COMPILER_SUPPORTS_AVX2 -DQT_COMPILER_SUPPORTS_AVX512BW -DQT_COMPILER_SUPPORTS_AVX512CD -DQT_COMPILER_SUPPORTS_AVX512DQ -DQT_COMPILER_SUPPORTS_AVX512ER -DQT_COMPILER_SUPPORTS_AVX512F -DQT_COMPILER_SUPPORTS_AVX512IFMA -DQT_COMPILER_SUPPORTS_AVX512PF -DQT_COMPILER_SUPPORTS_AVX512VBMI -DQT_COMPILER_SUPPORTS_AVX512VL -DQT_COMPILER_SUPPORTS_F16C -DQT_COMPILER_SUPPORTS_RDRND -DQT_COMPILER_SUPPORTS_RDSEED -DQT_COMPILER_SUPPORTS_SHANI -DQT_COMPILER_SUPPORTS_SSE2 -DQT_COMPILER_SUPPORTS_SSE3 -DQT_COMPILER_SUPPORTS_SSE4_1 -DQT_COMPILER_SUPPORTS_SSE4_2 -DQT_COMPILER_SUPPORTS_SSSE3 -DNDEBUG -IC:\qt-everywhere-src-5.15.2\qtbase\config.tests\x86_simd -I. -IC:\Qt\OpenSSL\OpenSSL-1.1.1\static\x64\Release\include -IC:\qt-everywhere-src-5.15.2\qtbase\mkspecs\win32-msvc -Fo @C:\Users\MyUser\AppData\Local\Temp\nm7A18.tmp
  470. > main.cpp
  471. > link /NOLOGO /DYNAMICBASE /NXCOMPAT /OPT:REF /INCREMENTAL:NO /SUBSYSTEM:CONSOLE "/MANIFESTDEPENDENCY:type='win32' name='Microsoft.Windows.Common-Controls' version='6.0.0.0' publicKeyToken='6595b64144ccf1df' language='*' processorArchitecture='*'" /MANIFEST:embed /OUT:x86_simd.exe @C:\Users\MyUser\AppData\Local\Temp\nm7A58.tmp
  472. test config.qtbase.tests.x86SimdAlways succeeded
  473. looking for library zstd
  474. Trying source 0 (type pkgConfig) of library zstd ...
  475. pkg-config use disabled globally.
  476. => source produced no result.
  477. Trying source 1 (type inline) of library zstd ...
  478. + cd /d C:\qt-everywhere-src-5.15.2\config.tests\zstd && C:\qt-everywhere-src-5.15.2\qtbase\bin\qmake.exe "CONFIG -= qt debug_and_release app_bundle lib_bundle" "CONFIG += static warn_off console single_arch" "QMAKE_LIBDIR += C:\\Qt\\OpenSSL\\OpenSSL-1.1.1\\static\\x64\\Release\\lib" "INCLUDEPATH += C:\\Qt\\OpenSSL\\OpenSSL-1.1.1\\static\\x64\\Release\\include" "QMAKE_USE += zstd" "QMAKE_LIBS_ZSTD = -lzstd" C:/qt-everywhere-src-5.15.2/config.tests/zstd
  479. + cd /d C:\qt-everywhere-src-5.15.2\config.tests\zstd && set MAKEFLAGS=& nmake clean && set MAKEFLAGS=& nmake
  480. > Microsoft (R) Program Maintenance Utility Version 14.16.27045.0
  481. > Copyright (C) Microsoft Corporation. All rights reserved.
  482. > del main.obj
  483. > Could Not Find C:\qt-everywhere-src-5.15.2\config.tests\zstd\main.obj
  484. > Microsoft (R) Program Maintenance Utility Version 14.16.27045.0
  485. > Copyright (C) Microsoft Corporation. All rights reserved.
  486. > cl -c -nologo -Zc:wchar_t -FS -Zc:rvalueCast -Zc:inline -Zc:strictStrings -Zc:throwingNew -Zc:referenceBinding -Zc:__cplusplus -O2 -MT -W0 -EHsc -DUNICODE -D_UNICODE -DWIN32 -D_ENABLE_EXTENDED_ALIGNED_STORAGE -DWIN64 -DNDEBUG -I. -IC:\Qt\OpenSSL\OpenSSL-1.1.1\static\x64\Release\include -IC:\qt-everywhere-src-5.15.2\qtbase\mkspecs\win32-msvc -Fo @C:\Users\MyUser\AppData\Local\Temp\nm7B12.tmp
  487. > main.cpp
  488. > .\main.cpp(2): fatal error C1083: Cannot open include file: 'zstd.h': No such file or directory
  489. > NMAKE : fatal error U1077: '"C:\Program Files (x86)\Microsoft Visual Studio\2017\Professional\VC\Tools\MSVC\14.16.27023\bin\HostX64\x64\cl.EXE"' : return code '0x2'
  490. > Stop.
  491. => source failed verification.
  492. test config.qtbase.libraries.zstd FAILED
  493. executing config test cxx11_future
  494. + cd /d C:\qt-everywhere-src-5.15.2\config.tests\cxx11_future && C:\qt-everywhere-src-5.15.2\qtbase\bin\qmake.exe "CONFIG -= qt debug_and_release app_bundle lib_bundle" "CONFIG += static warn_off console single_arch" "QMAKE_LIBDIR += C:\\Qt\\OpenSSL\\OpenSSL-1.1.1\\static\\x64\\Release\\lib" "INCLUDEPATH += C:\\Qt\\OpenSSL\\OpenSSL-1.1.1\\static\\x64\\Release\\include" C:/qt-everywhere-src-5.15.2/config.tests/cxx11_future
  495. + cd /d C:\qt-everywhere-src-5.15.2\config.tests\cxx11_future && set MAKEFLAGS=& nmake clean && set MAKEFLAGS=& nmake
  496. > Microsoft (R) Program Maintenance Utility Version 14.16.27045.0
  497. > Copyright (C) Microsoft Corporation. All rights reserved.
  498. > del main.obj
  499. > Microsoft (R) Program Maintenance Utility Version 14.16.27045.0
  500. > Copyright (C) Microsoft Corporation. All rights reserved.
  501. > cl -c -nologo -Zc:wchar_t -FS -Zc:rvalueCast -Zc:inline -Zc:strictStrings -Zc:throwingNew -Zc:referenceBinding -Zc:__cplusplus -O2 -MT -W0 -EHsc -DUNICODE -D_UNICODE -DWIN32 -D_ENABLE_EXTENDED_ALIGNED_STORAGE -DWIN64 -DNDEBUG -I. -IC:\Qt\OpenSSL\OpenSSL-1.1.1\static\x64\Release\include -IC:\qt-everywhere-src-5.15.2\qtbase\mkspecs\win32-msvc -Fo @C:\Users\MyUser\AppData\Local\Temp\nm7BAF.tmp
  502. > main.cpp
  503. > link /NOLOGO /DYNAMICBASE /NXCOMPAT /OPT:REF /INCREMENTAL:NO /SUBSYSTEM:CONSOLE "/MANIFESTDEPENDENCY:type='win32' name='Microsoft.Windows.Common-Controls' version='6.0.0.0' publicKeyToken='6595b64144ccf1df' language='*' processorArchitecture='*'" /MANIFEST:embed /OUT:cxx11_future.exe @C:\Users\MyUser\AppData\Local\Temp\nm7E21.tmp
  504. test config.qtbase_corelib.tests.cxx11_future succeeded
  505. executing config test eventfd
  506. + cd /d C:\qt-everywhere-src-5.15.2\config.tests\eventfd && C:\qt-everywhere-src-5.15.2\qtbase\bin\qmake.exe "CONFIG -= qt debug_and_release app_bundle lib_bundle" "CONFIG += static warn_off console single_arch" "QMAKE_LIBDIR += C:\\Qt\\OpenSSL\\OpenSSL-1.1.1\\static\\x64\\Release\\lib" "INCLUDEPATH += C:\\Qt\\OpenSSL\\OpenSSL-1.1.1\\static\\x64\\Release\\include" C:/qt-everywhere-src-5.15.2/config.tests/eventfd
  507. + cd /d C:\qt-everywhere-src-5.15.2\config.tests\eventfd && set MAKEFLAGS=& nmake clean && set MAKEFLAGS=& nmake
  508. > Microsoft (R) Program Maintenance Utility Version 14.16.27045.0
  509. > Copyright (C) Microsoft Corporation. All rights reserved.
  510. > del main.obj
  511. > Could Not Find C:\qt-everywhere-src-5.15.2\config.tests\eventfd\main.obj
  512. > Microsoft (R) Program Maintenance Utility Version 14.16.27045.0
  513. > Copyright (C) Microsoft Corporation. All rights reserved.
  514. > cl -c -nologo -Zc:wchar_t -FS -Zc:rvalueCast -Zc:inline -Zc:strictStrings -Zc:throwingNew -Zc:referenceBinding -Zc:__cplusplus -O2 -MT -W0 -EHsc -DUNICODE -D_UNICODE -DWIN32 -D_ENABLE_EXTENDED_ALIGNED_STORAGE -DWIN64 -DNDEBUG -I. -IC:\Qt\OpenSSL\OpenSSL-1.1.1\static\x64\Release\include -IC:\qt-everywhere-src-5.15.2\qtbase\mkspecs\win32-msvc -Fo @C:\Users\MyUser\AppData\Local\Temp\nm7EEB.tmp
  515. > main.cpp
  516. > .\main.cpp(2): fatal error C1083: Cannot open include file: 'sys/eventfd.h': No such file or directory
  517. > NMAKE : fatal error U1077: '"C:\Program Files (x86)\Microsoft Visual Studio\2017\Professional\VC\Tools\MSVC\14.16.27023\bin\HostX64\x64\cl.EXE"' : return code '0x2'
  518. > Stop.
  519. test config.qtbase_corelib.tests.eventfd FAILED
  520. executing config test inotify
  521. + cd /d C:\qt-everywhere-src-5.15.2\config.tests\inotify && C:\qt-everywhere-src-5.15.2\qtbase\bin\qmake.exe "CONFIG -= qt debug_and_release app_bundle lib_bundle" "CONFIG += static warn_off console single_arch" "QMAKE_LIBDIR += C:\\Qt\\OpenSSL\\OpenSSL-1.1.1\\static\\x64\\Release\\lib" "INCLUDEPATH += C:\\Qt\\OpenSSL\\OpenSSL-1.1.1\\static\\x64\\Release\\include" C:/qt-everywhere-src-5.15.2/config.tests/inotify
  522. + cd /d C:\qt-everywhere-src-5.15.2\config.tests\inotify && set MAKEFLAGS=& nmake clean && set MAKEFLAGS=& nmake
  523. > Microsoft (R) Program Maintenance Utility Version 14.16.27045.0
  524. > Copyright (C) Microsoft Corporation. All rights reserved.
  525. > del main.obj
  526. > Could Not Find C:\qt-everywhere-src-5.15.2\config.tests\inotify\main.obj
  527. > Microsoft (R) Program Maintenance Utility Version 14.16.27045.0
  528. > Copyright (C) Microsoft Corporation. All rights reserved.
  529. > cl -c -nologo -Zc:wchar_t -FS -Zc:rvalueCast -Zc:inline -Zc:strictStrings -Zc:throwingNew -Zc:referenceBinding -Zc:__cplusplus -O2 -MT -W0 -EHsc -DUNICODE -D_UNICODE -DWIN32 -D_ENABLE_EXTENDED_ALIGNED_STORAGE -DWIN64 -DNDEBUG -I. -IC:\Qt\OpenSSL\OpenSSL-1.1.1\static\x64\Release\include -IC:\qt-everywhere-src-5.15.2\qtbase\mkspecs\win32-msvc -Fo @C:\Users\MyUser\AppData\Local\Temp\nm7F77.tmp
  530. > main.cpp
  531. > .\main.cpp(2): fatal error C1083: Cannot open include file: 'sys/inotify.h': No such file or directory
  532. > NMAKE : fatal error U1077: '"C:\Program Files (x86)\Microsoft Visual Studio\2017\Professional\VC\Tools\MSVC\14.16.27023\bin\HostX64\x64\cl.EXE"' : return code '0x2'
  533. > Stop.
  534. test config.qtbase_corelib.tests.inotify FAILED
  535. looking for library pcre2
  536. Trying source 0 (type pkgConfig) of library pcre2 ...
  537. pkg-config use disabled globally.
  538. => source produced no result.
  539. Trying source 1 (type inline) of library pcre2 ...
  540. pcre2.h not found in [] and global paths.
  541. => source produced no result.
  542. test config.qtbase_corelib.libraries.pcre2 FAILED
  543. looking for library slog2
  544. Trying source 0 (type inline) of library slog2 ...
  545. sys/slog2.h not found in [] and global paths.
  546. => source produced no result.
  547. test config.qtbase_corelib.libraries.slog2 FAILED
  548. looking for library libatomic
  549. Trying source 0 (type inline) of library libatomic ...
  550. + cd /d C:\qt-everywhere-src-5.15.2\config.tests\libatomic && C:\qt-everywhere-src-5.15.2\qtbase\bin\qmake.exe "CONFIG -= qt debug_and_release app_bundle lib_bundle" "CONFIG += static warn_off console single_arch" "QMAKE_LIBDIR += C:\\Qt\\OpenSSL\\OpenSSL-1.1.1\\static\\x64\\Release\\lib" "INCLUDEPATH += C:\\Qt\\OpenSSL\\OpenSSL-1.1.1\\static\\x64\\Release\\include" "QMAKE_USE += libatomic" "QMAKE_LIBS_LIBATOMIC = " C:/qt-everywhere-src-5.15.2/config.tests/libatomic
  551. + cd /d C:\qt-everywhere-src-5.15.2\config.tests\libatomic && set MAKEFLAGS=& nmake clean && set MAKEFLAGS=& nmake
  552. > Microsoft (R) Program Maintenance Utility Version 14.16.27045.0
  553. > Copyright (C) Microsoft Corporation. All rights reserved.
  554. > del main.obj
  555. > Microsoft (R) Program Maintenance Utility Version 14.16.27045.0
  556. > Copyright (C) Microsoft Corporation. All rights reserved.
  557. > cl -c -nologo -Zc:wchar_t -FS -Zc:rvalueCast -Zc:inline -Zc:strictStrings -Zc:throwingNew -Zc:referenceBinding -Zc:__cplusplus -O2 -MT -W0 -EHsc -DUNICODE -D_UNICODE -DWIN32 -D_ENABLE_EXTENDED_ALIGNED_STORAGE -DWIN64 -DNDEBUG -I. -IC:\Qt\OpenSSL\OpenSSL-1.1.1\static\x64\Release\include -IC:\qt-everywhere-src-5.15.2\qtbase\mkspecs\win32-msvc -Fo @C:\Users\MyUser\AppData\Local\Temp\nm8004.tmp
  558. > main.cpp
  559. > link /NOLOGO /DYNAMICBASE /NXCOMPAT /OPT:REF /INCREMENTAL:NO /SUBSYSTEM:CONSOLE "/MANIFESTDEPENDENCY:type='win32' name='Microsoft.Windows.Common-Controls' version='6.0.0.0' publicKeyToken='6595b64144ccf1df' language='*' processorArchitecture='*'" /MANIFEST:embed /OUT:libatomic.exe @C:\Users\MyUser\AppData\Local\Temp\nm80D0.tmp
  560. => source accepted.
  561. test config.qtbase_corelib.libraries.libatomic succeeded
  562. looking for library doubleconversion
  563. Trying source 0 (type inline) of library doubleconversion ...
  564. double-conversion/double-conversion.h not found in [] and global paths.
  565. => source produced no result.
  566. test config.qtbase_corelib.libraries.doubleconversion FAILED
  567. executing config test cloexec
  568. + cd /d C:\qt-everywhere-src-5.15.2\config.tests\cloexec && C:\qt-everywhere-src-5.15.2\qtbase\bin\qmake.exe "CONFIG -= qt debug_and_release app_bundle lib_bundle" "CONFIG += static warn_off console single_arch" "QMAKE_LIBDIR += C:\\Qt\\OpenSSL\\OpenSSL-1.1.1\\static\\x64\\Release\\lib" "INCLUDEPATH += C:\\Qt\\OpenSSL\\OpenSSL-1.1.1\\static\\x64\\Release\\include" C:/qt-everywhere-src-5.15.2/config.tests/cloexec
  569. + cd /d C:\qt-everywhere-src-5.15.2\config.tests\cloexec && set MAKEFLAGS=& nmake clean && set MAKEFLAGS=& nmake
  570. > Microsoft (R) Program Maintenance Utility Version 14.16.27045.0
  571. > Copyright (C) Microsoft Corporation. All rights reserved.
  572. > del main.obj
  573. > Could Not Find C:\qt-everywhere-src-5.15.2\config.tests\cloexec\main.obj
  574. > Microsoft (R) Program Maintenance Utility Version 14.16.27045.0
  575. > Copyright (C) Microsoft Corporation. All rights reserved.
  576. > cl -c -nologo -Zc:wchar_t -FS -Zc:rvalueCast -Zc:inline -Zc:strictStrings -Zc:throwingNew -Zc:referenceBinding -Zc:__cplusplus -O2 -MT -W0 -EHsc -DUNICODE -D_UNICODE -DWIN32 -D_ENABLE_EXTENDED_ALIGNED_STORAGE -DWIN64 -DNDEBUG -I. -IC:\Qt\OpenSSL\OpenSSL-1.1.1\static\x64\Release\include -IC:\qt-everywhere-src-5.15.2\qtbase\mkspecs\win32-msvc -Fo @C:\Users\MyUser\AppData\Local\Temp\nm818B.tmp
  577. > main.cpp
  578. > .\main.cpp(4): fatal error C1083: Cannot open include file: 'sys/socket.h': No such file or directory
  579. > NMAKE : fatal error U1077: '"C:\Program Files (x86)\Microsoft Visual Studio\2017\Professional\VC\Tools\MSVC\14.16.27023\bin\HostX64\x64\cl.EXE"' : return code '0x2'
  580. > Stop.
  581. test config.qtbase_corelib.tests.cloexec FAILED
  582. looking for library advapi32
  583. Trying source 0 (type inline) of library advapi32 ...
  584. => source accepted.
  585. test config.qtbase_corelib.libraries.advapi32 succeeded
  586. looking for library gdi32
  587. Trying source 0 (type inline) of library gdi32 ...
  588. => source accepted.
  589. test config.qtbase_corelib.libraries.gdi32 succeeded
  590. looking for library kernel32
  591. Trying source 0 (type inline) of library kernel32 ...
  592. => source accepted.
  593. test config.qtbase_corelib.libraries.kernel32 succeeded
  594. looking for library netapi32
  595. Trying source 0 (type inline) of library netapi32 ...
  596. => source accepted.
  597. test config.qtbase_corelib.libraries.netapi32 succeeded
  598. looking for library ole32
  599. Trying source 0 (type inline) of library ole32 ...
  600. => source accepted.
  601. test config.qtbase_corelib.libraries.ole32 succeeded
  602. looking for library shell32
  603. Trying source 0 (type inline) of library shell32 ...
  604. => source accepted.
  605. test config.qtbase_corelib.libraries.shell32 succeeded
  606. looking for library uuid
  607. Trying source 0 (type inline) of library uuid ...
  608. => source accepted.
  609. test config.qtbase_corelib.libraries.uuid succeeded
  610. looking for library user32
  611. Trying source 0 (type inline) of library user32 ...
  612. => source accepted.
  613. test config.qtbase_corelib.libraries.user32 succeeded
  614. looking for library winmm
  615. Trying source 0 (type inline) of library winmm ...
  616. => source accepted.
  617. test config.qtbase_corelib.libraries.winmm succeeded
  618. looking for library ws2_32
  619. Trying source 0 (type inline) of library ws2_32 ...
  620. => source accepted.
  621. test config.qtbase_corelib.libraries.ws2_32 succeeded
  622. executing config test cxx11_random
  623. + cd /d C:\qt-everywhere-src-5.15.2\config.tests\cxx11_random && C:\qt-everywhere-src-5.15.2\qtbase\bin\qmake.exe "CONFIG -= qt debug_and_release app_bundle lib_bundle" "CONFIG += static warn_off console single_arch" "QMAKE_LIBDIR += C:\\Qt\\OpenSSL\\OpenSSL-1.1.1\\static\\x64\\Release\\lib" "INCLUDEPATH += C:\\Qt\\OpenSSL\\OpenSSL-1.1.1\\static\\x64\\Release\\include" C:/qt-everywhere-src-5.15.2/config.tests/cxx11_random
  624. + cd /d C:\qt-everywhere-src-5.15.2\config.tests\cxx11_random && set MAKEFLAGS=& nmake clean && set MAKEFLAGS=& nmake
  625. > Microsoft (R) Program Maintenance Utility Version 14.16.27045.0
  626. > Copyright (C) Microsoft Corporation. All rights reserved.
  627. > del main.obj
  628. > Microsoft (R) Program Maintenance Utility Version 14.16.27045.0
  629. > Copyright (C) Microsoft Corporation. All rights reserved.
  630. > cl -c -nologo -Zc:wchar_t -FS -Zc:rvalueCast -Zc:inline -Zc:strictStrings -Zc:throwingNew -Zc:referenceBinding -Zc:__cplusplus -O2 -MT -W0 -EHsc -DUNICODE -D_UNICODE -DWIN32 -D_ENABLE_EXTENDED_ALIGNED_STORAGE -DWIN64 -DNDEBUG -I. -IC:\Qt\OpenSSL\OpenSSL-1.1.1\static\x64\Release\include -IC:\qt-everywhere-src-5.15.2\qtbase\mkspecs\win32-msvc -Fo @C:\Users\MyUser\AppData\Local\Temp\nm8227.tmp
  631. > main.cpp
  632. > link /NOLOGO /DYNAMICBASE /NXCOMPAT /OPT:REF /INCREMENTAL:NO /SUBSYSTEM:CONSOLE "/MANIFESTDEPENDENCY:type='win32' name='Microsoft.Windows.Common-Controls' version='6.0.0.0' publicKeyToken='6595b64144ccf1df' language='*' processorArchitecture='*'" /MANIFEST:embed /OUT:cxx11_random.exe @C:\Users\MyUser\AppData\Local\Temp\nm82F3.tmp
  633. test config.qtbase_corelib.tests.cxx11_random succeeded
  634. executing config test atomicfptr
  635. + cd /d C:\qt-everywhere-src-5.15.2\config.tests\atomicfptr && C:\qt-everywhere-src-5.15.2\qtbase\bin\qmake.exe "CONFIG -= qt debug_and_release app_bundle lib_bundle" "CONFIG += static warn_off console single_arch" "QMAKE_LIBDIR += C:\\Qt\\OpenSSL\\OpenSSL-1.1.1\\static\\x64\\Release\\lib" "INCLUDEPATH += C:\\Qt\\OpenSSL\\OpenSSL-1.1.1\\static\\x64\\Release\\include" C:/qt-everywhere-src-5.15.2/config.tests/atomicfptr
  636. + cd /d C:\qt-everywhere-src-5.15.2\config.tests\atomicfptr && set MAKEFLAGS=& nmake clean && set MAKEFLAGS=& nmake
  637. > Microsoft (R) Program Maintenance Utility Version 14.16.27045.0
  638. > Copyright (C) Microsoft Corporation. All rights reserved.
  639. > del main.obj
  640. > Microsoft (R) Program Maintenance Utility Version 14.16.27045.0
  641. > Copyright (C) Microsoft Corporation. All rights reserved.
  642. > cl -c -nologo -Zc:wchar_t -FS -Zc:rvalueCast -Zc:inline -Zc:strictStrings -Zc:throwingNew -Zc:referenceBinding -Zc:__cplusplus -O2 -MT -W0 -EHsc -DUNICODE -D_UNICODE -DWIN32 -D_ENABLE_EXTENDED_ALIGNED_STORAGE -DWIN64 -DNDEBUG -I. -IC:\Qt\OpenSSL\OpenSSL-1.1.1\static\x64\Release\include -IC:\qt-everywhere-src-5.15.2\qtbase\mkspecs\win32-msvc -Fo @C:\Users\MyUser\AppData\Local\Temp\nm83AE.tmp
  643. > main.cpp
  644. > link /NOLOGO /DYNAMICBASE /NXCOMPAT /OPT:REF /INCREMENTAL:NO /SUBSYSTEM:CONSOLE "/MANIFESTDEPENDENCY:type='win32' name='Microsoft.Windows.Common-Controls' version='6.0.0.0' publicKeyToken='6595b64144ccf1df' language='*' processorArchitecture='*'" /MANIFEST:embed /OUT:atomicfptr.exe @C:\Users\MyUser\AppData\Local\Temp\nm846A.tmp
  645. test config.qtbase_corelib.tests.atomicfptr succeeded
  646. looking for library openssl
  647. Trying source 0 (type openssl) of library openssl ...
  648. $OPENSSL_LIBS is not set.
  649. => source produced no result.
  650. Trying source 1 (type inline) of library openssl ...
  651. + cd /d C:\qt-everywhere-src-5.15.2\config.tests\openssl && C:\qt-everywhere-src-5.15.2\qtbase\bin\qmake.exe "CONFIG -= qt debug_and_release app_bundle lib_bundle" "CONFIG += static warn_off console single_arch" "QMAKE_LIBDIR += C:\\Qt\\OpenSSL\\OpenSSL-1.1.1\\static\\x64\\Release\\lib" "INCLUDEPATH += C:\\Qt\\OpenSSL\\OpenSSL-1.1.1\\static\\x64\\Release\\include" "QMAKE_USE += openssl" "QMAKE_LIBS_OPENSSL = -lssleay32 -llibeay32 -lUser32 -lWs2_32 -lAdvapi32 -lGdi32" C:/qt-everywhere-src-5.15.2/config.tests/openssl
  652. + cd /d C:\qt-everywhere-src-5.15.2\config.tests\openssl && set MAKEFLAGS=& nmake clean && set MAKEFLAGS=& nmake
  653. > Microsoft (R) Program Maintenance Utility Version 14.16.27045.0
  654. > Copyright (C) Microsoft Corporation. All rights reserved.
  655. > del main.obj
  656. > Microsoft (R) Program Maintenance Utility Version 14.16.27045.0
  657. > Copyright (C) Microsoft Corporation. All rights reserved.
  658. > cl -c -nologo -Zc:wchar_t -FS -Zc:rvalueCast -Zc:inline -Zc:strictStrings -Zc:throwingNew -Zc:referenceBinding -Zc:__cplusplus -O2 -MT -W0 -EHsc -DUNICODE -D_UNICODE -DWIN32 -D_ENABLE_EXTENDED_ALIGNED_STORAGE -DWIN64 -DNDEBUG -I. -IC:\Qt\OpenSSL\OpenSSL-1.1.1\static\x64\Release\include -IC:\qt-everywhere-src-5.15.2\qtbase\mkspecs\win32-msvc -Fo @C:\Users\MyUser\AppData\Local\Temp\nm85D0.tmp
  659. > main.cpp
  660. > link /NOLOGO /DYNAMICBASE /NXCOMPAT /OPT:REF /INCREMENTAL:NO /SUBSYSTEM:CONSOLE "/MANIFESTDEPENDENCY:type='win32' name='Microsoft.Windows.Common-Controls' version='6.0.0.0' publicKeyToken='6595b64144ccf1df' language='*' processorArchitecture='*'" /MANIFEST:embed /OUT:openssl.exe @C:\Users\MyUser\AppData\Local\Temp\nm863F.tmp
  661. > LINK : fatal error LNK1181: cannot open input file 'ssleay32.lib'
  662. > NMAKE : fatal error U1077: '"C:\Program Files (x86)\Microsoft Visual Studio\2017\Professional\VC\Tools\MSVC\14.16.27023\bin\HostX64\x64\link.EXE"' : return code '0x49d'
  663. > Stop.
  664. => source failed verification.
  665. Trying source 2 (type inline) of library openssl ...
  666. + cd /d C:\qt-everywhere-src-5.15.2\config.tests\openssl && C:\qt-everywhere-src-5.15.2\qtbase\bin\qmake.exe "CONFIG -= qt debug_and_release app_bundle lib_bundle" "CONFIG += static warn_off console single_arch" "QMAKE_LIBDIR += C:\\Qt\\OpenSSL\\OpenSSL-1.1.1\\static\\x64\\Release\\lib" "INCLUDEPATH += C:\\Qt\\OpenSSL\\OpenSSL-1.1.1\\static\\x64\\Release\\include" "QMAKE_USE += openssl" "QMAKE_LIBS_OPENSSL = -llibssl -llibcrypto -lUser32 -lWs2_32 -lAdvapi32 -lCrypt32" C:/qt-everywhere-src-5.15.2/config.tests/openssl
  667. + cd /d C:\qt-everywhere-src-5.15.2\config.tests\openssl && set MAKEFLAGS=& nmake clean && set MAKEFLAGS=& nmake
  668. > Microsoft (R) Program Maintenance Utility Version 14.16.27045.0
  669. > Copyright (C) Microsoft Corporation. All rights reserved.
  670. > del main.obj
  671. > Microsoft (R) Program Maintenance Utility Version 14.16.27045.0
  672. > Copyright (C) Microsoft Corporation. All rights reserved.
  673. > cl -c -nologo -Zc:wchar_t -FS -Zc:rvalueCast -Zc:inline -Zc:strictStrings -Zc:throwingNew -Zc:referenceBinding -Zc:__cplusplus -O2 -MT -W0 -EHsc -DUNICODE -D_UNICODE -DWIN32 -D_ENABLE_EXTENDED_ALIGNED_STORAGE -DWIN64 -DNDEBUG -I. -IC:\Qt\OpenSSL\OpenSSL-1.1.1\static\x64\Release\include -IC:\qt-everywhere-src-5.15.2\qtbase\mkspecs\win32-msvc -Fo @C:\Users\MyUser\AppData\Local\Temp\nm86BB.tmp
  674. > main.cpp
  675. > link /NOLOGO /DYNAMICBASE /NXCOMPAT /OPT:REF /INCREMENTAL:NO /SUBSYSTEM:CONSOLE "/MANIFESTDEPENDENCY:type='win32' name='Microsoft.Windows.Common-Controls' version='6.0.0.0' publicKeyToken='6595b64144ccf1df' language='*' processorArchitecture='*'" /MANIFEST:embed /OUT:openssl.exe @C:\Users\MyUser\AppData\Local\Temp\nm8729.tmp
  676. => source accepted.
  677. test config.qtbase_network.libraries.openssl succeeded
  678. executing config test dtls
  679. + cd /d C:\qt-everywhere-src-5.15.2\config.tests\dtls && C:\qt-everywhere-src-5.15.2\qtbase\bin\qmake.exe "CONFIG -= qt debug_and_release app_bundle lib_bundle" "CONFIG += static warn_off console single_arch" "QMAKE_LIBDIR += C:\\Qt\\OpenSSL\\OpenSSL-1.1.1\\static\\x64\\Release\\lib" "INCLUDEPATH += C:\\Qt\\OpenSSL\\OpenSSL-1.1.1\\static\\x64\\Release\\include" "QMAKE_USE += openssl" "QMAKE_LIBS_OPENSSL = -llibssl -llibcrypto -lUser32 -lWs2_32 -lAdvapi32 -lCrypt32" C:/qt-everywhere-src-5.15.2/config.tests/dtls
  680. + cd /d C:\qt-everywhere-src-5.15.2\config.tests\dtls && set MAKEFLAGS=& nmake clean && set MAKEFLAGS=& nmake
  681. > Microsoft (R) Program Maintenance Utility Version 14.16.27045.0
  682. > Copyright (C) Microsoft Corporation. All rights reserved.
  683. > del main.obj
  684. > Microsoft (R) Program Maintenance Utility Version 14.16.27045.0
  685. > Copyright (C) Microsoft Corporation. All rights reserved.
  686. > cl -c -nologo -Zc:wchar_t -FS -Zc:rvalueCast -Zc:inline -Zc:strictStrings -Zc:throwingNew -Zc:referenceBinding -Zc:__cplusplus -O2 -MT -W0 -EHsc -DUNICODE -D_UNICODE -DWIN32 -D_ENABLE_EXTENDED_ALIGNED_STORAGE -DWIN64 -DNDEBUG -I. -IC:\Qt\OpenSSL\OpenSSL-1.1.1\static\x64\Release\include -IC:\qt-everywhere-src-5.15.2\qtbase\mkspecs\win32-msvc -Fo @C:\Users\MyUser\AppData\Local\Temp\nm88CE.tmp
  687. > main.cpp
  688. > link /NOLOGO /DYNAMICBASE /NXCOMPAT /OPT:REF /INCREMENTAL:NO /SUBSYSTEM:CONSOLE "/MANIFESTDEPENDENCY:type='win32' name='Microsoft.Windows.Common-Controls' version='6.0.0.0' publicKeyToken='6595b64144ccf1df' language='*' processorArchitecture='*'" /MANIFEST:embed /OUT:dtls.exe @C:\Users\MyUser\AppData\Local\Temp\nm892D.tmp
  689. test config.qtbase_network.tests.dtls succeeded
  690. Trying source 0 (type makeSpec) of library network ...
  691. => source accepted.
  692. executing config test getifaddrs
  693. + cd /d C:\qt-everywhere-src-5.15.2\config.tests\getifaddrs && C:\qt-everywhere-src-5.15.2\qtbase\bin\qmake.exe "CONFIG -= qt debug_and_release app_bundle lib_bundle" "CONFIG += static warn_off console single_arch" "QMAKE_LIBDIR += C:\\Qt\\OpenSSL\\OpenSSL-1.1.1\\static\\x64\\Release\\lib" "INCLUDEPATH += C:\\Qt\\OpenSSL\\OpenSSL-1.1.1\\static\\x64\\Release\\include" "QMAKE_USE += network" "QMAKE_LIBS_NETWORK = ws2_32.lib" C:/qt-everywhere-src-5.15.2/config.tests/getifaddrs
  694. + cd /d C:\qt-everywhere-src-5.15.2\config.tests\getifaddrs && set MAKEFLAGS=& nmake clean && set MAKEFLAGS=& nmake
  695. > Microsoft (R) Program Maintenance Utility Version 14.16.27045.0
  696. > Copyright (C) Microsoft Corporation. All rights reserved.
  697. > del main.obj
  698. > Could Not Find C:\qt-everywhere-src-5.15.2\config.tests\getifaddrs\main.obj
  699. > Microsoft (R) Program Maintenance Utility Version 14.16.27045.0
  700. > Copyright (C) Microsoft Corporation. All rights reserved.
  701. > cl -c -nologo -Zc:wchar_t -FS -Zc:rvalueCast -Zc:inline -Zc:strictStrings -Zc:throwingNew -Zc:referenceBinding -Zc:__cplusplus -O2 -MT -W0 -EHsc -DUNICODE -D_UNICODE -DWIN32 -D_ENABLE_EXTENDED_ALIGNED_STORAGE -DWIN64 -DNDEBUG -I. -IC:\Qt\OpenSSL\OpenSSL-1.1.1\static\x64\Release\include -IC:\qt-everywhere-src-5.15.2\qtbase\mkspecs\win32-msvc -Fo @C:\Users\MyUser\AppData\Local\Temp\nm89E7.tmp
  702. > main.cpp
  703. > .\main.cpp(3): fatal error C1083: Cannot open include file: 'sys/socket.h': No such file or directory
  704. > NMAKE : fatal error U1077: '"C:\Program Files (x86)\Microsoft Visual Studio\2017\Professional\VC\Tools\MSVC\14.16.27023\bin\HostX64\x64\cl.EXE"' : return code '0x2'
  705. > Stop.
  706. test config.qtbase_network.tests.getifaddrs FAILED
  707. executing config test ipv6ifname
  708. + cd /d C:\qt-everywhere-src-5.15.2\config.tests\ipv6ifname && C:\qt-everywhere-src-5.15.2\qtbase\bin\qmake.exe "CONFIG -= qt debug_and_release app_bundle lib_bundle" "CONFIG += static warn_off console single_arch" "QMAKE_LIBDIR += C:\\Qt\\OpenSSL\\OpenSSL-1.1.1\\static\\x64\\Release\\lib" "INCLUDEPATH += C:\\Qt\\OpenSSL\\OpenSSL-1.1.1\\static\\x64\\Release\\include" "QMAKE_USE += network" "QMAKE_LIBS_NETWORK = ws2_32.lib" C:/qt-everywhere-src-5.15.2/config.tests/ipv6ifname
  709. + cd /d C:\qt-everywhere-src-5.15.2\config.tests\ipv6ifname && set MAKEFLAGS=& nmake clean && set MAKEFLAGS=& nmake
  710. > Microsoft (R) Program Maintenance Utility Version 14.16.27045.0
  711. > Copyright (C) Microsoft Corporation. All rights reserved.
  712. > del main.obj
  713. > Could Not Find C:\qt-everywhere-src-5.15.2\config.tests\ipv6ifname\main.obj
  714. > Microsoft (R) Program Maintenance Utility Version 14.16.27045.0
  715. > Copyright (C) Microsoft Corporation. All rights reserved.
  716. > cl -c -nologo -Zc:wchar_t -FS -Zc:rvalueCast -Zc:inline -Zc:strictStrings -Zc:throwingNew -Zc:referenceBinding -Zc:__cplusplus -O2 -MT -W0 -EHsc -DUNICODE -D_UNICODE -DWIN32 -D_ENABLE_EXTENDED_ALIGNED_STORAGE -DWIN64 -DNDEBUG -I. -IC:\Qt\OpenSSL\OpenSSL-1.1.1\static\x64\Release\include -IC:\qt-everywhere-src-5.15.2\qtbase\mkspecs\win32-msvc -Fo @C:\Users\MyUser\AppData\Local\Temp\nm8A84.tmp
  717. > main.cpp
  718. > .\main.cpp(3): fatal error C1083: Cannot open include file: 'sys/socket.h': No such file or directory
  719. > NMAKE : fatal error U1077: '"C:\Program Files (x86)\Microsoft Visual Studio\2017\Professional\VC\Tools\MSVC\14.16.27023\bin\HostX64\x64\cl.EXE"' : return code '0x2'
  720. > Stop.
  721. test config.qtbase_network.tests.ipv6ifname FAILED
  722. executing config test netlistmgr
  723. + cd /d C:\qt-everywhere-src-5.15.2\config.tests\netlistmgr && C:\qt-everywhere-src-5.15.2\qtbase\bin\qmake.exe "CONFIG -= qt debug_and_release app_bundle lib_bundle" "CONFIG += static warn_off console single_arch" "QMAKE_LIBDIR += C:\\Qt\\OpenSSL\\OpenSSL-1.1.1\\static\\x64\\Release\\lib" "INCLUDEPATH += C:\\Qt\\OpenSSL\\OpenSSL-1.1.1\\static\\x64\\Release\\include" C:/qt-everywhere-src-5.15.2/config.tests/netlistmgr
  724. + cd /d C:\qt-everywhere-src-5.15.2\config.tests\netlistmgr && set MAKEFLAGS=& nmake clean && set MAKEFLAGS=& nmake
  725. > Microsoft (R) Program Maintenance Utility Version 14.16.27045.0
  726. > Copyright (C) Microsoft Corporation. All rights reserved.
  727. > del main.obj
  728. > Microsoft (R) Program Maintenance Utility Version 14.16.27045.0
  729. > Copyright (C) Microsoft Corporation. All rights reserved.
  730. > cl -c -nologo -Zc:wchar_t -FS -Zc:rvalueCast -Zc:inline -Zc:strictStrings -Zc:throwingNew -Zc:referenceBinding -Zc:__cplusplus -O2 -MT -W0 -EHsc -DUNICODE -D_UNICODE -DWIN32 -D_ENABLE_EXTENDED_ALIGNED_STORAGE -DWIN64 -DNDEBUG -I. -IC:\Qt\OpenSSL\OpenSSL-1.1.1\static\x64\Release\include -IC:\qt-everywhere-src-5.15.2\qtbase\mkspecs\win32-msvc -Fo @C:\Users\MyUser\AppData\Local\Temp\nm8B10.tmp
  731. > main.cpp
  732. > link /NOLOGO /DYNAMICBASE /NXCOMPAT /OPT:REF /INCREMENTAL:NO /SUBSYSTEM:CONSOLE "/MANIFESTDEPENDENCY:type='win32' name='Microsoft.Windows.Common-Controls' version='6.0.0.0' publicKeyToken='6595b64144ccf1df' language='*' processorArchitecture='*'" /MANIFEST:embed /OUT:netlistmgr.exe @C:\Users\MyUser\AppData\Local\Temp\nm8C4A.tmp
  733. test config.qtbase_network.tests.netlistmgr succeeded
  734. executing config test ocsp
  735. + cd /d C:\qt-everywhere-src-5.15.2\config.tests\ocsp && C:\qt-everywhere-src-5.15.2\qtbase\bin\qmake.exe "CONFIG -= qt debug_and_release app_bundle lib_bundle" "CONFIG += static warn_off console single_arch" "QMAKE_LIBDIR += C:\\Qt\\OpenSSL\\OpenSSL-1.1.1\\static\\x64\\Release\\lib" "INCLUDEPATH += C:\\Qt\\OpenSSL\\OpenSSL-1.1.1\\static\\x64\\Release\\include" "QMAKE_USE += openssl" "QMAKE_LIBS_OPENSSL = -llibssl -llibcrypto -lUser32 -lWs2_32 -lAdvapi32 -lCrypt32" C:/qt-everywhere-src-5.15.2/config.tests/ocsp
  736. + cd /d C:\qt-everywhere-src-5.15.2\config.tests\ocsp && set MAKEFLAGS=& nmake clean && set MAKEFLAGS=& nmake
  737. > Microsoft (R) Program Maintenance Utility Version 14.16.27045.0
  738. > Copyright (C) Microsoft Corporation. All rights reserved.
  739. > del main.obj
  740. > Microsoft (R) Program Maintenance Utility Version 14.16.27045.0
  741. > Copyright (C) Microsoft Corporation. All rights reserved.
  742. > cl -c -nologo -Zc:wchar_t -FS -Zc:rvalueCast -Zc:inline -Zc:strictStrings -Zc:throwingNew -Zc:referenceBinding -Zc:__cplusplus -O2 -MT -W0 -EHsc -DUNICODE -D_UNICODE -DWIN32 -D_ENABLE_EXTENDED_ALIGNED_STORAGE -DWIN64 -DNDEBUG -I. -IC:\Qt\OpenSSL\OpenSSL-1.1.1\static\x64\Release\include -IC:\qt-everywhere-src-5.15.2\qtbase\mkspecs\win32-msvc -Fo @C:\Users\MyUser\AppData\Local\Temp\nm8D23.tmp
  743. > main.cpp
  744. > link /NOLOGO /DYNAMICBASE /NXCOMPAT /OPT:REF /INCREMENTAL:NO /SUBSYSTEM:CONSOLE "/MANIFESTDEPENDENCY:type='win32' name='Microsoft.Windows.Common-Controls' version='6.0.0.0' publicKeyToken='6595b64144ccf1df' language='*' processorArchitecture='*'" /MANIFEST:embed /OUT:ocsp.exe @C:\Users\MyUser\AppData\Local\Temp\nm8D92.tmp
  745. test config.qtbase_network.tests.ocsp succeeded
  746. looking for library xcb
  747. Trying source 0 (type pkgConfig) of library xcb ...
  748. pkg-config use disabled globally.
  749. => source produced no result.
  750. Trying source 1 (type inline) of library xcb ...
  751. xcb/xcb.h not found in [] and global paths.
  752. => source produced no result.
  753. test config.qtbase_gui.libraries.xcb FAILED
  754. looking for library dxguid
  755. Trying source 0 (type inline) of library dxguid ...
  756. => source accepted.
  757. test config.qtbase_gui.libraries.dxguid succeeded
  758. executing config test fxc
  759. test config.qtbase_gui.tests.fxc gave result C:/Program Files (x86)/Windows Kits/10/bin/10.0.18362.0/x64/fxc.exe
  760. looking for library d3d9
  761. Trying source 0 (type inline) of library d3d9 ...
  762. => source accepted.
  763. test config.qtbase_gui.libraries.d3d9 succeeded
  764. executing config test angle_d3d11_qdtd
  765. + cd /d C:\qt-everywhere-src-5.15.2\config.tests\angle_d3d11_qdtd && C:\qt-everywhere-src-5.15.2\qtbase\bin\qmake.exe "CONFIG -= qt debug_and_release app_bundle lib_bundle" "CONFIG += static warn_off console single_arch" "QMAKE_LIBDIR += C:\\Qt\\OpenSSL\\OpenSSL-1.1.1\\static\\x64\\Release\\lib" "INCLUDEPATH += C:\\Qt\\OpenSSL\\OpenSSL-1.1.1\\static\\x64\\Release\\include" C:/qt-everywhere-src-5.15.2/config.tests/angle_d3d11_qdtd
  766. + cd /d C:\qt-everywhere-src-5.15.2\config.tests\angle_d3d11_qdtd && set MAKEFLAGS=& nmake clean && set MAKEFLAGS=& nmake
  767. > Microsoft (R) Program Maintenance Utility Version 14.16.27045.0
  768. > Copyright (C) Microsoft Corporation. All rights reserved.
  769. > del main.obj
  770. > Microsoft (R) Program Maintenance Utility Version 14.16.27045.0
  771. > Copyright (C) Microsoft Corporation. All rights reserved.
  772. > cl -c -nologo -Zc:wchar_t -FS -Zc:rvalueCast -Zc:inline -Zc:strictStrings -Zc:throwingNew -Zc:referenceBinding -Zc:__cplusplus -O2 -MT -W0 -EHsc -DUNICODE -D_UNICODE -DWIN32 -D_ENABLE_EXTENDED_ALIGNED_STORAGE -DWIN64 -DNDEBUG -I. -IC:\Qt\OpenSSL\OpenSSL-1.1.1\static\x64\Release\include -IC:\qt-everywhere-src-5.15.2\qtbase\mkspecs\win32-msvc -Fo @C:\Users\MyUser\AppData\Local\Temp\nm8E5C.tmp
  773. > main.cpp
  774. > link /NOLOGO /DYNAMICBASE /NXCOMPAT /OPT:REF /INCREMENTAL:NO /SUBSYSTEM:CONSOLE "/MANIFESTDEPENDENCY:type='win32' name='Microsoft.Windows.Common-Controls' version='6.0.0.0' publicKeyToken='6595b64144ccf1df' language='*' processorArchitecture='*'" /MANIFEST:embed /OUT:angle_d3d11_qdtd.exe @C:\Users\MyUser\AppData\Local\Temp\nm8FA5.tmp
  775. test config.qtbase_gui.tests.angle_d3d11_qdtd succeeded
  776. looking for library dxgi
  777. Trying source 0 (type inline) of library dxgi ...
  778. => source accepted.
  779. test config.qtbase_gui.libraries.dxgi succeeded
  780. looking for library d3d11
  781. Trying source 0 (type inline) of library d3d11 ...
  782. => source accepted.
  783. test config.qtbase_gui.libraries.d3d11 succeeded
  784. looking for library d2d1
  785. Trying source 0 (type inline) of library d2d1 ...
  786. => source accepted.
  787. test config.qtbase_gui.libraries.d2d1 succeeded
  788. looking for library d2d1_1
  789. Trying source 0 (type inline) of library d2d1_1 ...
  790. + cd /d C:\qt-everywhere-src-5.15.2\config.tests\d2d1_1 && C:\qt-everywhere-src-5.15.2\qtbase\bin\qmake.exe "CONFIG -= qt debug_and_release app_bundle lib_bundle" "CONFIG += static warn_off console single_arch" "QMAKE_LIBDIR += C:\\Qt\\OpenSSL\\OpenSSL-1.1.1\\static\\x64\\Release\\lib" "INCLUDEPATH += C:\\Qt\\OpenSSL\\OpenSSL-1.1.1\\static\\x64\\Release\\include" "QMAKE_USE += d2d1_1" "QMAKE_LIBS_D2D1_1 = -ld2d1" C:/qt-everywhere-src-5.15.2/config.tests/d2d1_1
  791. + cd /d C:\qt-everywhere-src-5.15.2\config.tests\d2d1_1 && set MAKEFLAGS=& nmake clean && set MAKEFLAGS=& nmake
  792. > Microsoft (R) Program Maintenance Utility Version 14.16.27045.0
  793. > Copyright (C) Microsoft Corporation. All rights reserved.
  794. > del main.obj
  795. > Microsoft (R) Program Maintenance Utility Version 14.16.27045.0
  796. > Copyright (C) Microsoft Corporation. All rights reserved.
  797. > cl -c -nologo -Zc:wchar_t -FS -Zc:rvalueCast -Zc:inline -Zc:strictStrings -Zc:throwingNew -Zc:referenceBinding -Zc:__cplusplus -O2 -MT -W0 -EHsc -DUNICODE -D_UNICODE -DWIN32 -D_ENABLE_EXTENDED_ALIGNED_STORAGE -DWIN64 -DNDEBUG -I. -IC:\Qt\OpenSSL\OpenSSL-1.1.1\static\x64\Release\include -IC:\qt-everywhere-src-5.15.2\qtbase\mkspecs\win32-msvc -Fo @C:\Users\MyUser\AppData\Local\Temp\nm9050.tmp
  798. > main.cpp
  799. > link /NOLOGO /DYNAMICBASE /NXCOMPAT /OPT:REF /INCREMENTAL:NO /SUBSYSTEM:CONSOLE "/MANIFESTDEPENDENCY:type='win32' name='Microsoft.Windows.Common-Controls' version='6.0.0.0' publicKeyToken='6595b64144ccf1df' language='*' processorArchitecture='*'" /MANIFEST:embed /OUT:d2d1_1.exe @C:\Users\MyUser\AppData\Local\Temp\nm9199.tmp
  800. => source accepted.
  801. test config.qtbase_gui.libraries.d2d1_1 succeeded
  802. looking for library dxgi1_2
  803. Trying source 0 (type inline) of library dxgi1_2 ...
  804. + cd /d C:\qt-everywhere-src-5.15.2\config.tests\dxgi1_2 && C:\qt-everywhere-src-5.15.2\qtbase\bin\qmake.exe "CONFIG -= qt debug_and_release app_bundle lib_bundle" "CONFIG += static warn_off console single_arch" "QMAKE_LIBDIR += C:\\Qt\\OpenSSL\\OpenSSL-1.1.1\\static\\x64\\Release\\lib" "INCLUDEPATH += C:\\Qt\\OpenSSL\\OpenSSL-1.1.1\\static\\x64\\Release\\include" "QMAKE_USE += dxgi1_2" "QMAKE_LIBS_DXGI1_2 = -ldxgi" C:/qt-everywhere-src-5.15.2/config.tests/dxgi1_2
  805. + cd /d C:\qt-everywhere-src-5.15.2\config.tests\dxgi1_2 && set MAKEFLAGS=& nmake clean && set MAKEFLAGS=& nmake
  806. > Microsoft (R) Program Maintenance Utility Version 14.16.27045.0
  807. > Copyright (C) Microsoft Corporation. All rights reserved.
  808. > del main.obj
  809. > Microsoft (R) Program Maintenance Utility Version 14.16.27045.0
  810. > Copyright (C) Microsoft Corporation. All rights reserved.
  811. > cl -c -nologo -Zc:wchar_t -FS -Zc:rvalueCast -Zc:inline -Zc:strictStrings -Zc:throwingNew -Zc:referenceBinding -Zc:__cplusplus -O2 -MT -W0 -EHsc -DUNICODE -D_UNICODE -DWIN32 -D_ENABLE_EXTENDED_ALIGNED_STORAGE -DWIN64 -DNDEBUG -I. -IC:\Qt\OpenSSL\OpenSSL-1.1.1\static\x64\Release\include -IC:\qt-everywhere-src-5.15.2\qtbase\mkspecs\win32-msvc -Fo @C:\Users\MyUser\AppData\Local\Temp\nm9244.tmp
  812. > main.cpp
  813. > link /NOLOGO /DYNAMICBASE /NXCOMPAT /OPT:REF /INCREMENTAL:NO /SUBSYSTEM:CONSOLE "/MANIFESTDEPENDENCY:type='win32' name='Microsoft.Windows.Common-Controls' version='6.0.0.0' publicKeyToken='6595b64144ccf1df' language='*' processorArchitecture='*'" /MANIFEST:embed /OUT:dxgi1_2.exe @C:\Users\MyUser\AppData\Local\Temp\nm936E.tmp
  814. => source accepted.
  815. test config.qtbase_gui.libraries.dxgi1_2 succeeded
  816. looking for library d3d11_1
  817. Trying source 0 (type inline) of library d3d11_1 ...
  818. => source accepted.
  819. test config.qtbase_gui.libraries.d3d11_1 succeeded
  820. looking for library dwrite
  821. Trying source 0 (type inline) of library dwrite ...
  822. + cd /d C:\qt-everywhere-src-5.15.2\config.tests\dwrite && C:\qt-everywhere-src-5.15.2\qtbase\bin\qmake.exe "CONFIG -= qt debug_and_release app_bundle lib_bundle" "CONFIG += static warn_off console single_arch" "QMAKE_LIBDIR += C:\\Qt\\OpenSSL\\OpenSSL-1.1.1\\static\\x64\\Release\\lib" "INCLUDEPATH += C:\\Qt\\OpenSSL\\OpenSSL-1.1.1\\static\\x64\\Release\\include" "QMAKE_USE += dwrite" "QMAKE_LIBS_DWRITE = -ldwrite" C:/qt-everywhere-src-5.15.2/config.tests/dwrite
  823. + cd /d C:\qt-everywhere-src-5.15.2\config.tests\dwrite && set MAKEFLAGS=& nmake clean && set MAKEFLAGS=& nmake
  824. > Microsoft (R) Program Maintenance Utility Version 14.16.27045.0
  825. > Copyright (C) Microsoft Corporation. All rights reserved.
  826. > del main.obj
  827. > Microsoft (R) Program Maintenance Utility Version 14.16.27045.0
  828. > Copyright (C) Microsoft Corporation. All rights reserved.
  829. > cl -c -nologo -Zc:wchar_t -FS -Zc:rvalueCast -Zc:inline -Zc:strictStrings -Zc:throwingNew -Zc:referenceBinding -Zc:__cplusplus -O2 -MT -W0 -EHsc -DUNICODE -D_UNICODE -DWIN32 -D_ENABLE_EXTENDED_ALIGNED_STORAGE -DWIN64 -DNDEBUG -I. -IC:\Qt\OpenSSL\OpenSSL-1.1.1\static\x64\Release\include -IC:\qt-everywhere-src-5.15.2\qtbase\mkspecs\win32-msvc -Fo @C:\Users\MyUser\AppData\Local\Temp\nm9438.tmp
  830. > main.cpp
  831. > link /NOLOGO /DYNAMICBASE /NXCOMPAT /OPT:REF /INCREMENTAL:NO /SUBSYSTEM:CONSOLE "/MANIFESTDEPENDENCY:type='win32' name='Microsoft.Windows.Common-Controls' version='6.0.0.0' publicKeyToken='6595b64144ccf1df' language='*' processorArchitecture='*'" /MANIFEST:embed /OUT:dwrite.exe @C:\Users\MyUser\AppData\Local\Temp\nm9552.tmp
  832. => source accepted.
  833. test config.qtbase_gui.libraries.dwrite succeeded
  834. looking for library dwrite_1
  835. Trying source 0 (type inline) of library dwrite_1 ...
  836. => source accepted.
  837. test config.qtbase_gui.libraries.dwrite_1 succeeded
  838. looking for library dwrite_2
  839. Trying source 0 (type inline) of library dwrite_2 ...
  840. + cd /d C:\qt-everywhere-src-5.15.2\config.tests\dwrite_2 && C:\qt-everywhere-src-5.15.2\qtbase\bin\qmake.exe "CONFIG -= qt debug_and_release app_bundle lib_bundle" "CONFIG += static warn_off console single_arch" "QMAKE_LIBDIR += C:\\Qt\\OpenSSL\\OpenSSL-1.1.1\\static\\x64\\Release\\lib" "INCLUDEPATH += C:\\Qt\\OpenSSL\\OpenSSL-1.1.1\\static\\x64\\Release\\include" "QMAKE_USE += dwrite_2" "QMAKE_LIBS_DWRITE_2 = -ldwrite" C:/qt-everywhere-src-5.15.2/config.tests/dwrite_2
  841. + cd /d C:\qt-everywhere-src-5.15.2\config.tests\dwrite_2 && set MAKEFLAGS=& nmake clean && set MAKEFLAGS=& nmake
  842. > Microsoft (R) Program Maintenance Utility Version 14.16.27045.0
  843. > Copyright (C) Microsoft Corporation. All rights reserved.
  844. > del main.obj
  845. > Microsoft (R) Program Maintenance Utility Version 14.16.27045.0
  846. > Copyright (C) Microsoft Corporation. All rights reserved.
  847. > cl -c -nologo -Zc:wchar_t -FS -Zc:rvalueCast -Zc:inline -Zc:strictStrings -Zc:throwingNew -Zc:referenceBinding -Zc:__cplusplus -O2 -MT -W0 -EHsc -DUNICODE -D_UNICODE -DWIN32 -D_ENABLE_EXTENDED_ALIGNED_STORAGE -DWIN64 -DNDEBUG -I. -IC:\Qt\OpenSSL\OpenSSL-1.1.1\static\x64\Release\include -IC:\qt-everywhere-src-5.15.2\qtbase\mkspecs\win32-msvc -Fo @C:\Users\MyUser\AppData\Local\Temp\nm95FD.tmp
  848. > main.cpp
  849. > link /NOLOGO /DYNAMICBASE /NXCOMPAT /OPT:REF /INCREMENTAL:NO /SUBSYSTEM:CONSOLE "/MANIFESTDEPENDENCY:type='win32' name='Microsoft.Windows.Common-Controls' version='6.0.0.0' publicKeyToken='6595b64144ccf1df' language='*' processorArchitecture='*'" /MANIFEST:embed /OUT:dwrite_2.exe @C:\Users\MyUser\AppData\Local\Temp\nm9727.tmp
  850. => source accepted.
  851. test config.qtbase_gui.libraries.dwrite_2 succeeded
  852. looking for library drm
  853. Trying source 0 (type pkgConfig) of library drm ...
  854. pkg-config use disabled globally.
  855. => source produced no result.
  856. Trying source 1 (type inline) of library drm ...
  857. xf86drmMode.h not found in [] and global paths.
  858. xf86drm.h not found in [] and global paths.
  859. => source produced no result.
  860. Trying source 2 (type inline) of library drm ...
  861. => source failed condition 'config.integrity'.
  862. test config.qtbase_gui.libraries.drm FAILED
  863. looking for library egl
  864. Trying source 0 (type pkgConfig) of library egl ...
  865. pkg-config use disabled globally.
  866. => source produced no result.
  867. Trying source 1 (type makeSpec) of library egl ...
  868. EGL/egl.h not found in [] and global paths.
  869. => source produced no result.
  870. test config.qtbase_gui.libraries.egl FAILED
  871. executing config test evdev
  872. + cd /d C:\qt-everywhere-src-5.15.2\config.tests\evdev && C:\qt-everywhere-src-5.15.2\qtbase\bin\qmake.exe "CONFIG -= qt debug_and_release app_bundle lib_bundle" "CONFIG += static warn_off console single_arch" "QMAKE_LIBDIR += C:\\Qt\\OpenSSL\\OpenSSL-1.1.1\\static\\x64\\Release\\lib" "INCLUDEPATH += C:\\Qt\\OpenSSL\\OpenSSL-1.1.1\\static\\x64\\Release\\include" C:/qt-everywhere-src-5.15.2/config.tests/evdev
  873. + cd /d C:\qt-everywhere-src-5.15.2\config.tests\evdev && set MAKEFLAGS=& nmake clean && set MAKEFLAGS=& nmake
  874. > Microsoft (R) Program Maintenance Utility Version 14.16.27045.0
  875. > Copyright (C) Microsoft Corporation. All rights reserved.
  876. > del main.obj
  877. > Could Not Find C:\qt-everywhere-src-5.15.2\config.tests\evdev\main.obj
  878. > Microsoft (R) Program Maintenance Utility Version 14.16.27045.0
  879. > Copyright (C) Microsoft Corporation. All rights reserved.
  880. > cl -c -nologo -Zc:wchar_t -FS -Zc:rvalueCast -Zc:inline -Zc:strictStrings -Zc:throwingNew -Zc:referenceBinding -Zc:__cplusplus -O2 -MT -W0 -EHsc -DUNICODE -D_UNICODE -DWIN32 -D_ENABLE_EXTENDED_ALIGNED_STORAGE -DWIN64 -DNDEBUG -I. -IC:\Qt\OpenSSL\OpenSSL-1.1.1\static\x64\Release\include -IC:\qt-everywhere-src-5.15.2\qtbase\mkspecs\win32-msvc -Fo @C:\Users\MyUser\AppData\Local\Temp\nm97E1.tmp
  881. > main.cpp
  882. > .\main.cpp(5): fatal error C1083: Cannot open include file: 'linux/input.h': No such file or directory
  883. > NMAKE : fatal error U1077: '"C:\Program Files (x86)\Microsoft Visual Studio\2017\Professional\VC\Tools\MSVC\14.16.27023\bin\HostX64\x64\cl.EXE"' : return code '0x2'
  884. > Stop.
  885. test config.qtbase_gui.tests.evdev FAILED
  886. looking for library gbm
  887. Trying source 0 (type pkgConfig) of library gbm ...
  888. pkg-config use disabled globally.
  889. => source produced no result.
  890. test config.qtbase_gui.libraries.gbm FAILED
  891. executing config test linuxfb
  892. + cd /d C:\qt-everywhere-src-5.15.2\config.tests\linuxfb && C:\qt-everywhere-src-5.15.2\qtbase\bin\qmake.exe "CONFIG -= qt debug_and_release app_bundle lib_bundle" "CONFIG += static warn_off console single_arch" "QMAKE_LIBDIR += C:\\Qt\\OpenSSL\\OpenSSL-1.1.1\\static\\x64\\Release\\lib" "INCLUDEPATH += C:\\Qt\\OpenSSL\\OpenSSL-1.1.1\\static\\x64\\Release\\include" C:/qt-everywhere-src-5.15.2/config.tests/linuxfb
  893. + cd /d C:\qt-everywhere-src-5.15.2\config.tests\linuxfb && set MAKEFLAGS=& nmake clean && set MAKEFLAGS=& nmake
  894. > Microsoft (R) Program Maintenance Utility Version 14.16.27045.0
  895. > Copyright (C) Microsoft Corporation. All rights reserved.
  896. > del main.obj
  897. > Could Not Find C:\qt-everywhere-src-5.15.2\config.tests\linuxfb\main.obj
  898. > Microsoft (R) Program Maintenance Utility Version 14.16.27045.0
  899. > Copyright (C) Microsoft Corporation. All rights reserved.
  900. > cl -c -nologo -Zc:wchar_t -FS -Zc:rvalueCast -Zc:inline -Zc:strictStrings -Zc:throwingNew -Zc:referenceBinding -Zc:__cplusplus -O2 -MT -W0 -EHsc -DUNICODE -D_UNICODE -DWIN32 -D_ENABLE_EXTENDED_ALIGNED_STORAGE -DWIN64 -DNDEBUG -I. -IC:\Qt\OpenSSL\OpenSSL-1.1.1\static\x64\Release\include -IC:\qt-everywhere-src-5.15.2\qtbase\mkspecs\win32-msvc -Fo @C:\Users\MyUser\AppData\Local\Temp\nm986E.tmp
  901. > main.cpp
  902. > .\main.cpp(2): fatal error C1083: Cannot open include file: 'linux/fb.h': No such file or directory
  903. > NMAKE : fatal error U1077: '"C:\Program Files (x86)\Microsoft Visual Studio\2017\Professional\VC\Tools\MSVC\14.16.27023\bin\HostX64\x64\cl.EXE"' : return code '0x2'
  904. > Stop.
  905. test config.qtbase_gui.tests.linuxfb FAILED
  906. looking for library mtdev
  907. Trying source 0 (type pkgConfig) of library mtdev ...
  908. pkg-config use disabled globally.
  909. => source produced no result.
  910. test config.qtbase_gui.libraries.mtdev FAILED
  911. looking for library openvg
  912. Trying source 0 (type pkgConfig) of library openvg ...
  913. pkg-config use disabled globally.
  914. => source produced no result.
  915. Trying source 1 (type makeSpec) of library openvg ...
  916. VG/openvg.h not found in [] and global paths.
  917. => source produced no result.
  918. test config.qtbase_gui.libraries.openvg FAILED
  919. executing config test qpa_default_platform
  920. test config.qtbase_gui.tests.qpa_default_platform gave result windows
  921. looking for library libjpeg
  922. Trying source 0 (type pkgConfig) of library libjpeg ...
  923. pkg-config use disabled globally.
  924. => source produced no result.
  925. Trying source 1 (type inline) of library libjpeg ...
  926. jpeglib.h not found in [] and global paths.
  927. => source produced no result.
  928. Trying source 2 (type inline) of library libjpeg ...
  929. jpeglib.h not found in [] and global paths.
  930. => source produced no result.
  931. test config.qtbase_gui.libraries.libjpeg FAILED
  932. looking for library libmd4c
  933. Trying source 0 (type pkgConfig) of library libmd4c ...
  934. pkg-config use disabled globally.
  935. => source produced no result.
  936. Trying source 1 (type inline) of library libmd4c ...
  937. md4c.h not found in [] and global paths.
  938. => source produced no result.
  939. test config.qtbase_gui.libraries.libmd4c FAILED
  940. looking for library tslib
  941. Trying source 0 (type inline) of library tslib ...
  942. tslib.h not found in [] and global paths.
  943. => source produced no result.
  944. test config.qtbase_gui.libraries.tslib FAILED
  945. looking for library vulkan
  946. Trying source 0 (type pkgConfig) of library vulkan ...
  947. pkg-config use disabled globally.
  948. => source produced no result.
  949. Trying source 1 (type makeSpec) of library vulkan ...
  950. Include path /include is invalid.
  951. vulkan/vulkan.h not found in [/include] and global paths.
  952. => source produced no result.
  953. test config.qtbase_gui.libraries.vulkan FAILED
  954. looking for library xlib
  955. Trying source 0 (type makeSpec) of library xlib ...
  956. X11/Xlib.h not found in [] and global paths.
  957. => source produced no result.
  958. test config.qtbase_gui.libraries.xlib FAILED
  959. looking for library xkbcommon
  960. Trying source 0 (type pkgConfig) of library xkbcommon ...
  961. pkg-config use disabled globally.
  962. => source produced no result.
  963. Trying source 1 (type inline) of library xkbcommon ...
  964. xkbcommon/xkbcommon.h not found in [] and global paths.
  965. => source produced no result.
  966. test config.qtbase_gui.libraries.xkbcommon FAILED
  967. executing config test uxtheme
  968. Searching for file uxtheme.h.
  969. Found at C:\Program Files (x86)\Windows Kits\10\include\10.0.18362.0\um/uxtheme.h.
  970. test config.qtbase_widgets.tests.uxtheme succeeded
  971. looking for library cups
  972. Trying source 0 (type inline) of library cups ...
  973. cups/cups.h not found in [] and global paths.
  974. => source produced no result.
  975. test config.qtbase_printsupport.libraries.cups FAILED
  976. looking for library db2
  977. Trying source 0 (type inline) of library db2 ...
  978. sqlcli.h not found in [] and global paths.
  979. sqlcli1.h not found in [] and global paths.
  980. => source produced no result.
  981. Trying source 1 (type inline) of library db2 ...
  982. => source failed condition '!config.win32'.
  983. test config.qtbase_sqldrivers.libraries.db2 FAILED
  984. looking for library ibase
  985. Trying source 0 (type inline) of library ibase ...
  986. ibase.h not found in [] and global paths.
  987. => source produced no result.
  988. Trying source 1 (type inline) of library ibase ...
  989. => source failed condition '!config.win32'.
  990. test config.qtbase_sqldrivers.libraries.ibase FAILED
  991. looking for library mysql
  992. Trying source 0 (type mysqlConfig) of library mysql ...
  993. mysql_config not found.
  994. => source produced no result.
  995. Trying source 1 (type mysqlConfig) of library mysql ...
  996. mysql_config not found.
  997. => source produced no result.
  998. Trying source 2 (type mysqlConfig) of library mysql ...
  999. mysql_config not found.
  1000. => source produced no result.
  1001. Trying source 3 (type mysqlConfig) of library mysql ...
  1002. mysql_config not found.
  1003. => source produced no result.
  1004. Trying source 4 (type inline) of library mysql ...
  1005. => source failed condition '!config.win32'.
  1006. Trying source 5 (type inline) of library mysql ...
  1007. mysql.h not found in [] and global paths.
  1008. => source produced no result.
  1009. Trying source 6 (type inline) of library mysql ...
  1010. mysql.h not found in [] and global paths.
  1011. => source produced no result.
  1012. Trying source 7 (type inline) of library mysql ...
  1013. => source failed condition '!config.win32'.
  1014. Trying source 8 (type inline) of library mysql ...
  1015. => source failed condition '!config.win32'.
  1016. test config.qtbase_sqldrivers.libraries.mysql FAILED
  1017. looking for library oci
  1018. Trying source 0 (type inline) of library oci ...
  1019. oci.h not found in [] and global paths.
  1020. => source produced no result.
  1021. Trying source 1 (type inline) of library oci ...
  1022. => source failed condition '!config.win32'.
  1023. test config.qtbase_sqldrivers.libraries.oci FAILED
  1024. looking for library odbc
  1025. Trying source 0 (type inline) of library odbc ...
  1026. + cd /d C:\qt-everywhere-src-5.15.2\config.tests\odbc && C:\qt-everywhere-src-5.15.2\qtbase\bin\qmake.exe "CONFIG -= qt debug_and_release app_bundle lib_bundle" "CONFIG += static warn_off console single_arch" "QMAKE_LIBDIR += C:\\Qt\\OpenSSL\\OpenSSL-1.1.1\\static\\x64\\Release\\lib" "INCLUDEPATH += C:\\Qt\\OpenSSL\\OpenSSL-1.1.1\\static\\x64\\Release\\include" "QMAKE_USE += odbc" "QMAKE_LIBS_ODBC = -lodbc32" C:/qt-everywhere-src-5.15.2/config.tests/odbc
  1027. + cd /d C:\qt-everywhere-src-5.15.2\config.tests\odbc && set MAKEFLAGS=& nmake clean && set MAKEFLAGS=& nmake
  1028. > Microsoft (R) Program Maintenance Utility Version 14.16.27045.0
  1029. > Copyright (C) Microsoft Corporation. All rights reserved.
  1030. > del main.obj
  1031. > Microsoft (R) Program Maintenance Utility Version 14.16.27045.0
  1032. > Copyright (C) Microsoft Corporation. All rights reserved.
  1033. > cl -c -nologo -Zc:wchar_t -FS -Zc:rvalueCast -Zc:inline -Zc:strictStrings -Zc:throwingNew -Zc:referenceBinding -Zc:__cplusplus -O2 -MT -W0 -EHsc -DUNICODE -D_UNICODE -DWIN32 -D_ENABLE_EXTENDED_ALIGNED_STORAGE -DWIN64 -DNDEBUG -I. -IC:\Qt\OpenSSL\OpenSSL-1.1.1\static\x64\Release\include -IC:\qt-everywhere-src-5.15.2\qtbase\mkspecs\win32-msvc -Fo @C:\Users\MyUser\AppData\Local\Temp\nm9949.tmp
  1034. > main.cpp
  1035. > link /NOLOGO /DYNAMICBASE /NXCOMPAT /OPT:REF /INCREMENTAL:NO /SUBSYSTEM:CONSOLE "/MANIFESTDEPENDENCY:type='win32' name='Microsoft.Windows.Common-Controls' version='6.0.0.0' publicKeyToken='6595b64144ccf1df' language='*' processorArchitecture='*'" /MANIFEST:embed /OUT:odbc.exe @C:\Users\MyUser\AppData\Local\Temp\nm9A63.tmp
  1036. => source accepted.
  1037. test config.qtbase_sqldrivers.libraries.odbc succeeded
  1038. looking for library psql
  1039. Trying source 0 (type pkgConfig) of library psql ...
  1040. pkg-config use disabled globally.
  1041. => source produced no result.
  1042. Trying source 1 (type psqlConfig) of library psql ...
  1043. pg_config not found.
  1044. => source produced no result.
  1045. Trying source 2 (type psqlEnv) of library psql ...
  1046. libpq-fe.h not found in [] and global paths.
  1047. => source produced no result.
  1048. Trying source 3 (type psqlEnv) of library psql ...
  1049. => source failed condition '!config.win32'.
  1050. test config.qtbase_sqldrivers.libraries.psql FAILED
  1051. looking for library sqlite2
  1052. Trying source 0 (type inline) of library sqlite2 ...
  1053. sqlite.h not found in [] and global paths.
  1054. => source produced no result.
  1055. test config.qtbase_sqldrivers.libraries.sqlite2 FAILED
  1056. looking for library tds
  1057. Trying source 0 (type sybaseEnv) of library tds ...
  1058. + cd /d C:\qt-everywhere-src-5.15.2\config.tests\tds && C:\qt-everywhere-src-5.15.2\qtbase\bin\qmake.exe "CONFIG -= qt debug_and_release app_bundle lib_bundle" "CONFIG += static warn_off console single_arch" "QMAKE_LIBDIR += C:\\Qt\\OpenSSL\\OpenSSL-1.1.1\\static\\x64\\Release\\lib" "INCLUDEPATH += C:\\Qt\\OpenSSL\\OpenSSL-1.1.1\\static\\x64\\Release\\include" "QMAKE_USE += tds" "QMAKE_LIBS_TDS = -lNTWDBLIB" C:/qt-everywhere-src-5.15.2/config.tests/tds
  1059. + cd /d C:\qt-everywhere-src-5.15.2\config.tests\tds && set MAKEFLAGS=& nmake clean && set MAKEFLAGS=& nmake
  1060. > Microsoft (R) Program Maintenance Utility Version 14.16.27045.0
  1061. > Copyright (C) Microsoft Corporation. All rights reserved.
  1062. > del main.obj
  1063. > Could Not Find C:\qt-everywhere-src-5.15.2\config.tests\tds\main.obj
  1064. > Microsoft (R) Program Maintenance Utility Version 14.16.27045.0
  1065. > Copyright (C) Microsoft Corporation. All rights reserved.
  1066. > cl -c -nologo -Zc:wchar_t -FS -Zc:rvalueCast -Zc:inline -Zc:strictStrings -Zc:throwingNew -Zc:referenceBinding -Zc:__cplusplus -O2 -MT -W0 -EHsc -DUNICODE -D_UNICODE -DWIN32 -D_ENABLE_EXTENDED_ALIGNED_STORAGE -DWIN64 -DNDEBUG -I. -IC:\Qt\OpenSSL\OpenSSL-1.1.1\static\x64\Release\include -IC:\qt-everywhere-src-5.15.2\qtbase\mkspecs\win32-msvc -Fo @C:\Users\MyUser\AppData\Local\Temp\nm9B2D.tmp
  1067. > main.cpp
  1068. > .\main.cpp(2): fatal error C1083: Cannot open include file: 'sybfront.h': No such file or directory
  1069. > NMAKE : fatal error U1077: '"C:\Program Files (x86)\Microsoft Visual Studio\2017\Professional\VC\Tools\MSVC\14.16.27023\bin\HostX64\x64\cl.EXE"' : return code '0x2'
  1070. > Stop.
  1071. => source failed verification.
  1072. Trying source 1 (type sybaseEnv) of library tds ...
  1073. => source failed condition '!config.win32'.
  1074. test config.qtbase_sqldrivers.libraries.tds FAILED
  1075. executing config test ntddmodm
  1076. + cd /d C:\qt-everywhere-src-5.15.2\config.tests\ntddmodm && C:\qt-everywhere-src-5.15.2\qtbase\bin\qmake.exe "CONFIG -= qt debug_and_release app_bundle lib_bundle" "CONFIG += static warn_off console single_arch" "QMAKE_LIBDIR += C:\\Qt\\OpenSSL\\OpenSSL-1.1.1\\static\\x64\\Release\\lib" "INCLUDEPATH += C:\\Qt\\OpenSSL\\OpenSSL-1.1.1\\static\\x64\\Release\\include" C:/qt-everywhere-src-5.15.2/config.tests/ntddmodm
  1077. + cd /d C:\qt-everywhere-src-5.15.2\config.tests\ntddmodm && set MAKEFLAGS=& nmake clean && set MAKEFLAGS=& nmake
  1078. > Microsoft (R) Program Maintenance Utility Version 14.16.27045.0
  1079. > Copyright (C) Microsoft Corporation. All rights reserved.
  1080. > del main.obj
  1081. > Microsoft (R) Program Maintenance Utility Version 14.16.27045.0
  1082. > Copyright (C) Microsoft Corporation. All rights reserved.
  1083. > cl -c -nologo -Zc:wchar_t -FS -Zc:rvalueCast -Zc:inline -Zc:strictStrings -Zc:throwingNew -Zc:referenceBinding -Zc:__cplusplus -O2 -MT -W0 -EHsc -DUNICODE -D_UNICODE -DWIN32 -D_ENABLE_EXTENDED_ALIGNED_STORAGE -DWIN64 -DNDEBUG -I. -IC:\Qt\OpenSSL\OpenSSL-1.1.1\static\x64\Release\include -IC:\qt-everywhere-src-5.15.2\qtbase\mkspecs\win32-msvc -Fo @C:\Users\MyUser\AppData\Local\Temp\nm9BC9.tmp
  1084. > main.cpp
  1085. > link /NOLOGO /DYNAMICBASE /NXCOMPAT /OPT:REF /INCREMENTAL:NO /SUBSYSTEM:CONSOLE "/MANIFESTDEPENDENCY:type='win32' name='Microsoft.Windows.Common-Controls' version='6.0.0.0' publicKeyToken='6595b64144ccf1df' language='*' processorArchitecture='*'" /MANIFEST:embed /OUT:ntddmodm.exe @C:\Users\MyUser\AppData\Local\Temp\nm9CD4.tmp
  1086. test config.qtserialport_serialport.tests.ntddmodm succeeded
  1087. Trying source 0 (type pkgConfig) of library jasper ...
  1088. pkg-config use disabled globally.
  1089. => source produced no result.
  1090. Trying source 1 (type inline) of library jasper ...
  1091. jasper/jasper.h not found in [] and global paths.
  1092. => source produced no result.
  1093. Trying source 0 (type pkgConfig) of library mng ...
  1094. pkg-config use disabled globally.
  1095. => source produced no result.
  1096. Trying source 1 (type inline) of library mng ...
  1097. libmng.h not found in [] and global paths.
  1098. => source produced no result.
  1099. Trying source 0 (type pkgConfig) of library tiff ...
  1100. pkg-config use disabled globally.
  1101. => source produced no result.
  1102. Trying source 1 (type inline) of library tiff ...
  1103. tiffio.h not found in [] and global paths.
  1104. => source produced no result.
  1105. Trying source 0 (type pkgConfig) of library webp ...
  1106. pkg-config use disabled globally.
  1107. => source produced no result.
  1108. Trying source 1 (type inline) of library webp ...
  1109. webp/decode.h not found in [] and global paths.
  1110. webp/encode.h not found in [] and global paths.
  1111. webp/demux.h not found in [] and global paths.
  1112. webp/mux.h not found in [] and global paths.
  1113. => source produced no result.
  1114. executing config test pointer_64bit
  1115. + cd /d C:\qt-everywhere-src-5.15.2\config.tests\pointer_64bit && C:\qt-everywhere-src-5.15.2\qtbase\bin\qmake.exe "CONFIG -= qt debug_and_release app_bundle lib_bundle" "CONFIG += static warn_off console single_arch" "QMAKE_LIBDIR += C:\\Qt\\OpenSSL\\OpenSSL-1.1.1\\static\\x64\\Release\\lib" "INCLUDEPATH += C:\\Qt\\OpenSSL\\OpenSSL-1.1.1\\static\\x64\\Release\\include" C:/qt-everywhere-src-5.15.2/config.tests/pointer_64bit
  1116. + cd /d C:\qt-everywhere-src-5.15.2\config.tests\pointer_64bit && set MAKEFLAGS=& nmake clean && set MAKEFLAGS=& nmake
  1117. > Microsoft (R) Program Maintenance Utility Version 14.16.27045.0
  1118. > Copyright (C) Microsoft Corporation. All rights reserved.
  1119. > del main.obj
  1120. > Microsoft (R) Program Maintenance Utility Version 14.16.27045.0
  1121. > Copyright (C) Microsoft Corporation. All rights reserved.
  1122. > cl -c -nologo -Zc:wchar_t -FS -Zc:rvalueCast -Zc:inline -Zc:strictStrings -Zc:throwingNew -Zc:referenceBinding -Zc:__cplusplus -O2 -MT -W0 -EHsc -DUNICODE -D_UNICODE -DWIN32 -D_ENABLE_EXTENDED_ALIGNED_STORAGE -DWIN64 -DNDEBUG -I. -IC:\Qt\OpenSSL\OpenSSL-1.1.1\static\x64\Release\include -IC:\qt-everywhere-src-5.15.2\qtbase\mkspecs\win32-msvc -Fo @C:\Users\MyUser\AppData\Local\Temp\nm9D9E.tmp
  1123. > main.cpp
  1124. > link /NOLOGO /DYNAMICBASE /NXCOMPAT /OPT:REF /INCREMENTAL:NO /SUBSYSTEM:CONSOLE "/MANIFESTDEPENDENCY:type='win32' name='Microsoft.Windows.Common-Controls' version='6.0.0.0' publicKeyToken='6595b64144ccf1df' language='*' processorArchitecture='*'" /MANIFEST:embed /OUT:pointer_64bit.exe @C:\Users\MyUser\AppData\Local\Temp\nm9DBE.tmp
  1125. test config.qtdeclarative_qml.tests.pointer_64bit succeeded
  1126. executing config test qml-python
  1127. test config.qtdeclarative_qml.tests.qml-python gave result C:\Users\MyUser\AppData\Local\Programs\Python\Python38\\python.exe
  1128. looking for library quick3d-assimp
  1129. Trying source 0 (type pkgConfig) of library quick3d-assimp ...
  1130. pkg-config use disabled globally.
  1131. => source produced no result.
  1132. Trying source 1 (type inline) of library quick3d-assimp ...
  1133. + cd /d C:\qt-everywhere-src-5.15.2\config.tests\assimp && C:\qt-everywhere-src-5.15.2\qtbase\bin\qmake.exe "CONFIG -= qt debug_and_release app_bundle lib_bundle" "CONFIG += static warn_off console single_arch" "QMAKE_LIBDIR += C:\\Qt\\OpenSSL\\OpenSSL-1.1.1\\static\\x64\\Release\\lib" "INCLUDEPATH += C:\\Qt\\OpenSSL\\OpenSSL-1.1.1\\static\\x64\\Release\\include" "QMAKE_USE += quick3d-assimp" "QMAKE_LIBS_QUICK3D_ASSIMP = -lassimp" C:/qt-everywhere-src-5.15.2/qtquick3d/config.tests/assimp
  1134. + cd /d C:\qt-everywhere-src-5.15.2\config.tests\assimp && set MAKEFLAGS=& nmake clean && set MAKEFLAGS=& nmake
  1135. > Microsoft (R) Program Maintenance Utility Version 14.16.27045.0
  1136. > Copyright (C) Microsoft Corporation. All rights reserved.
  1137. > del main.obj
  1138. > Could Not Find C:\qt-everywhere-src-5.15.2\config.tests\assimp\main.obj
  1139. > Microsoft (R) Program Maintenance Utility Version 14.16.27045.0
  1140. > Copyright (C) Microsoft Corporation. All rights reserved.
  1141. > cl -c -nologo -Zc:wchar_t -FS -Zc:rvalueCast -Zc:inline -Zc:strictStrings -Zc:throwingNew -Zc:referenceBinding -Zc:__cplusplus -O2 -MT -W0 -EHsc -DUNICODE -D_UNICODE -DWIN32 -D_ENABLE_EXTENDED_ALIGNED_STORAGE -DWIN64 -DNDEBUG -IC:\qt-everywhere-src-5.15.2\qtquick3d\config.tests\assimp -I. -IC:\Qt\OpenSSL\OpenSSL-1.1.1\static\x64\Release\include -IC:\qt-everywhere-src-5.15.2\qtbase\mkspecs\win32-msvc -Fo @C:\Users\MyUser\AppData\Local\Temp\nm9E89.tmp
  1142. > main.cpp
  1143. > C:\qt-everywhere-src-5.15.2\qtquick3d\config.tests\assimp\main.cpp(29): fatal error C1083: Cannot open include file: 'assimp/cimport.h': No such file or directory
  1144. > NMAKE : fatal error U1077: '"C:\Program Files (x86)\Microsoft Visual Studio\2017\Professional\VC\Tools\MSVC\14.16.27023\bin\HostX64\x64\cl.EXE"' : return code '0x2'
  1145. > Stop.
  1146. => source failed verification.
  1147. test config.qtquick3d_assetimporters.libraries.quick3d-assimp FAILED
  1148. looking for library sdl2
  1149. Trying source 0 (type pkgConfig) of library sdl2 ...
  1150. pkg-config use disabled globally.
  1151. => source produced no result.
  1152. Trying source 1 (type inline) of library sdl2 ...
  1153. => source failed condition 'config.darwin'.
  1154. Trying source 2 (type inline) of library sdl2 ...
  1155. + cd /d C:\qt-everywhere-src-5.15.2\config.tests\sdl && C:\qt-everywhere-src-5.15.2\qtbase\bin\qmake.exe "CONFIG -= qt debug_and_release app_bundle lib_bundle" "CONFIG += static warn_off console single_arch" "QMAKE_LIBDIR += C:\\Qt\\OpenSSL\\OpenSSL-1.1.1\\static\\x64\\Release\\lib" "INCLUDEPATH += C:\\Qt\\OpenSSL\\OpenSSL-1.1.1\\static\\x64\\Release\\include" "QMAKE_USE += sdl2" "QMAKE_LIBS_SDL2 = -lSDL2 -lSDL2main" C:/qt-everywhere-src-5.15.2/qtgamepad/config.tests/sdl
  1156. + cd /d C:\qt-everywhere-src-5.15.2\config.tests\sdl && set MAKEFLAGS=& nmake clean && set MAKEFLAGS=& nmake
  1157. > Microsoft (R) Program Maintenance Utility Version 14.16.27045.0
  1158. > Copyright (C) Microsoft Corporation. All rights reserved.
  1159. > del main.obj
  1160. > Could Not Find C:\qt-everywhere-src-5.15.2\config.tests\sdl\main.obj
  1161. > Microsoft (R) Program Maintenance Utility Version 14.16.27045.0
  1162. > Copyright (C) Microsoft Corporation. All rights reserved.
  1163. > cl -c -nologo -Zc:wchar_t -FS -Zc:rvalueCast -Zc:inline -Zc:strictStrings -Zc:throwingNew -Zc:referenceBinding -Zc:__cplusplus -O2 -MT -W0 -EHsc -DUNICODE -D_UNICODE -DWIN32 -D_ENABLE_EXTENDED_ALIGNED_STORAGE -DWIN64 -DNDEBUG -IC:\qt-everywhere-src-5.15.2\qtgamepad\config.tests\sdl -I. -IC:\Qt\OpenSSL\OpenSSL-1.1.1\static\x64\Release\include -IC:\qt-everywhere-src-5.15.2\qtbase\mkspecs\win32-msvc -Fo @C:\Users\MyUser\AppData\Local\Temp\nm9F06.tmp
  1164. > main.cpp
  1165. > C:\qt-everywhere-src-5.15.2\qtgamepad\config.tests\sdl\main.cpp(37): fatal error C1083: Cannot open include file: 'SDL.h': No such file or directory
  1166. > NMAKE : fatal error U1077: '"C:\Program Files (x86)\Microsoft Visual Studio\2017\Professional\VC\Tools\MSVC\14.16.27023\bin\HostX64\x64\cl.EXE"' : return code '0x2'
  1167. > Stop.
  1168. => source failed verification.
  1169. Trying source 3 (type inline) of library sdl2 ...
  1170. => source failed condition 'config.unix && !config.darwin'.
  1171. test config.qtgamepad_gamepad.libraries.sdl2 FAILED
  1172. looking for library assimp
  1173. Trying source 0 (type pkgConfig) of library assimp ...
  1174. pkg-config use disabled globally.
  1175. => source produced no result.
  1176. Trying source 1 (type inline) of library assimp ...
  1177. + cd /d C:\qt-everywhere-src-5.15.2\config.tests\assimp && C:\qt-everywhere-src-5.15.2\qtbase\bin\qmake.exe "CONFIG -= qt debug_and_release app_bundle lib_bundle" "CONFIG += static warn_off console single_arch" "QMAKE_LIBDIR += C:\\Qt\\OpenSSL\\OpenSSL-1.1.1\\static\\x64\\Release\\lib" "INCLUDEPATH += C:\\Qt\\OpenSSL\\OpenSSL-1.1.1\\static\\x64\\Release\\include" "QMAKE_USE += assimp" "QMAKE_LIBS_ASSIMP = -lassimp" C:/qt-everywhere-src-5.15.2/qt3d/config.tests/assimp
  1178. + cd /d C:\qt-everywhere-src-5.15.2\config.tests\assimp && set MAKEFLAGS=& nmake clean && set MAKEFLAGS=& nmake
  1179. > Microsoft (R) Program Maintenance Utility Version 14.16.27045.0
  1180. > Copyright (C) Microsoft Corporation. All rights reserved.
  1181. > del main.obj
  1182. > Could Not Find C:\qt-everywhere-src-5.15.2\config.tests\assimp\main.obj
  1183. > Microsoft (R) Program Maintenance Utility Version 14.16.27045.0
  1184. > Copyright (C) Microsoft Corporation. All rights reserved.
  1185. > cl -c -nologo -Zc:wchar_t -FS -Zc:rvalueCast -Zc:inline -Zc:strictStrings -Zc:throwingNew -Zc:referenceBinding -Zc:__cplusplus -O2 -MT -W0 -EHsc -DUNICODE -D_UNICODE -DWIN32 -D_ENABLE_EXTENDED_ALIGNED_STORAGE -DWIN64 -DNDEBUG -IC:\qt-everywhere-src-5.15.2\qt3d\config.tests\assimp -I. -IC:\Qt\OpenSSL\OpenSSL-1.1.1\static\x64\Release\include -IC:\qt-everywhere-src-5.15.2\qtbase\mkspecs\win32-msvc -Fo @C:\Users\MyUser\AppData\Local\Temp\nm9FA2.tmp
  1186. > main.cpp
  1187. > C:\qt-everywhere-src-5.15.2\qt3d\config.tests\assimp\main.cpp(29): fatal error C1083: Cannot open include file: 'assimp/cimport.h': No such file or directory
  1188. > NMAKE : fatal error U1077: '"C:\Program Files (x86)\Microsoft Visual Studio\2017\Professional\VC\Tools\MSVC\14.16.27023\bin\HostX64\x64\cl.EXE"' : return code '0x2'
  1189. > Stop.
  1190. => source failed verification.
  1191. test config.qt3d_core.libraries.assimp FAILED
  1192. looking for library fbx
  1193. Trying source 0 (type fbx) of library fbx ...
  1194. + cd /d C:\qt-everywhere-src-5.15.2\config.tests\fbx && C:\qt-everywhere-src-5.15.2\qtbase\bin\qmake.exe "CONFIG -= qt debug_and_release app_bundle lib_bundle" "CONFIG += static warn_off console single_arch" "QMAKE_LIBDIR += C:\\Qt\\OpenSSL\\OpenSSL-1.1.1\\static\\x64\\Release\\lib" "INCLUDEPATH += C:\\Qt\\OpenSSL\\OpenSSL-1.1.1\\static\\x64\\Release\\include" "QMAKE_USE += fbx" "QMAKE_LIBS_FBX = -lfbxsdk" C:/qt-everywhere-src-5.15.2/qt3d/config.tests/fbx
  1195. + cd /d C:\qt-everywhere-src-5.15.2\config.tests\fbx && set MAKEFLAGS=& nmake clean && set MAKEFLAGS=& nmake
  1196. > Microsoft (R) Program Maintenance Utility Version 14.16.27045.0
  1197. > Copyright (C) Microsoft Corporation. All rights reserved.
  1198. > del main.obj
  1199. > Could Not Find C:\qt-everywhere-src-5.15.2\config.tests\fbx\main.obj
  1200. > Microsoft (R) Program Maintenance Utility Version 14.16.27045.0
  1201. > Copyright (C) Microsoft Corporation. All rights reserved.
  1202. > cl -c -nologo -Zc:wchar_t -FS -Zc:rvalueCast -Zc:inline -Zc:strictStrings -Zc:throwingNew -Zc:referenceBinding -Zc:__cplusplus -O2 -MT -W0 -EHsc -DUNICODE -D_UNICODE -DWIN32 -D_ENABLE_EXTENDED_ALIGNED_STORAGE -DWIN64 -DNDEBUG -IC:\qt-everywhere-src-5.15.2\qt3d\config.tests\fbx -I. -IC:\Qt\OpenSSL\OpenSSL-1.1.1\static\x64\Release\include -IC:\qt-everywhere-src-5.15.2\qtbase\mkspecs\win32-msvc -Fo @C:\Users\MyUser\AppData\Local\Temp\nmA02E.tmp
  1203. > main.cpp
  1204. > C:\qt-everywhere-src-5.15.2\qt3d\config.tests\fbx\main.cpp(29): fatal error C1083: Cannot open include file: 'fbxsdk.h': No such file or directory
  1205. > NMAKE : fatal error U1077: '"C:\Program Files (x86)\Microsoft Visual Studio\2017\Professional\VC\Tools\MSVC\14.16.27023\bin\HostX64\x64\cl.EXE"' : return code '0x2'
  1206. > Stop.
  1207. => source failed verification.
  1208. test config.qt3d_geometryloaders.libraries.fbx FAILED
  1209. looking for library wayland-egl
  1210. Trying source 0 (type pkgConfig) of library wayland-egl ...
  1211. pkg-config use disabled globally.
  1212. => source produced no result.
  1213. Trying source 1 (type inline) of library wayland-egl ...
  1214. wayland-egl.h not found in [] and global paths.
  1215. => source produced no result.
  1216. Trying source 2 (type inline) of library wayland-egl ...
  1217. wayland-egl.h not found in [] and global paths.
  1218. => source produced no result.
  1219. test config.qtwayland_client.libraries.wayland-egl FAILED
  1220. looking for library bluez
  1221. Trying source 0 (type pkgConfig) of library bluez ...
  1222. pkg-config use disabled globally.
  1223. => source produced no result.
  1224. Trying source 1 (type inline) of library bluez ...
  1225. + cd /d C:\qt-everywhere-src-5.15.2\config.tests\bluez && C:\qt-everywhere-src-5.15.2\qtbase\bin\qmake.exe "CONFIG -= qt debug_and_release app_bundle lib_bundle" "CONFIG += static warn_off console single_arch" "QMAKE_LIBDIR += C:\\Qt\\OpenSSL\\OpenSSL-1.1.1\\static\\x64\\Release\\lib" "INCLUDEPATH += C:\\Qt\\OpenSSL\\OpenSSL-1.1.1\\static\\x64\\Release\\include" "QMAKE_USE += bluez" "QMAKE_LIBS_BLUEZ = -lbluetooth" C:/qt-everywhere-src-5.15.2/qtconnectivity/config.tests/bluez
  1226. + cd /d C:\qt-everywhere-src-5.15.2\config.tests\bluez && set MAKEFLAGS=& nmake clean && set MAKEFLAGS=& nmake
  1227. > Microsoft (R) Program Maintenance Utility Version 14.16.27045.0
  1228. > Copyright (C) Microsoft Corporation. All rights reserved.
  1229. > del main.obj
  1230. > Could Not Find C:\qt-everywhere-src-5.15.2\config.tests\bluez\main.obj
  1231. > Microsoft (R) Program Maintenance Utility Version 14.16.27045.0
  1232. > Copyright (C) Microsoft Corporation. All rights reserved.
  1233. > cl -c -nologo -Zc:wchar_t -FS -Zc:rvalueCast -Zc:inline -Zc:strictStrings -Zc:throwingNew -Zc:referenceBinding -Zc:__cplusplus -fpermissive -O2 -MT -W0 -EHsc -DUNICODE -D_UNICODE -DWIN32 -D_ENABLE_EXTENDED_ALIGNED_STORAGE -DWIN64 -DNDEBUG -IC:\qt-everywhere-src-5.15.2\qtconnectivity\config.tests\bluez -I. -IC:\Qt\OpenSSL\OpenSSL-1.1.1\static\x64\Release\include -IC:\qt-everywhere-src-5.15.2\qtbase\mkspecs\win32-msvc -Fo @C:\Users\MyUser\AppData\Local\Temp\nmA0CB.tmp
  1234. > cl : Command line warning D9002 : ignoring unknown option '-fpermissive'
  1235. > main.cpp
  1236. > C:\qt-everywhere-src-5.15.2\qtconnectivity\config.tests\bluez\main.cpp(29): fatal error C1083: Cannot open include file: 'bluetooth/bluetooth.h': No such file or directory
  1237. > NMAKE : fatal error U1077: '"C:\Program Files (x86)\Microsoft Visual Studio\2017\Professional\VC\Tools\MSVC\14.16.27023\bin\HostX64\x64\cl.EXE"' : return code '0x2'
  1238. > Stop.
  1239. => source failed verification.
  1240. test config.qtconnectivity_bluetooth.libraries.bluez FAILED
  1241. executing config test winrt_bt
  1242. + cd /d C:\qt-everywhere-src-5.15.2\config.tests\winrt_bt && C:\qt-everywhere-src-5.15.2\qtbase\bin\qmake.exe "CONFIG -= qt debug_and_release app_bundle lib_bundle" "CONFIG += static warn_off console single_arch" "QMAKE_LIBDIR += C:\\Qt\\OpenSSL\\OpenSSL-1.1.1\\static\\x64\\Release\\lib" "INCLUDEPATH += C:\\Qt\\OpenSSL\\OpenSSL-1.1.1\\static\\x64\\Release\\include" C:/qt-everywhere-src-5.15.2/qtconnectivity/config.tests/winrt_bt
  1243. + cd /d C:\qt-everywhere-src-5.15.2\config.tests\winrt_bt && set MAKEFLAGS=& nmake clean && set MAKEFLAGS=& nmake
  1244. > Microsoft (R) Program Maintenance Utility Version 14.16.27045.0
  1245. > Copyright (C) Microsoft Corporation. All rights reserved.
  1246. > del main.obj
  1247. > Microsoft (R) Program Maintenance Utility Version 14.16.27045.0
  1248. > Copyright (C) Microsoft Corporation. All rights reserved.
  1249. > cl -c -nologo -Zc:wchar_t -FS -Zc:rvalueCast -Zc:inline -Zc:strictStrings -Zc:throwingNew -Zc:referenceBinding -Zc:__cplusplus -O2 -MT -W0 -EHsc -DUNICODE -D_UNICODE -DWIN32 -D_ENABLE_EXTENDED_ALIGNED_STORAGE -DWIN64 -DNDEBUG -IC:\qt-everywhere-src-5.15.2\qtconnectivity\config.tests\winrt_bt -I. -IC:\Qt\OpenSSL\OpenSSL-1.1.1\static\x64\Release\include -IC:\qt-everywhere-src-5.15.2\qtbase\mkspecs\win32-msvc -Fo @C:\Users\MyUser\AppData\Local\Temp\nmA157.tmp
  1250. > main.cpp
  1251. > link /NOLOGO /DYNAMICBASE /NXCOMPAT /OPT:REF /INCREMENTAL:NO /SUBSYSTEM:CONSOLE "/MANIFESTDEPENDENCY:type='win32' name='Microsoft.Windows.Common-Controls' version='6.0.0.0' publicKeyToken='6595b64144ccf1df' language='*' processorArchitecture='*'" /MANIFEST:embed /OUT:winrt.exe @C:\Users\MyUser\AppData\Local\Temp\nmA85D.tmp
  1252. test config.qtconnectivity_bluetooth.tests.winrt_bt succeeded
  1253. executing config test winrt_btle_no_pairing
  1254. + cd /d C:\qt-everywhere-src-5.15.2\config.tests\winrt_btle_no_pairing && C:\qt-everywhere-src-5.15.2\qtbase\bin\qmake.exe "CONFIG -= qt debug_and_release app_bundle lib_bundle" "CONFIG += static warn_off console single_arch" "QMAKE_LIBDIR += C:\\Qt\\OpenSSL\\OpenSSL-1.1.1\\static\\x64\\Release\\lib" "INCLUDEPATH += C:\\Qt\\OpenSSL\\OpenSSL-1.1.1\\static\\x64\\Release\\include" C:/qt-everywhere-src-5.15.2/qtconnectivity/config.tests/winrt_btle_no_pairing
  1255. + cd /d C:\qt-everywhere-src-5.15.2\config.tests\winrt_btle_no_pairing && set MAKEFLAGS=& nmake clean && set MAKEFLAGS=& nmake
  1256. > Microsoft (R) Program Maintenance Utility Version 14.16.27045.0
  1257. > Copyright (C) Microsoft Corporation. All rights reserved.
  1258. > del main.obj
  1259. > Microsoft (R) Program Maintenance Utility Version 14.16.27045.0
  1260. > Copyright (C) Microsoft Corporation. All rights reserved.
  1261. > cl -c -nologo -Zc:wchar_t -FS -Zc:rvalueCast -Zc:inline -Zc:strictStrings -Zc:throwingNew -Zc:referenceBinding -Zc:__cplusplus -O2 -MT -W0 -EHsc -DUNICODE -D_UNICODE -DWIN32 -D_ENABLE_EXTENDED_ALIGNED_STORAGE -DWIN64 -DNDEBUG -IC:\qt-everywhere-src-5.15.2\qtconnectivity\config.tests\winrt_btle_no_pairing -I. -IC:\Qt\OpenSSL\OpenSSL-1.1.1\static\x64\Release\include -IC:\qt-everywhere-src-5.15.2\qtbase\mkspecs\win32-msvc -Fo @C:\Users\MyUser\AppData\Local\Temp\nmA918.tmp
  1262. > main.cpp
  1263. > link /NOLOGO /DYNAMICBASE /NXCOMPAT /OPT:REF /INCREMENTAL:NO /SUBSYSTEM:CONSOLE "/MANIFESTDEPENDENCY:type='win32' name='Microsoft.Windows.Common-Controls' version='6.0.0.0' publicKeyToken='6595b64144ccf1df' language='*' processorArchitecture='*'" /MANIFEST:embed /OUT:winrt.exe @C:\Users\MyUser\AppData\Local\Temp\nmB00E.tmp
  1264. test config.qtconnectivity_bluetooth.tests.winrt_btle_no_pairing succeeded
  1265. looking for library sensorfw
  1266. Trying source 0 (type pkgConfig) of library sensorfw ...
  1267. pkg-config use disabled globally.
  1268. => source produced no result.
  1269. test config.qtsensors_sensors.libraries.sensorfw FAILED
  1270. looking for library gypsy
  1271. Trying source 0 (type pkgConfig) of library gypsy ...
  1272. pkg-config use disabled globally.
  1273. => source produced no result.
  1274. test config.qtlocation_positioning.libraries.gypsy FAILED
  1275. executing config test winrt_geolocation
  1276. + cd /d C:\qt-everywhere-src-5.15.2\config.tests\winrt && C:\qt-everywhere-src-5.15.2\qtbase\bin\qmake.exe "CONFIG -= qt debug_and_release app_bundle lib_bundle" "CONFIG += static warn_off console single_arch" "QMAKE_LIBDIR += C:\\Qt\\OpenSSL\\OpenSSL-1.1.1\\static\\x64\\Release\\lib" "INCLUDEPATH += C:\\Qt\\OpenSSL\\OpenSSL-1.1.1\\static\\x64\\Release\\include" C:/qt-everywhere-src-5.15.2/qtlocation/config.tests/winrt
  1277. + cd /d C:\qt-everywhere-src-5.15.2\config.tests\winrt && set MAKEFLAGS=& nmake clean && set MAKEFLAGS=& nmake
  1278. > Microsoft (R) Program Maintenance Utility Version 14.16.27045.0
  1279. > Copyright (C) Microsoft Corporation. All rights reserved.
  1280. > del main.obj
  1281. > Microsoft (R) Program Maintenance Utility Version 14.16.27045.0
  1282. > Copyright (C) Microsoft Corporation. All rights reserved.
  1283. > cl -c -nologo -Zc:wchar_t -FS -Zc:rvalueCast -Zc:inline -Zc:strictStrings -Zc:throwingNew -Zc:referenceBinding -Zc:__cplusplus -O2 -MT -W0 -EHsc -DUNICODE -D_UNICODE -DWIN32 -D_ENABLE_EXTENDED_ALIGNED_STORAGE -DWIN64 -DNDEBUG -IC:\qt-everywhere-src-5.15.2\qtlocation\config.tests\winrt -I. -IC:\Qt\OpenSSL\OpenSSL-1.1.1\static\x64\Release\include -IC:\qt-everywhere-src-5.15.2\qtbase\mkspecs\win32-msvc -Fo @C:\Users\MyUser\AppData\Local\Temp\nmB0D8.tmp
  1284. > main.cpp
  1285. > link /NOLOGO /DYNAMICBASE /NXCOMPAT /OPT:REF /INCREMENTAL:NO /SUBSYSTEM:CONSOLE "/MANIFESTDEPENDENCY:type='win32' name='Microsoft.Windows.Common-Controls' version='6.0.0.0' publicKeyToken='6595b64144ccf1df' language='*' processorArchitecture='*'" /MANIFEST:embed /OUT:winrt.exe @C:\Users\MyUser\AppData\Local\Temp\nmB82C.tmp
  1286. test config.qtlocation_positioning.tests.winrt_geolocation succeeded
  1287. looking for library directshow
  1288. Trying source 0 (type inline) of library directshow ...
  1289. + cd /d C:\qt-everywhere-src-5.15.2\config.tests\directshow && C:\qt-everywhere-src-5.15.2\qtbase\bin\qmake.exe "CONFIG -= qt debug_and_release app_bundle lib_bundle" "CONFIG += static warn_off console single_arch" "QMAKE_LIBDIR += C:\\Qt\\OpenSSL\\OpenSSL-1.1.1\\static\\x64\\Release\\lib" "INCLUDEPATH += C:\\Qt\\OpenSSL\\OpenSSL-1.1.1\\static\\x64\\Release\\include" "QMAKE_USE += directshow" "QMAKE_LIBS_DIRECTSHOW = -lstrmiids -ldmoguids -luuid -lmsdmo -lole32 -loleaut32" C:/qt-everywhere-src-5.15.2/qtmultimedia/config.tests/directshow
  1290. + cd /d C:\qt-everywhere-src-5.15.2\config.tests\directshow && set MAKEFLAGS=& nmake clean && set MAKEFLAGS=& nmake
  1291. > Microsoft (R) Program Maintenance Utility Version 14.16.27045.0
  1292. > Copyright (C) Microsoft Corporation. All rights reserved.
  1293. > del main.obj
  1294. > Microsoft (R) Program Maintenance Utility Version 14.16.27045.0
  1295. > Copyright (C) Microsoft Corporation. All rights reserved.
  1296. > cl -c -nologo -Zc:wchar_t -FS -Zc:rvalueCast -Zc:inline -Zc:strictStrings -Zc:throwingNew -Zc:referenceBinding -Zc:__cplusplus -O2 -MT -W0 -EHsc -DUNICODE -D_UNICODE -DWIN32 -D_ENABLE_EXTENDED_ALIGNED_STORAGE -DWIN64 -DNDEBUG -IC:\qt-everywhere-src-5.15.2\qtmultimedia\config.tests\directshow -I. -IC:\Qt\OpenSSL\OpenSSL-1.1.1\static\x64\Release\include -IC:\qt-everywhere-src-5.15.2\qtbase\mkspecs\win32-msvc -Fo @C:\Users\MyUser\AppData\Local\Temp\nmB8F6.tmp
  1297. > main.cpp
  1298. > link /NOLOGO /DYNAMICBASE /NXCOMPAT /OPT:REF /INCREMENTAL:NO /SUBSYSTEM:CONSOLE "/MANIFESTDEPENDENCY:type='win32' name='Microsoft.Windows.Common-Controls' version='6.0.0.0' publicKeyToken='6595b64144ccf1df' language='*' processorArchitecture='*'" /MANIFEST:embed /OUT:directshow.exe @C:\Users\MyUser\AppData\Local\Temp\nmBA5F.tmp
  1299. => source accepted.
  1300. test config.qtmultimedia_multimedia.libraries.directshow succeeded
  1301. executing config test evr
  1302. + cd /d C:\qt-everywhere-src-5.15.2\config.tests\evr && C:\qt-everywhere-src-5.15.2\qtbase\bin\qmake.exe "CONFIG -= qt debug_and_release app_bundle lib_bundle" "CONFIG += static warn_off console single_arch" "QMAKE_LIBDIR += C:\\Qt\\OpenSSL\\OpenSSL-1.1.1\\static\\x64\\Release\\lib" "INCLUDEPATH += C:\\Qt\\OpenSSL\\OpenSSL-1.1.1\\static\\x64\\Release\\include" C:/qt-everywhere-src-5.15.2/qtmultimedia/config.tests/evr
  1303. + cd /d C:\qt-everywhere-src-5.15.2\config.tests\evr && set MAKEFLAGS=& nmake clean && set MAKEFLAGS=& nmake
  1304. > Microsoft (R) Program Maintenance Utility Version 14.16.27045.0
  1305. > Copyright (C) Microsoft Corporation. All rights reserved.
  1306. > del main.obj
  1307. > Microsoft (R) Program Maintenance Utility Version 14.16.27045.0
  1308. > Copyright (C) Microsoft Corporation. All rights reserved.
  1309. > cl -c -nologo -Zc:wchar_t -FS -Zc:rvalueCast -Zc:inline -Zc:strictStrings -Zc:throwingNew -Zc:referenceBinding -Zc:__cplusplus -O2 -MT -W0 -EHsc -DUNICODE -D_UNICODE -DWIN32 -D_ENABLE_EXTENDED_ALIGNED_STORAGE -DWIN64 -DNDEBUG -IC:\qt-everywhere-src-5.15.2\qtmultimedia\config.tests\evr -I. -IC:\Qt\OpenSSL\OpenSSL-1.1.1\static\x64\Release\include -IC:\qt-everywhere-src-5.15.2\qtbase\mkspecs\win32-msvc -Fo @C:\Users\MyUser\AppData\Local\Temp\nmBB09.tmp
  1310. > main.cpp
  1311. > link /NOLOGO /DYNAMICBASE /NXCOMPAT /OPT:REF /INCREMENTAL:NO /SUBSYSTEM:CONSOLE "/MANIFESTDEPENDENCY:type='win32' name='Microsoft.Windows.Common-Controls' version='6.0.0.0' publicKeyToken='6595b64144ccf1df' language='*' processorArchitecture='*'" /MANIFEST:embed /OUT:evr.exe @C:\Users\MyUser\AppData\Local\Temp\nmBC72.tmp
  1312. test config.qtmultimedia_multimedia.tests.evr succeeded
  1313. looking for library gstreamer_1_0
  1314. Trying source 0 (type pkgConfig) of library gstreamer_1_0 ...
  1315. pkg-config use disabled globally.
  1316. => source produced no result.
  1317. Trying source 1 (type inline) of library gstreamer_1_0 ...
  1318. + cd /d C:\qt-everywhere-src-5.15.2\config.tests\gstreamer && C:\qt-everywhere-src-5.15.2\qtbase\bin\qmake.exe "CONFIG -= qt debug_and_release app_bundle lib_bundle" "CONFIG += static warn_off console single_arch" "QMAKE_LIBDIR += C:\\Qt\\OpenSSL\\OpenSSL-1.1.1\\static\\x64\\Release\\lib" "INCLUDEPATH += C:\\Qt\\OpenSSL\\OpenSSL-1.1.1\\static\\x64\\Release\\include" "QMAKE_USE += gstreamer_1_0" "QMAKE_LIBS_GSTREAMER_1_0 = -lgstreamer-1.0 -lgstbase-1.0 -lgstaudio-1.0 -lgstvideo-1.0 -lgstpbutils-1.0 -lglib-2.0 -lgobject-2.0" C:/qt-everywhere-src-5.15.2/qtmultimedia/config.tests/gstreamer
  1319. + cd /d C:\qt-everywhere-src-5.15.2\config.tests\gstreamer && set MAKEFLAGS=& nmake clean && set MAKEFLAGS=& nmake
  1320. > Microsoft (R) Program Maintenance Utility Version 14.16.27045.0
  1321. > Copyright (C) Microsoft Corporation. All rights reserved.
  1322. > del main.obj
  1323. > Could Not Find C:\qt-everywhere-src-5.15.2\config.tests\gstreamer\main.obj
  1324. > Microsoft (R) Program Maintenance Utility Version 14.16.27045.0
  1325. > Copyright (C) Microsoft Corporation. All rights reserved.
  1326. > cl -c -nologo -Zc:wchar_t -FS -Zc:rvalueCast -Zc:inline -Zc:strictStrings -Zc:throwingNew -Zc:referenceBinding -Zc:__cplusplus -O2 -MT -W0 -EHsc -DUNICODE -D_UNICODE -DWIN32 -D_ENABLE_EXTENDED_ALIGNED_STORAGE -DWIN64 -DNDEBUG -IC:\qt-everywhere-src-5.15.2\qtmultimedia\config.tests\gstreamer -I. -IC:\Qt\OpenSSL\OpenSSL-1.1.1\static\x64\Release\include -IC:\qt-everywhere-src-5.15.2\qtbase\mkspecs\win32-msvc -Fo @C:\Users\MyUser\AppData\Local\Temp\nmBD2C.tmp
  1327. > main.cpp
  1328. > C:\qt-everywhere-src-5.15.2\qtmultimedia\config.tests\gstreamer\main.cpp(31): fatal error C1083: Cannot open include file: 'gst/gst.h': No such file or directory
  1329. > NMAKE : fatal error U1077: '"C:\Program Files (x86)\Microsoft Visual Studio\2017\Professional\VC\Tools\MSVC\14.16.27023\bin\HostX64\x64\cl.EXE"' : return code '0x2'
  1330. > Stop.
  1331. => source failed verification.
  1332. Trying source 2 (type inline) of library gstreamer_1_0 ...
  1333. => source failed condition 'config.android && input.gstreamer != '''.
  1334. test config.qtmultimedia_multimedia.libraries.gstreamer_1_0 FAILED
  1335. looking for library gstreamer_0_10
  1336. Trying source 0 (type pkgConfig) of library gstreamer_0_10 ...
  1337. pkg-config use disabled globally.
  1338. => source produced no result.
  1339. test config.qtmultimedia_multimedia.libraries.gstreamer_0_10 FAILED
  1340. looking for library openal
  1341. Trying source 0 (type pkgConfig) of library openal ...
  1342. pkg-config use disabled globally.
  1343. => source produced no result.
  1344. Trying source 1 (type inline) of library openal ...
  1345. + cd /d C:\qt-everywhere-src-5.15.2\config.tests\openal && C:\qt-everywhere-src-5.15.2\qtbase\bin\qmake.exe "CONFIG -= qt debug_and_release app_bundle lib_bundle" "CONFIG += static warn_off console single_arch" "QMAKE_LIBDIR += C:\\Qt\\OpenSSL\\OpenSSL-1.1.1\\static\\x64\\Release\\lib" "INCLUDEPATH += C:\\Qt\\OpenSSL\\OpenSSL-1.1.1\\static\\x64\\Release\\include" "QMAKE_USE += openal" "QMAKE_LIBS_OPENAL = -lOpenAL32" C:/qt-everywhere-src-5.15.2/qtmultimedia/config.tests/openal
  1346. + cd /d C:\qt-everywhere-src-5.15.2\config.tests\openal && set MAKEFLAGS=& nmake clean && set MAKEFLAGS=& nmake
  1347. > Microsoft (R) Program Maintenance Utility Version 14.16.27045.0
  1348. > Copyright (C) Microsoft Corporation. All rights reserved.
  1349. > del main.obj
  1350. > Could Not Find C:\qt-everywhere-src-5.15.2\config.tests\openal\main.obj
  1351. > Microsoft (R) Program Maintenance Utility Version 14.16.27045.0
  1352. > Copyright (C) Microsoft Corporation. All rights reserved.
  1353. > cl -c -nologo -Zc:wchar_t -FS -Zc:rvalueCast -Zc:inline -Zc:strictStrings -Zc:throwingNew -Zc:referenceBinding -Zc:__cplusplus -O2 -MT -W0 -EHsc -DUNICODE -D_UNICODE -DWIN32 -D_ENABLE_EXTENDED_ALIGNED_STORAGE -DWIN64 -DNDEBUG -IC:\qt-everywhere-src-5.15.2\qtmultimedia\config.tests\openal -I. -IC:\Qt\OpenSSL\OpenSSL-1.1.1\static\x64\Release\include -IC:\qt-everywhere-src-5.15.2\qtbase\mkspecs\win32-msvc -Fo @C:\Users\MyUser\AppData\Local\Temp\nmBDB9.tmp
  1354. > main.cpp
  1355. > C:\qt-everywhere-src-5.15.2\qtmultimedia\config.tests\openal\main.cpp(32): fatal error C1083: Cannot open include file: 'AL/al.h': No such file or directory
  1356. > NMAKE : fatal error U1077: '"C:\Program Files (x86)\Microsoft Visual Studio\2017\Professional\VC\Tools\MSVC\14.16.27023\bin\HostX64\x64\cl.EXE"' : return code '0x2'
  1357. > Stop.
  1358. => source failed verification.
  1359. Trying source 2 (type inline) of library openal ...
  1360. => source failed condition 'config.darwin'.
  1361. Trying source 3 (type inline) of library openal ...
  1362. => source failed condition 'config.unix && !config.darwin'.
  1363. test config.qtmultimedia_multimedia.libraries.openal FAILED
  1364. looking for library libresourceqt5
  1365. Trying source 0 (type pkgConfig) of library libresourceqt5 ...
  1366. pkg-config use disabled globally.
  1367. => source produced no result.
  1368. test config.qtmultimedia_multimedia.libraries.libresourceqt5 FAILED
  1369. executing config test wasapi
  1370. + cd /d C:\qt-everywhere-src-5.15.2\config.tests\wasapi && C:\qt-everywhere-src-5.15.2\qtbase\bin\qmake.exe "CONFIG -= qt debug_and_release app_bundle lib_bundle" "CONFIG += static warn_off console single_arch" "QMAKE_LIBDIR += C:\\Qt\\OpenSSL\\OpenSSL-1.1.1\\static\\x64\\Release\\lib" "INCLUDEPATH += C:\\Qt\\OpenSSL\\OpenSSL-1.1.1\\static\\x64\\Release\\include" C:/qt-everywhere-src-5.15.2/qtmultimedia/config.tests/wasapi
  1371. + cd /d C:\qt-everywhere-src-5.15.2\config.tests\wasapi && set MAKEFLAGS=& nmake clean && set MAKEFLAGS=& nmake
  1372. > Microsoft (R) Program Maintenance Utility Version 14.16.27045.0
  1373. > Copyright (C) Microsoft Corporation. All rights reserved.
  1374. > del main.obj
  1375. > Microsoft (R) Program Maintenance Utility Version 14.16.27045.0
  1376. > Copyright (C) Microsoft Corporation. All rights reserved.
  1377. > cl -c -nologo -Zc:wchar_t -FS -Zc:rvalueCast -Zc:inline -Zc:strictStrings -Zc:throwingNew -Zc:referenceBinding -Zc:__cplusplus -O2 -MT -W0 -EHsc -DUNICODE -D_UNICODE -DWIN32 -D_ENABLE_EXTENDED_ALIGNED_STORAGE -DWIN64 -DNDEBUG -IC:\qt-everywhere-src-5.15.2\qtmultimedia\config.tests\wasapi -I. -IC:\Qt\OpenSSL\OpenSSL-1.1.1\static\x64\Release\include -IC:\qt-everywhere-src-5.15.2\qtbase\mkspecs\win32-msvc -Fo @C:\Users\MyUser\AppData\Local\Temp\nmBE46.tmp
  1378. > main.cpp
  1379. > link /NOLOGO /DYNAMICBASE /NXCOMPAT /OPT:REF /INCREMENTAL:NO /SUBSYSTEM:CONSOLE "/MANIFESTDEPENDENCY:type='win32' name='Microsoft.Windows.Common-Controls' version='6.0.0.0' publicKeyToken='6595b64144ccf1df' language='*' processorArchitecture='*'" /MANIFEST:embed /OUT:wasapi.exe @C:\Users\MyUser\AppData\Local\Temp\nmC55B.tmp
  1380. test config.qtmultimedia_multimedia.tests.wasapi succeeded
  1381. looking for library wmf
  1382. Trying source 0 (type inline) of library wmf ...
  1383. + cd /d C:\qt-everywhere-src-5.15.2\config.tests\wmf && C:\qt-everywhere-src-5.15.2\qtbase\bin\qmake.exe "CONFIG -= qt debug_and_release app_bundle lib_bundle" "CONFIG += static warn_off console single_arch" "QMAKE_LIBDIR += C:\\Qt\\OpenSSL\\OpenSSL-1.1.1\\static\\x64\\Release\\lib" "INCLUDEPATH += C:\\Qt\\OpenSSL\\OpenSSL-1.1.1\\static\\x64\\Release\\include" "QMAKE_USE += wmf" "QMAKE_LIBS_WMF = -lstrmiids -ldmoguids -luuid -lmsdmo -lole32 -loleaut32 -lMf -lMfuuid -lMfplat -lPropsys" C:/qt-everywhere-src-5.15.2/qtmultimedia/config.tests/wmf
  1384. + cd /d C:\qt-everywhere-src-5.15.2\config.tests\wmf && set MAKEFLAGS=& nmake clean && set MAKEFLAGS=& nmake
  1385. > Microsoft (R) Program Maintenance Utility Version 14.16.27045.0
  1386. > Copyright (C) Microsoft Corporation. All rights reserved.
  1387. > del main.obj
  1388. > Microsoft (R) Program Maintenance Utility Version 14.16.27045.0
  1389. > Copyright (C) Microsoft Corporation. All rights reserved.
  1390. > cl -c -nologo -Zc:wchar_t -FS -Zc:rvalueCast -Zc:inline -Zc:strictStrings -Zc:throwingNew -Zc:referenceBinding -Zc:__cplusplus -O2 -MT -W0 -EHsc -DUNICODE -D_UNICODE -DWIN32 -D_ENABLE_EXTENDED_ALIGNED_STORAGE -DWIN64 -DNDEBUG -IC:\qt-everywhere-src-5.15.2\qtmultimedia\config.tests\wmf -I. -IC:\Qt\OpenSSL\OpenSSL-1.1.1\static\x64\Release\include -IC:\qt-everywhere-src-5.15.2\qtbase\mkspecs\win32-msvc -Fo @C:\Users\MyUser\AppData\Local\Temp\nmC625.tmp
  1391. > main.cpp
  1392. > link /NOLOGO /DYNAMICBASE /NXCOMPAT /OPT:REF /INCREMENTAL:NO /SUBSYSTEM:CONSOLE "/MANIFESTDEPENDENCY:type='win32' name='Microsoft.Windows.Common-Controls' version='6.0.0.0' publicKeyToken='6595b64144ccf1df' language='*' processorArchitecture='*'" /MANIFEST:embed /OUT:wmf.exe @C:\Users\MyUser\AppData\Local\Temp\nmC7AD.tmp
  1393. => source accepted.
  1394. test config.qtmultimedia_multimedia.libraries.wmf succeeded
  1395. executing config test wmsdk
  1396. + cd /d C:\qt-everywhere-src-5.15.2\config.tests\wmsdk && C:\qt-everywhere-src-5.15.2\qtbase\bin\qmake.exe "CONFIG -= qt debug_and_release app_bundle lib_bundle" "CONFIG += static warn_off console single_arch" "QMAKE_LIBDIR += C:\\Qt\\OpenSSL\\OpenSSL-1.1.1\\static\\x64\\Release\\lib" "INCLUDEPATH += C:\\Qt\\OpenSSL\\OpenSSL-1.1.1\\static\\x64\\Release\\include" C:/qt-everywhere-src-5.15.2/qtmultimedia/config.tests/wmsdk
  1397. + cd /d C:\qt-everywhere-src-5.15.2\config.tests\wmsdk && set MAKEFLAGS=& nmake clean && set MAKEFLAGS=& nmake
  1398. > Microsoft (R) Program Maintenance Utility Version 14.16.27045.0
  1399. > Copyright (C) Microsoft Corporation. All rights reserved.
  1400. > del main.obj
  1401. > Microsoft (R) Program Maintenance Utility Version 14.16.27045.0
  1402. > Copyright (C) Microsoft Corporation. All rights reserved.
  1403. > cl -c -nologo -Zc:wchar_t -FS -Zc:rvalueCast -Zc:inline -Zc:strictStrings -Zc:throwingNew -Zc:referenceBinding -Zc:__cplusplus -O2 -MT -W0 -EHsc -DUNICODE -D_UNICODE -DWIN32 -D_ENABLE_EXTENDED_ALIGNED_STORAGE -DWIN64 -DNDEBUG -IC:\qt-everywhere-src-5.15.2\qtmultimedia\config.tests\wmsdk -I. -IC:\Qt\OpenSSL\OpenSSL-1.1.1\static\x64\Release\include -IC:\qt-everywhere-src-5.15.2\qtbase\mkspecs\win32-msvc -Fo @C:\Users\MyUser\AppData\Local\Temp\nmC867.tmp
  1404. > main.cpp
  1405. > link /NOLOGO /DYNAMICBASE /NXCOMPAT /OPT:REF /INCREMENTAL:NO /SUBSYSTEM:CONSOLE "/MANIFESTDEPENDENCY:type='win32' name='Microsoft.Windows.Common-Controls' version='6.0.0.0' publicKeyToken='6595b64144ccf1df' language='*' processorArchitecture='*'" /MANIFEST:embed /OUT:wmsdk.exe @C:\Users\MyUser\AppData\Local\Temp\nmC991.tmp
  1406. test config.qtmultimedia_multimedia.tests.wmsdk succeeded
  1407. executing config test wshellitem
  1408. + cd /d C:\qt-everywhere-src-5.15.2\config.tests\wshellitem && C:\qt-everywhere-src-5.15.2\qtbase\bin\qmake.exe "CONFIG -= qt debug_and_release app_bundle lib_bundle" "CONFIG += static warn_off console single_arch" "QMAKE_LIBDIR += C:\\Qt\\OpenSSL\\OpenSSL-1.1.1\\static\\x64\\Release\\lib" "INCLUDEPATH += C:\\Qt\\OpenSSL\\OpenSSL-1.1.1\\static\\x64\\Release\\include" C:/qt-everywhere-src-5.15.2/qtmultimedia/config.tests/wshellitem
  1409. + cd /d C:\qt-everywhere-src-5.15.2\config.tests\wshellitem && set MAKEFLAGS=& nmake clean && set MAKEFLAGS=& nmake
  1410. > Microsoft (R) Program Maintenance Utility Version 14.16.27045.0
  1411. > Copyright (C) Microsoft Corporation. All rights reserved.
  1412. > del main.obj
  1413. > Microsoft (R) Program Maintenance Utility Version 14.16.27045.0
  1414. > Copyright (C) Microsoft Corporation. All rights reserved.
  1415. > cl -c -nologo -Zc:wchar_t -FS -Zc:rvalueCast -Zc:inline -Zc:strictStrings -Zc:throwingNew -Zc:referenceBinding -Zc:__cplusplus -O2 -MT -W0 -EHsc -DUNICODE -D_UNICODE -DWIN32 -D_ENABLE_EXTENDED_ALIGNED_STORAGE -DWIN64 -DNDEBUG -IC:\qt-everywhere-src-5.15.2\qtmultimedia\config.tests\wshellitem -I. -IC:\Qt\OpenSSL\OpenSSL-1.1.1\static\x64\Release\include -IC:\qt-everywhere-src-5.15.2\qtbase\mkspecs\win32-msvc -Fo @C:\Users\MyUser\AppData\Local\Temp\nmCA4C.tmp
  1416. > main.cpp
  1417. > link /NOLOGO /DYNAMICBASE /NXCOMPAT /OPT:REF /INCREMENTAL:NO /SUBSYSTEM:CONSOLE "/MANIFESTDEPENDENCY:type='win32' name='Microsoft.Windows.Common-Controls' version='6.0.0.0' publicKeyToken='6595b64144ccf1df' language='*' processorArchitecture='*'" /MANIFEST:embed /OUT:wshellitem.exe @C:\Users\MyUser\AppData\Local\Temp\nmCBB4.tmp
  1418. test config.qtmultimedia_multimedia.tests.wshellitem succeeded
  1419. looking for library flite
  1420. Trying source 0 (type inline) of library flite ...
  1421. + cd /d C:\qt-everywhere-src-5.15.2\config.tests\flite && C:\qt-everywhere-src-5.15.2\qtbase\bin\qmake.exe "CONFIG -= qt debug_and_release app_bundle lib_bundle" "CONFIG += static warn_off console single_arch" "QMAKE_LIBDIR += C:\\Qt\\OpenSSL\\OpenSSL-1.1.1\\static\\x64\\Release\\lib" "INCLUDEPATH += C:\\Qt\\OpenSSL\\OpenSSL-1.1.1\\static\\x64\\Release\\include" "QMAKE_USE += flite" "QMAKE_LIBS_FLITE = -lflite_cmu_us_kal16 -lflite_usenglish -lflite_cmulex -lflite" C:/qt-everywhere-src-5.15.2/config.tests/flite
  1422. + cd /d C:\qt-everywhere-src-5.15.2\config.tests\flite && set MAKEFLAGS=& nmake clean && set MAKEFLAGS=& nmake
  1423. > Microsoft (R) Program Maintenance Utility Version 14.16.27045.0
  1424. > Copyright (C) Microsoft Corporation. All rights reserved.
  1425. > del main.obj
  1426. > Could Not Find C:\qt-everywhere-src-5.15.2\config.tests\flite\main.obj
  1427. > Microsoft (R) Program Maintenance Utility Version 14.16.27045.0
  1428. > Copyright (C) Microsoft Corporation. All rights reserved.
  1429. > cl -c -nologo -Zc:wchar_t -FS -Zc:rvalueCast -Zc:inline -Zc:strictStrings -Zc:throwingNew -Zc:referenceBinding -Zc:__cplusplus -O2 -MT -W0 -EHsc -DUNICODE -D_UNICODE -DWIN32 -D_ENABLE_EXTENDED_ALIGNED_STORAGE -DWIN64 -DNDEBUG -I. -IC:\Qt\OpenSSL\OpenSSL-1.1.1\static\x64\Release\include -IC:\qt-everywhere-src-5.15.2\qtbase\mkspecs\win32-msvc -Fo @C:\Users\MyUser\AppData\Local\Temp\nmCC5F.tmp
  1430. > main.cpp
  1431. > .\main.cpp(2): fatal error C1083: Cannot open include file: 'flite/flite.h': No such file or directory
  1432. > NMAKE : fatal error U1077: '"C:\Program Files (x86)\Microsoft Visual Studio\2017\Professional\VC\Tools\MSVC\14.16.27023\bin\HostX64\x64\cl.EXE"' : return code '0x2'
  1433. > Stop.
  1434. => source failed verification.
  1435. test config.qtspeech_tts.libraries.flite FAILED
  1436. executing config test libclang
  1437. test config.qttools_qdoc.tests.libclang FAILED
  1438. executing config test webengine-arch-support
  1439. test config.qtwebengine_buildtools.tests.webengine-arch-support succeeded
  1440. executing config test webengine-bison
  1441. Found bison from path: C:/qt-everywhere-src-5.15.2/gnuwin32/bin/bison.exe
  1442. test config.qtwebengine_buildtools.tests.webengine-bison succeeded
  1443. executing config test webengine-submodule
  1444. test config.qtwebengine_buildtools.tests.webengine-submodule succeeded
  1445. executing config test webengine-nowhitespace
  1446. test config.qtwebengine_buildtools.tests.webengine-nowhitespace succeeded
  1447. executing config test webengine-platform-support
  1448. test config.qtwebengine_buildtools.tests.webengine-platform-support gave result
  1449. executing config test webengine-gperf
  1450. Found gperf from path: C:/qt-everywhere-src-5.15.2/gnuwin32/bin/gperf.exe
  1451. test config.qtwebengine_buildtools.tests.webengine-gperf succeeded
  1452. executing config test webengine-flex
  1453. Found flex from path: C:/qt-everywhere-src-5.15.2/gnuwin32/bin/flex.exe
  1454. test config.qtwebengine_buildtools.tests.webengine-flex succeeded
  1455. executing config test webengine-python2
  1456. 'python2.exe' not found in PATH. Checking for 'python.exe'.
  1457. Python version 3 is not supported by Chromium.
  1458. A suitable Python 2 executable could not be located.
  1459. test config.qtwebengine_buildtools.tests.webengine-python2 gave result
  1460. executing config test webengine-jumbo-build
  1461. Setting jumbo build merge batch limit to 0.
  1462. test config.qtwebengine_buildtools.tests.webengine-jumbo-build gave result 0
  1463. looking for library webengine-dbus
  1464. Trying source 0 (type pkgConfig) of library webengine-dbus ...
  1465. pkg-config use disabled globally.
  1466. => source produced no result.
  1467. test config.qtwebengine_buildtools.libraries.webengine-dbus FAILED
  1468. looking for library webengine-fontconfig
  1469. Trying source 0 (type pkgConfig) of library webengine-fontconfig ...
  1470. pkg-config use disabled globally.
  1471. => source produced no result.
  1472. test config.qtwebengine_buildtools.libraries.webengine-fontconfig FAILED
  1473. looking for library webengine-libdrm
  1474. Trying source 0 (type pkgConfig) of library webengine-libdrm ...
  1475. pkg-config use disabled globally.
  1476. => source produced no result.
  1477. test config.qtwebengine_buildtools.libraries.webengine-libdrm FAILED
  1478. executing config test webengine-ninja
  1479. Found ninja from path: C:\Program Files (x86)\Microsoft Visual Studio\2017\Professional\Common7\IDE\CommonExtensions\Microsoft\CMake\Ninja/ninja.exe
  1480. + C:\Program Files (x86)\Microsoft Visual Studio\2017\Professional\Common7\IDE\CommonExtensions\Microsoft\CMake\Ninja/ninja.exe --version
  1481. test config.qtwebengine_buildtools.tests.webengine-ninja FAILED
  1482. looking for library webengine-xcomposite
  1483. Trying source 0 (type pkgConfig) of library webengine-xcomposite ...
  1484. pkg-config use disabled globally.
  1485. => source produced no result.
  1486. test config.qtwebengine_buildtools.libraries.webengine-xcomposite FAILED
  1487. looking for library webengine-xcursor
  1488. Trying source 0 (type pkgConfig) of library webengine-xcursor ...
  1489. pkg-config use disabled globally.
  1490. => source produced no result.
  1491. test config.qtwebengine_buildtools.libraries.webengine-xcursor FAILED
  1492. looking for library webengine-xi
  1493. Trying source 0 (type pkgConfig) of library webengine-xi ...
  1494. pkg-config use disabled globally.
  1495. => source produced no result.
  1496. test config.qtwebengine_buildtools.libraries.webengine-xi FAILED
  1497. looking for library webengine-xtst
  1498. Trying source 0 (type pkgConfig) of library webengine-xtst ...
  1499. pkg-config use disabled globally.
  1500. => source produced no result.
  1501. test config.qtwebengine_buildtools.libraries.webengine-xtst FAILED
  1502. executing config test webengine-win-compiler64
  1503. test config.qtwebengine_buildtools.tests.webengine-win-compiler64 succeeded
  1504. executing config test webengine-winversion
  1505. + cd /d C:\qt-everywhere-src-5.15.2\config.tests\webengine-winversion && C:\qt-everywhere-src-5.15.2\qtbase\bin\qmake.exe "CONFIG -= qt debug_and_release app_bundle lib_bundle" "CONFIG += static warn_off console single_arch" "QMAKE_LIBDIR += C:\\Qt\\OpenSSL\\OpenSSL-1.1.1\\static\\x64\\Release\\lib" "INCLUDEPATH += C:\\Qt\\OpenSSL\\OpenSSL-1.1.1\\static\\x64\\Release\\include" C:/qt-everywhere-src-5.15.2/config.tests/webengine-winversion
  1506. + cd /d C:\qt-everywhere-src-5.15.2\config.tests\webengine-winversion && set MAKEFLAGS=& nmake clean && set MAKEFLAGS=& nmake
  1507. > Microsoft (R) Program Maintenance Utility Version 14.16.27045.0
  1508. > Copyright (C) Microsoft Corporation. All rights reserved.
  1509. > del main.obj
  1510. > Microsoft (R) Program Maintenance Utility Version 14.16.27045.0
  1511. > Copyright (C) Microsoft Corporation. All rights reserved.
  1512. > cl -c -nologo -Zc:wchar_t -FS -Zc:rvalueCast -Zc:inline -Zc:strictStrings -Zc:throwingNew -Zc:referenceBinding -Zc:__cplusplus -O2 -MT -W0 -EHsc -DUNICODE -D_UNICODE -DWIN32 -D_ENABLE_EXTENDED_ALIGNED_STORAGE -DWIN64 -DNDEBUG -I. -IC:\Qt\OpenSSL\OpenSSL-1.1.1\static\x64\Release\include -IC:\qt-everywhere-src-5.15.2\qtbase\mkspecs\win32-msvc -Fo @C:\Users\MyUser\AppData\Local\Temp\nmCD88.tmp
  1513. > main.cpp
  1514. > link /NOLOGO /DYNAMICBASE /NXCOMPAT /OPT:REF /INCREMENTAL:NO /SUBSYSTEM:CONSOLE "/MANIFESTDEPENDENCY:type='win32' name='Microsoft.Windows.Common-Controls' version='6.0.0.0' publicKeyToken='6595b64144ccf1df' language='*' processorArchitecture='*'" /MANIFEST:embed /OUT:webengine-winversion.exe @C:\Users\MyUser\AppData\Local\Temp\nmCDB8.tmp
  1515. test config.qtwebengine_buildtools.tests.webengine-winversion succeeded
  1516.  
RAW Paste Data