Guest User

Untitled

a guest
Aug 30th, 2012
43
Never
Not a member of Pastebin yet? Sign Up, it unlocks many cool features!
  1. Build failures with context:
  2. ---------------------
  3. rosout
  4. mkdir -p bin
  5. cd build && cmake -Wdev -DCMAKE_TOOLCHAIN_FILE=`rospack find rosbuild`/rostoolchain.cmake  ..
  6. -- The C compiler identification is GNU
  7. -- The CXX compiler identification is GNU
  8. -- Check for working C compiler: /usr/bin/gcc
  9. -- Check for working C compiler: /usr/bin/gcc -- works
  10. -- Detecting C compiler ABI info
  11. -- Detecting C compiler ABI info - done
  12. -- Check for working CXX compiler: /usr/bin/c++
  13. -- Check for working CXX compiler: /usr/bin/c++ -- works
  14. -- Detecting CXX compiler ABI info
  15. -- Detecting CXX compiler ABI info - done
  16. -- Found PythonInterp: /usr/bin/python2.6
  17. [rosbuild] Building package rosout
  18. [rosbuild] Cached build flags older than manifests; calling rospack to get flags
  19. [rosbuild] Including /home/caris/ros/ros_comm/clients/roslisp/cmake/roslisp.cmake
  20. [rosbuild] Including /home/caris/ros/ros_comm/clients/rospy/cmake/rospy.cmake
  21. [rosbuild] Including /home/caris/ros/ros_comm/clients/cpp/roscpp/cmake/roscpp.cmake
  22. -- Configuring done
  23. -- Generating done
  24. -- Build files have been written to: /home/caris/ros/ros_comm/tools/rosout/build
  25. cd build && make -l4
  26. make[1]: Entering directory `/home/caris/ros/ros_comm/tools/rosout/build'
  27. make[2]: Entering directory `/home/caris/ros/ros_comm/tools/rosout/build'
  28. make[3]: Entering directory `/home/caris/ros/ros_comm/tools/rosout/build'
  29. Scanning dependencies of target rospack_genmsg_libexe
  30. make[3]: Leaving directory `/home/caris/ros/ros_comm/tools/rosout/build'
  31. [  0%] Built target rospack_genmsg_libexe
  32. make[3]: Entering directory `/home/caris/ros/ros_comm/tools/rosout/build'
  33. Scanning dependencies of target rosbuild_precompile
  34. make[3]: Leaving directory `/home/caris/ros/ros_comm/tools/rosout/build'
  35. [  0%] Built target rosbuild_precompile
  36. make[3]: Entering directory `/home/caris/ros/ros_comm/tools/rosout/build'
  37. Scanning dependencies of target rosout
  38. make[3]: Leaving directory `/home/caris/ros/ros_comm/tools/rosout/build'
  39. make[3]: Entering directory `/home/caris/ros/ros_comm/tools/rosout/build'
  40. [100%] Building CXX object CMakeFiles/rosout.dir/rosout.o
  41. Linking CXX executable ../rosout
  42. /home/caris/ros/ros_comm/clients/cpp/roscpp/lib/libros.so: undefined reference to `boost::filesystem3::detail::create_directory(boost::filesystem3::path const&, boost::system::error_code*)'
  43. /home/caris/ros/ros_comm/clients/cpp/roscpp/lib/libros.so: undefined reference to `boost::system::system_category()'
  44. /home/caris/ros/ros_comm/clients/cpp/roscpp/lib/libros.so: undefined reference to `boost::filesystem3::detail::system_complete(boost::filesystem3::path const&, boost::system::error_code*)'
  45. /home/caris/ros/ros_comm/clients/cpp/roscpp/lib/libros.so: undefined reference to `boost::filesystem3::path::wchar_t_codecvt_facet()'
  46. /home/caris/ros/ros_comm/clients/cpp/roscpp/lib/libros.so: undefined reference to `boost::system::generic_category()'
  47. /home/caris/ros/ros_comm/clients/cpp/roscpp/lib/libros.so: undefined reference to `boost::filesystem3::path::parent_path() const'
  48. collect2: ld returned 1 exit status
  49. make[3]: *** [../rosout] Error 1
  50. make[3]: Leaving directory `/home/caris/ros/ros_comm/tools/rosout/build'
  51. make[2]: *** [CMakeFiles/rosout.dir/all] Error 2
  52. make[2]: Leaving directory `/home/caris/ros/ros_comm/tools/rosout/build'
  53. make[1]: *** [all] Error 2
  54. make[1]: Leaving directory `/home/caris/ros/ros_comm/tools/rosout/build'
  55. make: *** [all] Error 2
  56. ---------------------
  57. test_roscpp_serialization_perf
  58. mkdir -p bin
  59. cd build && cmake -Wdev -DCMAKE_TOOLCHAIN_FILE=`rospack find rosbuild`/rostoolchain.cmake  ..
  60. -- The C compiler identification is GNU
  61. -- The CXX compiler identification is GNU
  62. -- Check for working C compiler: /usr/bin/gcc
  63. -- Check for working C compiler: /usr/bin/gcc -- works
  64. -- Detecting C compiler ABI info
  65. -- Detecting C compiler ABI info - done
  66. -- Check for working CXX compiler: /usr/bin/c++
  67. -- Check for working CXX compiler: /usr/bin/c++ -- works
  68. -- Detecting CXX compiler ABI info
  69. -- Detecting CXX compiler ABI info - done
  70. -- Found PythonInterp: /usr/bin/python2.6
  71. [rosbuild] Building package test_roscpp_serialization_perf
  72. [rosbuild] Cached build flags older than manifests; calling rospack to get flags
  73. [rosbuild] Including /home/caris/ros/ros_comm/clients/roslisp/cmake/roslisp.cmake
  74. [rosbuild] Including /home/caris/ros/ros_comm/clients/rospy/cmake/rospy.cmake
  75. [rosbuild] Including /home/caris/ros/ros_comm/clients/cpp/roscpp/cmake/roscpp.cmake
  76. -- Configuring done
  77. -- Generating done
  78. -- Build files have been written to: /home/caris/ros/ros_comm/test/test_roscpp_serialization_perf/build
  79. cd build && make -l4
  80. make[1]: Entering directory `/home/caris/ros/ros_comm/test/test_roscpp_serialization_perf/build'
  81. make[2]: Entering directory `/home/caris/ros/ros_comm/test/test_roscpp_serialization_perf/build'
  82. make[3]: Entering directory `/home/caris/ros/ros_comm/test/test_roscpp_serialization_perf/build'
  83. Scanning dependencies of target rospack_genmsg_libexe
  84. make[3]: Leaving directory `/home/caris/ros/ros_comm/test/test_roscpp_serialization_perf/build'
  85. [  0%] Built target rospack_genmsg_libexe
  86. make[3]: Entering directory `/home/caris/ros/ros_comm/test/test_roscpp_serialization_perf/build'
  87. Scanning dependencies of target rosbuild_premsgsrvgen
  88. make[3]: Leaving directory `/home/caris/ros/ros_comm/test/test_roscpp_serialization_perf/build'
  89. [  0%] Built target rosbuild_premsgsrvgen
  90. make[3]: Entering directory `/home/caris/ros/ros_comm/test/test_roscpp_serialization_perf/build'
  91. Scanning dependencies of target ROSBUILD_genmsg_cpp
  92. make[3]: Leaving directory `/home/caris/ros/ros_comm/test/test_roscpp_serialization_perf/build'
  93. make[3]: Entering directory `/home/caris/ros/ros_comm/test/test_roscpp_serialization_perf/build'
  94. [  0%] Generating ../msg_gen/cpp/include/test_roscpp_serialization_perf/ChannelFloat32.h
  95. [  0%] Generating ../msg_gen/cpp/include/test_roscpp_serialization_perf/PointCloud.h
  96. [  0%] Generating ../msg_gen/cpp/include/test_roscpp_serialization_perf/Point32.h
  97. make[3]: Leaving directory `/home/caris/ros/ros_comm/test/test_roscpp_serialization_perf/build'
  98. [ 27%] Built target ROSBUILD_genmsg_cpp
  99. make[3]: Entering directory `/home/caris/ros/ros_comm/test/test_roscpp_serialization_perf/build'
  100. Scanning dependencies of target ROSBUILD_genmsg_lisp
  101. make[3]: Leaving directory `/home/caris/ros/ros_comm/test/test_roscpp_serialization_perf/build'
  102. make[3]: Entering directory `/home/caris/ros/ros_comm/test/test_roscpp_serialization_perf/build'
  103. [ 27%] Generating ../msg_gen/lisp/ChannelFloat32.lisp, ../msg_gen/lisp/_package.lisp, ../msg_gen/lisp/_package_ChannelFloat32.lisp
  104. [ 27%] Generating ../msg_gen/lisp/PointCloud.lisp, ../msg_gen/lisp/_package.lisp, ../msg_gen/lisp/_package_PointCloud.lisp
  105. [ 27%] Generating ../msg_gen/lisp/Point32.lisp, ../msg_gen/lisp/_package.lisp, ../msg_gen/lisp/_package_Point32.lisp
  106. make[3]: Leaving directory `/home/caris/ros/ros_comm/test/test_roscpp_serialization_perf/build'
  107. [ 54%] Built target ROSBUILD_genmsg_lisp
  108. make[3]: Entering directory `/home/caris/ros/ros_comm/test/test_roscpp_serialization_perf/build'
  109. Scanning dependencies of target ROSBUILD_genmsg_py
  110. make[3]: Leaving directory `/home/caris/ros/ros_comm/test/test_roscpp_serialization_perf/build'
  111. make[3]: Entering directory `/home/caris/ros/ros_comm/test/test_roscpp_serialization_perf/build'
  112. [ 54%] Generating ../src/test_roscpp_serialization_perf/msg/_Point32.py
  113. [genmsg_py]: generating messages for the following packages: ['test_roscpp_serialization_perf']
  114. ... generating /home/caris/ros/ros_comm/test/test_roscpp_serialization_perf/src/test_roscpp_serialization_perf/msg/_Point32.py
  115. genmsg_py: python messages for 'test_roscpp_serialization_perf' ==> /home/caris/ros/ros_comm/test/test_roscpp_serialization_perf/src/test_roscpp_serialization_perf/msg
  116. [ 54%] Generating ../src/test_roscpp_serialization_perf/msg/_ChannelFloat32.py
  117. [genmsg_py]: generating messages for the following packages: ['test_roscpp_serialization_perf']
  118. ... generating /home/caris/ros/ros_comm/test/test_roscpp_serialization_perf/src/test_roscpp_serialization_perf/msg/_ChannelFloat32.py
  119. genmsg_py: python messages for 'test_roscpp_serialization_perf' ==> /home/caris/ros/ros_comm/test/test_roscpp_serialization_perf/src/test_roscpp_serialization_perf/msg
  120. [ 54%] Generating ../src/test_roscpp_serialization_perf/msg/_PointCloud.py
  121. [genmsg_py]: generating messages for the following packages: ['test_roscpp_serialization_perf']
  122. ... generating /home/caris/ros/ros_comm/test/test_roscpp_serialization_perf/src/test_roscpp_serialization_perf/msg/_PointCloud.py
  123. genmsg_py: python messages for 'test_roscpp_serialization_perf' ==> /home/caris/ros/ros_comm/test/test_roscpp_serialization_perf/src/test_roscpp_serialization_perf/msg
  124. [ 54%] Generating ../src/test_roscpp_serialization_perf/msg/__init__.py
  125. ... also creating module file /home/caris/ros/ros_comm/test/test_roscpp_serialization_perf/src/test_roscpp_serialization_perf/__init__.py
  126. make[3]: Leaving directory `/home/caris/ros/ros_comm/test/test_roscpp_serialization_perf/build'
  127. [ 90%] Built target ROSBUILD_genmsg_py
  128. make[3]: Entering directory `/home/caris/ros/ros_comm/test/test_roscpp_serialization_perf/build'
  129. Scanning dependencies of target rospack_genmsg
  130. make[3]: Leaving directory `/home/caris/ros/ros_comm/test/test_roscpp_serialization_perf/build'
  131. [ 90%] Built target rospack_genmsg
  132. make[3]: Entering directory `/home/caris/ros/ros_comm/test/test_roscpp_serialization_perf/build'
  133. Scanning dependencies of target rosbuild_precompile
  134. make[3]: Leaving directory `/home/caris/ros/ros_comm/test/test_roscpp_serialization_perf/build'
  135. [ 90%] Built target rosbuild_precompile
  136. make[3]: Entering directory `/home/caris/ros/ros_comm/test/test_roscpp_serialization_perf/build'
  137. Scanning dependencies of target pointcloud_serdes
  138. make[3]: Leaving directory `/home/caris/ros/ros_comm/test/test_roscpp_serialization_perf/build'
  139. make[3]: Entering directory `/home/caris/ros/ros_comm/test/test_roscpp_serialization_perf/build'
  140. [100%] Building CXX object CMakeFiles/pointcloud_serdes.dir/pointcloud_serdes.o
  141. Linking CXX executable ../pointcloud_serdes
  142. /home/caris/ros/ros_comm/clients/cpp/roscpp/lib/libros.so: undefined reference to `boost::filesystem3::detail::create_directory(boost::filesystem3::path const&, boost::system::error_code*)'
  143. /home/caris/ros/ros_comm/clients/cpp/roscpp/lib/libros.so: undefined reference to `boost::system::system_category()'
  144. /home/caris/ros/ros_comm/clients/cpp/roscpp/lib/libros.so: undefined reference to `boost::filesystem3::detail::system_complete(boost::filesystem3::path const&, boost::system::error_code*)'
  145. /home/caris/ros/ros_comm/clients/cpp/roscpp/lib/libros.so: undefined reference to `boost::filesystem3::path::wchar_t_codecvt_facet()'
  146. /home/caris/ros/ros_comm/clients/cpp/roscpp/lib/libros.so: undefined reference to `boost::system::generic_category()'
  147. /home/caris/ros/ros_comm/clients/cpp/roscpp/lib/libros.so: undefined reference to `boost::filesystem3::path::parent_path() const'
  148. collect2: ld returned 1 exit status
  149. make[3]: *** [../pointcloud_serdes] Error 1
  150. make[3]: Leaving directory `/home/caris/ros/ros_comm/test/test_roscpp_serialization_perf/build'
  151. make[2]: *** [CMakeFiles/pointcloud_serdes.dir/all] Error 2
  152. make[2]: Leaving directory `/home/caris/ros/ros_comm/test/test_roscpp_serialization_perf/build'
  153. make[1]: *** [all] Error 2
  154. make[1]: Leaving directory `/home/caris/ros/ros_comm/test/test_roscpp_serialization_perf/build'
  155. make: *** [all] Error 2
  156. ---------------------
  157. perf_roscpp
  158. mkdir -p bin
  159. cd build && cmake -Wdev -DCMAKE_TOOLCHAIN_FILE=`rospack find rosbuild`/rostoolchain.cmake  ..
  160. -- The C compiler identification is GNU
  161. -- The CXX compiler identification is GNU
  162. -- Check for working C compiler: /usr/bin/gcc
  163. -- Check for working C compiler: /usr/bin/gcc -- works
  164. -- Detecting C compiler ABI info
  165. -- Detecting C compiler ABI info - done
  166. -- Check for working CXX compiler: /usr/bin/c++
  167. -- Check for working CXX compiler: /usr/bin/c++ -- works
  168. -- Detecting CXX compiler ABI info
  169. -- Detecting CXX compiler ABI info - done
  170. -- Found PythonInterp: /usr/bin/python2.6
  171. [rosbuild] Building package perf_roscpp
  172. [rosbuild] Cached build flags older than manifests; calling rospack to get flags
  173. [rosbuild] Including /home/caris/ros/ros_comm/clients/roslisp/cmake/roslisp.cmake
  174. [rosbuild] Including /home/caris/ros/ros_comm/clients/rospy/cmake/rospy.cmake
  175. [rosbuild] Including /home/caris/ros/ros_comm/clients/cpp/roscpp/cmake/roscpp.cmake
  176. [rosbuild] WARNING: rosbuild_gensrv() was called, but no .srv files were found
  177. -- Configuring done
  178. -- Generating done
  179. -- Build files have been written to: /home/caris/ros/ros_comm/test/perf_roscpp/build
  180. cd build && make -l4
  181. make[1]: Entering directory `/home/caris/ros/ros_comm/test/perf_roscpp/build'
  182. make[2]: Entering directory `/home/caris/ros/ros_comm/test/perf_roscpp/build'
  183. make[3]: Entering directory `/home/caris/ros/ros_comm/test/perf_roscpp/build'
  184. Scanning dependencies of target rospack_genmsg_libexe
  185. make[3]: Leaving directory `/home/caris/ros/ros_comm/test/perf_roscpp/build'
  186. [  0%] Built target rospack_genmsg_libexe
  187. make[3]: Entering directory `/home/caris/ros/ros_comm/test/perf_roscpp/build'
  188. Scanning dependencies of target rosbuild_premsgsrvgen
  189. make[3]: Leaving directory `/home/caris/ros/ros_comm/test/perf_roscpp/build'
  190. [  0%] Built target rosbuild_premsgsrvgen
  191. make[3]: Entering directory `/home/caris/ros/ros_comm/test/perf_roscpp/build'
  192. Scanning dependencies of target ROSBUILD_genmsg_cpp
  193. make[3]: Leaving directory `/home/caris/ros/ros_comm/test/perf_roscpp/build'
  194. make[3]: Entering directory `/home/caris/ros/ros_comm/test/perf_roscpp/build'
  195. [  0%] Generating ../msg_gen/cpp/include/perf_roscpp/ThroughputMessage.h
  196. [  0%] Generating ../msg_gen/cpp/include/perf_roscpp/LatencyMessage.h
  197. make[3]: Leaving directory `/home/caris/ros/ros_comm/test/perf_roscpp/build'
  198. [ 20%] Built target ROSBUILD_genmsg_cpp
  199. make[3]: Entering directory `/home/caris/ros/ros_comm/test/perf_roscpp/build'
  200. Scanning dependencies of target ROSBUILD_genmsg_lisp
  201. make[3]: Leaving directory `/home/caris/ros/ros_comm/test/perf_roscpp/build'
  202. make[3]: Entering directory `/home/caris/ros/ros_comm/test/perf_roscpp/build'
  203. [ 20%] Generating ../msg_gen/lisp/ThroughputMessage.lisp, ../msg_gen/lisp/_package.lisp, ../msg_gen/lisp/_package_ThroughputMessage.lisp
  204. [ 20%] Generating ../msg_gen/lisp/LatencyMessage.lisp, ../msg_gen/lisp/_package.lisp, ../msg_gen/lisp/_package_LatencyMessage.lisp
  205. make[3]: Leaving directory `/home/caris/ros/ros_comm/test/perf_roscpp/build'
  206. [ 40%] Built target ROSBUILD_genmsg_lisp
  207. make[3]: Entering directory `/home/caris/ros/ros_comm/test/perf_roscpp/build'
  208. Scanning dependencies of target ROSBUILD_genmsg_py
  209. make[3]: Leaving directory `/home/caris/ros/ros_comm/test/perf_roscpp/build'
  210. make[3]: Entering directory `/home/caris/ros/ros_comm/test/perf_roscpp/build'
  211. [ 40%] Generating ../src/perf_roscpp/msg/_LatencyMessage.py
  212. [genmsg_py]: generating messages for the following packages: ['perf_roscpp']
  213. ... generating /home/caris/ros/ros_comm/test/perf_roscpp/src/perf_roscpp/msg/_LatencyMessage.py
  214. genmsg_py: python messages for 'perf_roscpp' ==> /home/caris/ros/ros_comm/test/perf_roscpp/src/perf_roscpp/msg
  215. [ 40%] Generating ../src/perf_roscpp/msg/_ThroughputMessage.py
  216. [genmsg_py]: generating messages for the following packages: ['perf_roscpp']
  217. ... generating /home/caris/ros/ros_comm/test/perf_roscpp/src/perf_roscpp/msg/_ThroughputMessage.py
  218. genmsg_py: python messages for 'perf_roscpp' ==> /home/caris/ros/ros_comm/test/perf_roscpp/src/perf_roscpp/msg
  219. [ 40%] Generating ../src/perf_roscpp/msg/__init__.py
  220. ... also creating module file /home/caris/ros/ros_comm/test/perf_roscpp/src/perf_roscpp/__init__.py
  221. make[3]: Leaving directory `/home/caris/ros/ros_comm/test/perf_roscpp/build'
  222. [ 70%] Built target ROSBUILD_genmsg_py
  223. make[3]: Entering directory `/home/caris/ros/ros_comm/test/perf_roscpp/build'
  224. Scanning dependencies of target rospack_genmsg
  225. make[3]: Leaving directory `/home/caris/ros/ros_comm/test/perf_roscpp/build'
  226. [ 70%] Built target rospack_genmsg
  227. make[3]: Entering directory `/home/caris/ros/ros_comm/test/perf_roscpp/build'
  228. Scanning dependencies of target ROSBUILD_gensrv_cpp
  229. make[3]: Leaving directory `/home/caris/ros/ros_comm/test/perf_roscpp/build'
  230. [ 70%] Built target ROSBUILD_gensrv_cpp
  231. make[3]: Entering directory `/home/caris/ros/ros_comm/test/perf_roscpp/build'
  232. Scanning dependencies of target ROSBUILD_gensrv_lisp
  233. make[3]: Leaving directory `/home/caris/ros/ros_comm/test/perf_roscpp/build'
  234. [ 70%] Built target ROSBUILD_gensrv_lisp
  235. make[3]: Entering directory `/home/caris/ros/ros_comm/test/perf_roscpp/build'
  236. Scanning dependencies of target rospack_gensrv
  237. make[3]: Leaving directory `/home/caris/ros/ros_comm/test/perf_roscpp/build'
  238. [ 70%] Built target rospack_gensrv
  239. make[3]: Entering directory `/home/caris/ros/ros_comm/test/perf_roscpp/build'
  240. Scanning dependencies of target rosbuild_precompile
  241. make[3]: Leaving directory `/home/caris/ros/ros_comm/test/perf_roscpp/build'
  242. [ 70%] Built target rosbuild_precompile
  243. make[3]: Entering directory `/home/caris/ros/ros_comm/test/perf_roscpp/build'
  244. Scanning dependencies of target perf_roscpp
  245. make[3]: Leaving directory `/home/caris/ros/ros_comm/test/perf_roscpp/build'
  246. make[3]: Entering directory `/home/caris/ros/ros_comm/test/perf_roscpp/build'
  247. [ 80%] Building CXX object CMakeFiles/perf_roscpp.dir/src/intra.o
  248. [ 90%] Building CXX object CMakeFiles/perf_roscpp.dir/src/inter.o
  249. Linking CXX shared library ../lib/libperf_roscpp.so
  250. make[3]: Leaving directory `/home/caris/ros/ros_comm/test/perf_roscpp/build'
  251. [ 90%] Built target perf_roscpp
  252. make[3]: Entering directory `/home/caris/ros/ros_comm/test/perf_roscpp/build'
  253. Scanning dependencies of target intra_suite
  254. make[3]: Leaving directory `/home/caris/ros/ros_comm/test/perf_roscpp/build'
  255. make[3]: Entering directory `/home/caris/ros/ros_comm/test/perf_roscpp/build'
  256. [100%] Building CXX object CMakeFiles/intra_suite.dir/src/intra_suite.o
  257. Linking CXX executable ../bin/intra_suite
  258. /home/caris/ros/ros_comm/clients/cpp/roscpp/lib/libros.so: undefined reference to `boost::filesystem3::detail::create_directory(boost::filesystem3::path const&, boost::system::error_code*)'
  259. /home/caris/ros/ros_comm/clients/cpp/roscpp/lib/libros.so: undefined reference to `boost::system::system_category()'
  260. /home/caris/ros/ros_comm/clients/cpp/roscpp/lib/libros.so: undefined reference to `boost::filesystem3::detail::system_complete(boost::filesystem3::path const&, boost::system::error_code*)'
  261. /home/caris/ros/ros_comm/clients/cpp/roscpp/lib/libros.so: undefined reference to `boost::filesystem3::path::wchar_t_codecvt_facet()'
  262. /home/caris/ros/ros_comm/clients/cpp/roscpp/lib/libros.so: undefined reference to `boost::system::generic_category()'
  263. /home/caris/ros/ros_comm/clients/cpp/roscpp/lib/libros.so: undefined reference to `boost::filesystem3::path::parent_path() const'
  264. collect2: ld returned 1 exit status
  265. make[3]: *** [../bin/intra_suite] Error 1
  266. make[3]: Leaving directory `/home/caris/ros/ros_comm/test/perf_roscpp/build'
  267. make[2]: *** [CMakeFiles/intra_suite.dir/all] Error 2
  268. make[2]: Leaving directory `/home/caris/ros/ros_comm/test/perf_roscpp/build'
  269. make[1]: *** [all] Error 2
  270. make[1]: Leaving directory `/home/caris/ros/ros_comm/test/perf_roscpp/build'
  271. make: *** [all] Error 2
RAW Paste Data