Sunka

wget_source_install_051218-211913.log

Dec 5th, 2018
6
Never
Not a member of Pastebin yet? Sign Up, it unlocks many cool features!
  1. Download wget-1.20.tar.gz ...
  2. (Bwget-1.20.tar.gz Archive found, skipping download...
  3. (Bwget-1.20.tar.gz valid file.
  4. (B
  5. Making clean in lib
  6. make[1]: Entering directory `/svr-setup/wget-1.20/lib'
  7. make[2]: Entering directory `/svr-setup/wget-1.20/lib'
  8. test -z "" || rm -f
  9. test -z "libgnu.a" || rm -f libgnu.a
  10. test -z "" || rm -f
  11. rm -f *.o
  12. rm -f glthread/*.o
  13. rm -f unicase/*.o
  14. rm -f unictype/*.o
  15. rm -f uninorm/*.o
  16. rm -f unistr/*.o
  17. rm -f uniwidth/*.o
  18. test -z "core *.stackdump alloca.h alloca.h-t arpa/inet.h arpa/inet.h-t byteswap.h byteswap.h-t errno.h errno.h-t fcntl.h fcntl.h-t float.h float.h-t fnmatch.h fnmatch.h-t getopt.h getopt.h-t getopt-cdefs.h getopt-cdefs.h-t iconv.h iconv.h-t inttypes.h inttypes.h-t langinfo.h langinfo.h-t limits.h limits.h-t locale.h locale.h-t netdb.h netdb.h-t netinet/in.h netinet/in.h-t sched.h sched.h-t signal.h signal.h-t spawn.h spawn.h-t stdalign.h stdalign.h-t stdbool.h stdbool.h-t stddef.h stddef.h-t stdint.h stdint.h-t stdio.h stdio.h-t stdlib.h stdlib.h-t string.h string.h-t strings.h strings.h-t sys/file.h sys/file.h-t sys/ioctl.h sys/ioctl.h-t sys/select.h sys/select.h-t sys/socket.h sys/socket.h-t sys/stat.h sys/stat.h-t sys/time.h sys/time.h-t sys/types.h sys/types.h-t sys/uio.h sys/uio.h-t sys/wait.h sys/wait.h-t time.h time.h-t unicase.h unicase.h-t unicase/special-casing-table.h-t unicase/special-casing.h unicase/special-casing.h-t unictype.h unictype.h-t uninorm.h uninorm.h-t unistd.h unistd.h-t unistr.h unistr.h-t unitypes.h unitypes.h-t uniwidth.h uniwidth.h-t utime.h utime.h-t wchar.h wchar.h-t wctype.h wctype.h-t" || rm -f core *.stackdump alloca.h alloca.h-t arpa/inet.h arpa/inet.h-t byteswap.h byteswap.h-t errno.h errno.h-t fcntl.h fcntl.h-t float.h float.h-t fnmatch.h fnmatch.h-t getopt.h getopt.h-t getopt-cdefs.h getopt-cdefs.h-t iconv.h iconv.h-t inttypes.h inttypes.h-t langinfo.h langinfo.h-t limits.h limits.h-t locale.h locale.h-t netdb.h netdb.h-t netinet/in.h netinet/in.h-t sched.h sched.h-t signal.h signal.h-t spawn.h spawn.h-t stdalign.h stdalign.h-t stdbool.h stdbool.h-t stddef.h stddef.h-t stdint.h stdint.h-t stdio.h stdio.h-t stdlib.h stdlib.h-t string.h string.h-t strings.h strings.h-t sys/file.h sys/file.h-t sys/ioctl.h sys/ioctl.h-t sys/select.h sys/select.h-t sys/socket.h sys/socket.h-t sys/stat.h sys/stat.h-t sys/time.h sys/time.h-t sys/types.h sys/types.h-t sys/uio.h sys/uio.h-t sys/wait.h sys/wait.h-t time.h time.h-t unicase.h unicase.h-t unicase/special-casing-table.h-t unicase/special-casing.h unicase/special-casing.h-t unictype.h unictype.h-t uninorm.h uninorm.h-t unistd.h unistd.h-t unistr.h unistr.h-t unitypes.h unitypes.h-t uniwidth.h uniwidth.h-t utime.h utime.h-t wchar.h wchar.h-t wctype.h wctype.h-t
  19. rmdir arpa
  20. rmdir sys
  21. make[2]: Leaving directory `/svr-setup/wget-1.20/lib'
  22. make[1]: Leaving directory `/svr-setup/wget-1.20/lib'
  23. Making clean in src
  24. make[1]: Entering directory `/svr-setup/wget-1.20/src'
  25. test -z "wget" || rm -f wget
  26. test -z "libunittest.a" || rm -f libunittest.a
  27. test -z "*~ *.bak core core.[0-9]* build_info.c version.c" || rm -f *~ *.bak core core.[0-9]* build_info.c version.c
  28. rm -f *.o
  29. make[1]: Leaving directory `/svr-setup/wget-1.20/src'
  30. Making clean in doc
  31. make[1]: Entering directory `/svr-setup/wget-1.20/doc'
  32. test -z "wget.dvi wget.pdf wget.ps wget.html" \
  33. || rm -rf wget.dvi wget.pdf wget.ps wget.html
  34. test -z "*~ *.bak *.cat *.pod" || rm -f *~ *.bak *.cat *.pod
  35. rm -rf wget.t2d wget.t2p
  36. rm -f vti.tmp* ./version.texi.tmp*
  37. make[1]: Leaving directory `/svr-setup/wget-1.20/doc'
  38. Making clean in po
  39. make[1]: Entering directory `/svr-setup/wget-1.20/po'
  40. rm -f *.insert-header
  41. rm -f remove-potcdate.sed
  42. rm -f stamp-poT
  43. rm -f core core.* wget.po wget.1po wget.2po *.new.po
  44. rm -fr *.o
  45. make[1]: Leaving directory `/svr-setup/wget-1.20/po'
  46. Making clean in util
  47. make[1]: Entering directory `/svr-setup/wget-1.20/util'
  48. make[1]: Nothing to be done for `clean'.
  49. make[1]: Leaving directory `/svr-setup/wget-1.20/util'
  50. Making clean in fuzz
  51. make[1]: Entering directory `/svr-setup/wget-1.20/fuzz'
  52. test -z "" || rm -f
  53. test -z "wget_css_fuzzer wget_cookie_fuzzer wget_ftpls_fuzzer wget_html_fuzzer wget_netrc_fuzzer wget_options_fuzzer wget_robots_fuzzer wget_url_fuzzer" || rm -f wget_css_fuzzer wget_cookie_fuzzer wget_ftpls_fuzzer wget_html_fuzzer wget_netrc_fuzzer wget_options_fuzzer wget_robots_fuzzer wget_url_fuzzer
  54. rm -rf *.gc?? *.log lcov
  55. rm -f *.o
  56. test -z "wget_css_fuzzer.log wget_cookie_fuzzer.log wget_ftpls_fuzzer.log wget_html_fuzzer.log wget_netrc_fuzzer.log wget_options_fuzzer.log wget_robots_fuzzer.log wget_url_fuzzer.log" || rm -f wget_css_fuzzer.log wget_cookie_fuzzer.log wget_ftpls_fuzzer.log wget_html_fuzzer.log wget_netrc_fuzzer.log wget_options_fuzzer.log wget_robots_fuzzer.log wget_url_fuzzer.log
  57. test -z "wget_css_fuzzer.trs wget_cookie_fuzzer.trs wget_ftpls_fuzzer.trs wget_html_fuzzer.trs wget_netrc_fuzzer.trs wget_options_fuzzer.trs wget_robots_fuzzer.trs wget_url_fuzzer.trs" || rm -f wget_css_fuzzer.trs wget_cookie_fuzzer.trs wget_ftpls_fuzzer.trs wget_html_fuzzer.trs wget_netrc_fuzzer.trs wget_options_fuzzer.trs wget_robots_fuzzer.trs wget_url_fuzzer.trs
  58. test -z "test-suite.log" || rm -f test-suite.log
  59. make[1]: Leaving directory `/svr-setup/wget-1.20/fuzz'
  60. Making clean in tests
  61. make[1]: Entering directory `/svr-setup/wget-1.20/tests'
  62. test -z "unit-tests" || rm -f unit-tests
  63. test -z "*~ *.bak core core.[0-9]*" || rm -f *~ *.bak core core.[0-9]*
  64. rm -f *.o
  65. test -z "./unit-tests.log Test-auth-basic.log Test-auth-no-challenge.log Test-auth-no-challenge-url.log Test-auth-with-content-disposition.log Test-auth-retcode.log Test-c-full.log Test-c-partial.log Test-c.log Test-c-shorter.log Test-cookies.log Test-cookies-401.log Test-E-k-K.log Test-E-k.log Test-ftp.log Test-ftp-pasv-fail.log Test-ftp-bad-list.log Test-ftp-recursive.log Test-ftp-iri.log Test-ftp-iri-fallback.log Test-ftp-iri-recursive.log Test-ftp-iri-disabled.log Test-ftp-list-Multinet.log Test-ftp-list-Unknown.log Test-ftp-list-Unknown-a.log Test-ftp-list-Unknown-hidden.log Test-ftp-list-Unknown-list-a-fails.log Test-ftp-list-UNIX-hidden.log Test-ftp--start-pos.log Test-HTTP-Content-Disposition-1.log Test-HTTP-Content-Disposition-2.log Test-HTTP-Content-Disposition.log Test-i-ftp.log Test-i-http.log Test-idn-headers.log Test-idn-meta.log Test-idn-cmd.log Test-idn-cmd-utf8.log Test-idn-robots.log Test-idn-robots-utf8.log Test-iri.log Test-iri-percent.log Test-iri-disabled.log Test-iri-forced-remote.log Test-iri-list.log Test-k.log Test-meta-robots.log Test-N-current.log Test-N-HTTP-Content-Disposition.log Test-N--no-content-disposition.log Test-N--no-content-disposition-trivial.log Test-N-no-info.log Test--no-content-disposition.log Test--no-content-disposition-trivial.log Test-N-old.log Test-nonexisting-quiet.log Test-noop.log Test-np.log Test-N.log Test-N-smaller.log Test-O-HTTP-Content-Disposition.log Test-O-nc.log Test-O--no-content-disposition.log Test-O--no-content-disposition-trivial.log Test-O-nonexisting.log Test-O.log Test--post-file.log Test-proxied-https-auth.log Test-proxied-https-auth-keepalive.log Test-proxy-auth-basic.log Test-restrict-ascii.log Test-Restrict-Lowercase.log Test-Restrict-Uppercase.log Test-stdouterr.log Test--spider-fail.log Test--spider.log Test--spider-r-HTTP-Content-Disposition.log Test--spider-r--no-content-disposition.log Test--spider-r--no-content-disposition-trivial.log Test--spider-r.log Test--start-pos.log Test--start-pos--continue.log Test--httpsonly-r.log Test-204.log Test-ftp-pasv-not-supported.log Test-https-pfs.log Test-https-tlsv1.log Test-https-tlsv1x.log Test-https-selfsigned.log Test-https-weboftrust.log Test-https-clientcert.log Test-https-crl.log Test-https-badcerts.log" || rm -f ./unit-tests.log Test-auth-basic.log Test-auth-no-challenge.log Test-auth-no-challenge-url.log Test-auth-with-content-disposition.log Test-auth-retcode.log Test-c-full.log Test-c-partial.log Test-c.log Test-c-shorter.log Test-cookies.log Test-cookies-401.log Test-E-k-K.log Test-E-k.log Test-ftp.log Test-ftp-pasv-fail.log Test-ftp-bad-list.log Test-ftp-recursive.log Test-ftp-iri.log Test-ftp-iri-fallback.log Test-ftp-iri-recursive.log Test-ftp-iri-disabled.log Test-ftp-list-Multinet.log Test-ftp-list-Unknown.log Test-ftp-list-Unknown-a.log Test-ftp-list-Unknown-hidden.log Test-ftp-list-Unknown-list-a-fails.log Test-ftp-list-UNIX-hidden.log Test-ftp--start-pos.log Test-HTTP-Content-Disposition-1.log Test-HTTP-Content-Disposition-2.log Test-HTTP-Content-Disposition.log Test-i-ftp.log Test-i-http.log Test-idn-headers.log Test-idn-meta.log Test-idn-cmd.log Test-idn-cmd-utf8.log Test-idn-robots.log Test-idn-robots-utf8.log Test-iri.log Test-iri-percent.log Test-iri-disabled.log Test-iri-forced-remote.log Test-iri-list.log Test-k.log Test-meta-robots.log Test-N-current.log Test-N-HTTP-Content-Disposition.log Test-N--no-content-disposition.log Test-N--no-content-disposition-trivial.log Test-N-no-info.log Test--no-content-disposition.log Test--no-content-disposition-trivial.log Test-N-old.log Test-nonexisting-quiet.log Test-noop.log Test-np.log Test-N.log Test-N-smaller.log Test-O-HTTP-Content-Disposition.log Test-O-nc.log Test-O--no-content-disposition.log Test-O--no-content-disposition-trivial.log Test-O-nonexisting.log Test-O.log Test--post-file.log Test-proxied-https-auth.log Test-proxied-https-auth-keepalive.log Test-proxy-auth-basic.log Test-restrict-ascii.log Test-Restrict-Lowercase.log Test-Restrict-Uppercase.log Test-stdouterr.log Test--spider-fail.log Test--spider.log Test--spider-r-HTTP-Content-Disposition.log Test--spider-r--no-content-disposition.log Test--spider-r--no-content-disposition-trivial.log Test--spider-r.log Test--start-pos.log Test--start-pos--continue.log Test--httpsonly-r.log Test-204.log Test-ftp-pasv-not-supported.log Test-https-pfs.log Test-https-tlsv1.log Test-https-tlsv1x.log Test-https-selfsigned.log Test-https-weboftrust.log Test-https-clientcert.log Test-https-crl.log Test-https-badcerts.log
  66. test -z "./unit-tests.trs Test-auth-basic.trs Test-auth-no-challenge.trs Test-auth-no-challenge-url.trs Test-auth-with-content-disposition.trs Test-auth-retcode.trs Test-c-full.trs Test-c-partial.trs Test-c.trs Test-c-shorter.trs Test-cookies.trs Test-cookies-401.trs Test-E-k-K.trs Test-E-k.trs Test-ftp.trs Test-ftp-pasv-fail.trs Test-ftp-bad-list.trs Test-ftp-recursive.trs Test-ftp-iri.trs Test-ftp-iri-fallback.trs Test-ftp-iri-recursive.trs Test-ftp-iri-disabled.trs Test-ftp-list-Multinet.trs Test-ftp-list-Unknown.trs Test-ftp-list-Unknown-a.trs Test-ftp-list-Unknown-hidden.trs Test-ftp-list-Unknown-list-a-fails.trs Test-ftp-list-UNIX-hidden.trs Test-ftp--start-pos.trs Test-HTTP-Content-Disposition-1.trs Test-HTTP-Content-Disposition-2.trs Test-HTTP-Content-Disposition.trs Test-i-ftp.trs Test-i-http.trs Test-idn-headers.trs Test-idn-meta.trs Test-idn-cmd.trs Test-idn-cmd-utf8.trs Test-idn-robots.trs Test-idn-robots-utf8.trs Test-iri.trs Test-iri-percent.trs Test-iri-disabled.trs Test-iri-forced-remote.trs Test-iri-list.trs Test-k.trs Test-meta-robots.trs Test-N-current.trs Test-N-HTTP-Content-Disposition.trs Test-N--no-content-disposition.trs Test-N--no-content-disposition-trivial.trs Test-N-no-info.trs Test--no-content-disposition.trs Test--no-content-disposition-trivial.trs Test-N-old.trs Test-nonexisting-quiet.trs Test-noop.trs Test-np.trs Test-N.trs Test-N-smaller.trs Test-O-HTTP-Content-Disposition.trs Test-O-nc.trs Test-O--no-content-disposition.trs Test-O--no-content-disposition-trivial.trs Test-O-nonexisting.trs Test-O.trs Test--post-file.trs Test-proxied-https-auth.trs Test-proxied-https-auth-keepalive.trs Test-proxy-auth-basic.trs Test-restrict-ascii.trs Test-Restrict-Lowercase.trs Test-Restrict-Uppercase.trs Test-stdouterr.trs Test--spider-fail.trs Test--spider.trs Test--spider-r-HTTP-Content-Disposition.trs Test--spider-r--no-content-disposition.trs Test--spider-r--no-content-disposition-trivial.trs Test--spider-r.trs Test--start-pos.trs Test--start-pos--continue.trs Test--httpsonly-r.trs Test-204.trs Test-ftp-pasv-not-supported.trs Test-https-pfs.trs Test-https-tlsv1.trs Test-https-tlsv1x.trs Test-https-selfsigned.trs Test-https-weboftrust.trs Test-https-clientcert.trs Test-https-crl.trs Test-https-badcerts.trs" || rm -f ./unit-tests.trs Test-auth-basic.trs Test-auth-no-challenge.trs Test-auth-no-challenge-url.trs Test-auth-with-content-disposition.trs Test-auth-retcode.trs Test-c-full.trs Test-c-partial.trs Test-c.trs Test-c-shorter.trs Test-cookies.trs Test-cookies-401.trs Test-E-k-K.trs Test-E-k.trs Test-ftp.trs Test-ftp-pasv-fail.trs Test-ftp-bad-list.trs Test-ftp-recursive.trs Test-ftp-iri.trs Test-ftp-iri-fallback.trs Test-ftp-iri-recursive.trs Test-ftp-iri-disabled.trs Test-ftp-list-Multinet.trs Test-ftp-list-Unknown.trs Test-ftp-list-Unknown-a.trs Test-ftp-list-Unknown-hidden.trs Test-ftp-list-Unknown-list-a-fails.trs Test-ftp-list-UNIX-hidden.trs Test-ftp--start-pos.trs Test-HTTP-Content-Disposition-1.trs Test-HTTP-Content-Disposition-2.trs Test-HTTP-Content-Disposition.trs Test-i-ftp.trs Test-i-http.trs Test-idn-headers.trs Test-idn-meta.trs Test-idn-cmd.trs Test-idn-cmd-utf8.trs Test-idn-robots.trs Test-idn-robots-utf8.trs Test-iri.trs Test-iri-percent.trs Test-iri-disabled.trs Test-iri-forced-remote.trs Test-iri-list.trs Test-k.trs Test-meta-robots.trs Test-N-current.trs Test-N-HTTP-Content-Disposition.trs Test-N--no-content-disposition.trs Test-N--no-content-disposition-trivial.trs Test-N-no-info.trs Test--no-content-disposition.trs Test--no-content-disposition-trivial.trs Test-N-old.trs Test-nonexisting-quiet.trs Test-noop.trs Test-np.trs Test-N.trs Test-N-smaller.trs Test-O-HTTP-Content-Disposition.trs Test-O-nc.trs Test-O--no-content-disposition.trs Test-O--no-content-disposition-trivial.trs Test-O-nonexisting.trs Test-O.trs Test--post-file.trs Test-proxied-https-auth.trs Test-proxied-https-auth-keepalive.trs Test-proxy-auth-basic.trs Test-restrict-ascii.trs Test-Restrict-Lowercase.trs Test-Restrict-Uppercase.trs Test-stdouterr.trs Test--spider-fail.trs Test--spider.trs Test--spider-r-HTTP-Content-Disposition.trs Test--spider-r--no-content-disposition.trs Test--spider-r--no-content-disposition-trivial.trs Test--spider-r.trs Test--start-pos.trs Test--start-pos--continue.trs Test--httpsonly-r.trs Test-204.trs Test-ftp-pasv-not-supported.trs Test-https-pfs.trs Test-https-tlsv1.trs Test-https-tlsv1x.trs Test-https-selfsigned.trs Test-https-weboftrust.trs Test-https-clientcert.trs Test-https-crl.trs Test-https-badcerts.trs
  67. test -z "test-suite.log" || rm -f test-suite.log
  68. make[1]: Leaving directory `/svr-setup/wget-1.20/tests'
  69. Making clean in testenv
  70. make[1]: Entering directory `/svr-setup/wget-1.20/testenv'
  71. test -z "" || rm -f
  72. test -z "" || rm -f
  73. test -z "test-suite.log" || rm -f test-suite.log
  74. make[1]: Leaving directory `/svr-setup/wget-1.20/testenv'
  75. make[1]: Entering directory `/svr-setup/wget-1.20'
  76. rm -f install-info
  77. make[1]: Leaving directory `/svr-setup/wget-1.20'
  78. configure: configuring for GNU Wget 1.20
  79. checking for a BSD-compatible install... /bin/install -c
  80. checking whether build environment is sane... yes
  81. checking for a thread-safe mkdir -p... /bin/mkdir -p
  82. checking for gawk... gawk
  83. checking whether make sets $(MAKE)... yes
  84. checking whether make supports nested variables... yes
  85. checking build system type... x86_64-pc-linux-gnu
  86. checking host system type... x86_64-pc-linux-gnu
  87. checking whether make supports nested variables... (cached) yes
  88. checking for gcc... ccache gcc
  89. checking whether the C compiler works... yes
  90. checking for C compiler default output file name... a.out
  91. checking for suffix of executables...
  92. checking whether we are cross compiling... no
  93. checking for suffix of object files... o
  94. checking whether we are using the GNU C compiler... yes
  95. checking whether ccache gcc accepts -g... yes
  96. checking for ccache gcc option to enable C11 features... -std=gnu11
  97. checking whether make supports the include directive... yes (GNU style)
  98. checking dependency style of ccache gcc -std=gnu11... gcc3
  99. checking how to run the C preprocessor... ccache gcc -std=gnu11 -E
  100. checking for grep that handles long lines and -e... /bin/grep
  101. checking for egrep... /bin/grep -E
  102. checking for ANSI C header files... yes
  103. checking for sys/types.h... yes
  104. checking for sys/stat.h... yes
  105. checking for stdlib.h... yes
  106. checking for string.h... yes
  107. checking for memory.h... yes
  108. checking for strings.h... yes
  109. checking for inttypes.h... yes
  110. checking for stdint.h... yes
  111. checking for unistd.h... yes
  112. checking minix/config.h usability... no
  113. checking minix/config.h presence... no
  114. checking for minix/config.h... no
  115. checking whether it is safe to define __EXTENSIONS__... yes
  116. checking whether _XOPEN_SOURCE should be defined... no
  117. checking for Minix Amsterdam compiler... no
  118. checking for ar... ar
  119. checking for ranlib... ranlib
  120. checking for _LARGEFILE_SOURCE value needed for large files... no
  121. checking for special C compiler options needed for large files... no
  122. checking for _FILE_OFFSET_BITS value needed for large files... no
  123. checking for a Python interpreter with version >= 3.0... none
  124. checking whether NLS is requested... yes
  125. checking for msgfmt... /bin/msgfmt
  126. checking for gmsgfmt... /bin/msgfmt
  127. checking for xgettext... /bin/xgettext
  128. checking for msgmerge... /bin/msgmerge
  129. checking for ld used by ccache gcc -std=gnu11... /bin/ld
  130. checking if the linker (/bin/ld) is GNU ld... yes
  131. checking for shared library run path origin... done
  132. checking 32-bit host C ABI... no
  133. checking for the common suffixes of directories in the library search path... lib64,lib64
  134. checking for CFPreferencesCopyAppValue... no
  135. checking for CFLocaleCopyCurrent... no
  136. checking for GNU gettext in libc... yes
  137. checking whether to use NLS... yes
  138. checking where the gettext function comes from... libc
  139. checking for ranlib... (cached) ranlib
  140. checking for flex... flex
  141. checking lex output file root... lex.yy
  142. checking lex library... none needed
  143. checking whether yytext is a pointer... no
  144. checking for an ANSI C-conforming const... yes
  145. checking for inline... inline
  146. checking for working volatile... yes
  147. checking for ANSI C header files... (cached) yes
  148. checking for special C compiler options needed for large files... (cached) no
  149. checking for _FILE_OFFSET_BITS value needed for large files... (cached) no
  150. checking size of off_t... 8
  151. checking for stdbool.h that conforms to C99... yes
  152. checking for _Bool... yes
  153. checking for unistd.h... (cached) yes
  154. checking sys/time.h usability... yes
  155. checking sys/time.h presence... yes
  156. checking for sys/time.h... yes
  157. checking termios.h usability... yes
  158. checking termios.h presence... yes
  159. checking for termios.h... yes
  160. checking sys/ioctl.h usability... yes
  161. checking sys/ioctl.h presence... yes
  162. checking for sys/ioctl.h... yes
  163. checking sys/select.h usability... yes
  164. checking sys/select.h presence... yes
  165. checking for sys/select.h... yes
  166. checking utime.h usability... yes
  167. checking utime.h presence... yes
  168. checking for utime.h... yes
  169. checking sys/utime.h usability... no
  170. checking sys/utime.h presence... no
  171. checking for sys/utime.h... no
  172. checking for stdint.h... (cached) yes
  173. checking for inttypes.h... (cached) yes
  174. checking pwd.h usability... yes
  175. checking pwd.h presence... yes
  176. checking for pwd.h... yes
  177. checking wchar.h usability... yes
  178. checking wchar.h presence... yes
  179. checking for wchar.h... yes
  180. checking dlfcn.h usability... yes
  181. checking dlfcn.h presence... yes
  182. checking for dlfcn.h... yes
  183. checking whether h_errno is declared... yes
  184. checking size of short... 2
  185. checking size of int... 4
  186. checking size of long... 8
  187. checking size of long long... 8
  188. checking size of void *... 8
  189. checking for size_t... yes
  190. checking for pid_t... yes
  191. checking for uint32_t... yes
  192. checking for uintptr_t... yes
  193. checking for intptr_t... yes
  194. checking for int64_t... yes
  195. checking for sig_atomic_t... yes
  196. checking for sys/socket.h... yes
  197. checking for arpa/inet.h... yes
  198. checking for features.h... yes
  199. checking for unistd.h... (cached) yes
  200. checking for fnmatch.h... yes
  201. checking for wctype.h... yes
  202. checking for sys/stat.h... (cached) yes
  203. checking for netdb.h... yes
  204. checking for netinet/in.h... yes
  205. checking for getopt.h... yes
  206. checking for sys/cdefs.h... yes
  207. checking for stdio_ext.h... yes
  208. checking for termios.h... (cached) yes
  209. checking for sys/time.h... (cached) yes
  210. checking for iconv.h... yes
  211. checking for limits.h... yes
  212. checking for wchar.h... (cached) yes
  213. checking for stdint.h... (cached) yes
  214. checking for inttypes.h... (cached) yes
  215. checking for crtdefs.h... no
  216. checking for langinfo.h... yes
  217. checking for xlocale.h... yes
  218. checking for sys/mman.h... yes
  219. checking for sys/select.h... (cached) yes
  220. checking for sys/param.h... yes
  221. checking for malloc.h... yes
  222. checking for spawn.h... yes
  223. checking for strings.h... (cached) yes
  224. checking for sys/file.h... yes
  225. checking for sys/ioctl.h... (cached) yes
  226. checking for sys/uio.h... yes
  227. checking for sys/wait.h... yes
  228. checking for utime.h... (cached) yes
  229. checking for stdlib.h... (cached) yes
  230. checking whether the preprocessor supports include_next... yes
  231. checking whether system header files limit the line length... no
  232. checking whether <sys/socket.h> is self-contained... yes
  233. checking for shutdown... yes
  234. checking whether <sys/socket.h> defines the SHUT_* macros... yes
  235. checking for struct sockaddr_storage... yes
  236. checking for sa_family_t... yes
  237. checking for struct sockaddr_storage.ss_family... yes
  238. checking for working alloca.h... yes
  239. checking for alloca... yes
  240. checking for C/C++ restrict keyword... __restrict
  241. checking whether <wchar.h> uses 'inline' correctly... yes
  242. checking for btowc... yes
  243. checking for _set_invalid_parameter_handler... no
  244. checking for fcntl... yes
  245. checking for symlink... yes
  246. checking for flock... yes
  247. checking for fnmatch... yes
  248. checking for isblank... yes
  249. checking for iswctype... yes
  250. checking for mbsrtowcs... yes
  251. checking for mempcpy... yes
  252. checking for wmemchr... yes
  253. checking for wmemcpy... yes
  254. checking for wmempcpy... yes
  255. checking for fpurge... no
  256. checking for __fpurge... yes
  257. checking for __freading... yes
  258. checking for futimens... yes
  259. checking for getdelim... yes
  260. checking for getdtablesize... yes
  261. checking for getpass... yes
  262. checking for __fsetlocking... yes
  263. checking for getprogname... no
  264. checking for getexecname... no
  265. checking for gettimeofday... yes
  266. checking for iswcntrl... yes
  267. checking for iswblank... yes
  268. checking for link... yes
  269. checking for lstat... yes
  270. checking for mbsinit... yes
  271. checking for mbrtowc... yes
  272. checking for mprotect... yes
  273. checking for mkostemp... yes
  274. checking for mkstemp... yes
  275. checking for tzset... yes
  276. checking for nl_langinfo... yes
  277. checking for pipe... yes
  278. checking for pipe2... yes
  279. checking for secure_getenv... yes
  280. checking for getuid... yes
  281. checking for geteuid... yes
  282. checking for getgid... yes
  283. checking for getegid... yes
  284. checking for sigaction... yes
  285. checking for sigaltstack... yes
  286. checking for siginterrupt... yes
  287. checking for snprintf... yes
  288. checking for strdup... yes
  289. checking for strerror_r... yes
  290. checking for __xpg_strerror_r... yes
  291. checking for catgets... yes
  292. checking for strndup... yes
  293. checking for strptime... yes
  294. checking for localtime_r... yes
  295. checking for timegm... yes
  296. checking for utime... yes
  297. checking for futimes... yes
  298. checking for futimesat... yes
  299. checking for utimensat... yes
  300. checking for lutimes... yes
  301. checking for vasnprintf... no
  302. checking for wcrtomb... yes
  303. checking for wcwidth... yes
  304. checking for nl_langinfo and CODESET... yes
  305. checking for a traditional french locale... fr_FR
  306. checking whether linux/if_alg.h has struct sockaddr_alg.... yes
  307. checking whether byte ordering is bigendian... no
  308. checking whether // is distinct from /... no
  309. checking if environ is properly declared... yes
  310. checking for complete errno.h... yes
  311. checking whether strerror_r is declared... yes
  312. checking for strerror_r... (cached) yes
  313. checking whether strerror_r returns char *... yes
  314. checking for sig_atomic_t... (cached) yes
  315. checking for working fcntl.h... yes
  316. checking for mode_t... yes
  317. checking for mbstate_t... yes
  318. checking whether stdin defaults to large file offsets... yes
  319. checking whether fseeko is declared... yes
  320. checking for fseeko... yes
  321. checking whether fflush works on input streams... no
  322. checking whether stat file-mode macros are broken... no
  323. checking for nlink_t... yes
  324. checking whether ftello is declared... yes
  325. checking for ftello... yes
  326. checking whether ftello works... yes
  327. checking for library containing gethostbyname... none required
  328. checking for gethostbyname... yes
  329. checking for library containing getservbyname... none required
  330. checking for getservbyname... yes
  331. checking for library containing inet_ntop... none required
  332. checking whether inet_ntop is declared... yes
  333. checking for IPv4 sockets... yes
  334. checking for IPv6 sockets... yes
  335. checking whether getdelim is declared... yes
  336. checking whether getdtablesize is declared... yes
  337. checking for uid_t in sys/types.h... yes
  338. checking type of array argument to getgroups... gid_t
  339. checking whether getline is declared... yes
  340. checking for getopt.h... (cached) yes
  341. checking for getopt_long_only... yes
  342. checking whether getopt is POSIX compatible... yes
  343. checking for working GNU getopt function... yes
  344. checking for working GNU getopt_long function... yes
  345. checking whether fflush_unlocked is declared... yes
  346. checking whether flockfile is declared... yes
  347. checking whether fputs_unlocked is declared... yes
  348. checking whether funlockfile is declared... yes
  349. checking whether putc_unlocked is declared... yes
  350. checking for struct timeval... yes
  351. checking for wide-enough struct timeval.tv_sec member... yes
  352. checking for iconv... yes
  353. checking for working iconv... yes
  354. checking for iconv declaration...
  355.         extern size_t iconv (iconv_t cd, char * *inbuf, size_t *inbytesleft, char * *outbuf, size_t *outbytesleft);
  356. checking whether limits.h has LLONG_MAX, WORD_BIT, ULLONG_WIDTH etc.... no
  357. checking for wint_t... yes
  358. checking whether wint_t is too small... no
  359. checking for unsigned long long int... yes
  360. checking for long long int... yes
  361. checking whether stdint.h conforms to C99... no
  362. checking sys/inttypes.h usability... no
  363. checking sys/inttypes.h presence... no
  364. checking for sys/inttypes.h... no
  365. checking sys/bitypes.h usability... yes
  366. checking sys/bitypes.h presence... yes
  367. checking for sys/bitypes.h... yes
  368. checking for bit size of ptrdiff_t... 64
  369. checking for bit size of size_t... 64
  370. checking for bit size of sig_atomic_t... 32
  371. checking for bit size of wchar_t... 32
  372. checking for bit size of wint_t... 32
  373. checking whether sig_atomic_t is signed... yes
  374. checking whether wchar_t is signed... yes
  375. checking whether wint_t is signed... no
  376. checking for ptrdiff_t integer literal suffix... l
  377. checking for size_t integer literal suffix... ul
  378. checking for sig_atomic_t integer literal suffix...
  379. checking for wchar_t integer literal suffix...
  380. checking for wint_t integer literal suffix... u
  381. checking for inttypes.h... (cached) yes
  382. checking whether the inttypes.h PRIxNN macros are broken... no
  383. checking whether iswcntrl works... yes
  384. checking for towlower... yes
  385. checking for wctype_t... yes
  386. checking for wctrans_t... yes
  387. checking whether included libunistring is requested... no
  388. checking for libunistring... no, consider installing GNU libunistring
  389. checking for wchar_t... yes
  390. checking for good max_align_t... yes
  391. checking whether NULL can be used in arbitrary expressions... yes
  392. checking whether imported symbols can be declared weak... yes
  393. checking whether the linker supports --as-needed... yes
  394. checking whether the linker supports --push-state... yes
  395. checking pthread.h usability... yes
  396. checking pthread.h presence... yes
  397. checking for pthread.h... yes
  398. checking for multithread API to use... posix
  399. checking whether lstat correctly handles trailing slash... yes
  400. checking for a sed that does not truncate output... /bin/sed
  401. checking whether malloc, realloc, calloc are POSIX compliant... yes
  402. checking for stdlib.h... (cached) yes
  403. checking for GNU libc compatible malloc... yes
  404. checking for a traditional japanese locale... ja_JP
  405. checking for a transitional chinese locale... zh_CN.GB18030
  406. checking for a french Unicode locale... fr_FR.UTF-8
  407. checking for mmap... yes
  408. checking for MAP_ANONYMOUS... yes
  409. checking whether memchr works... yes
  410. checking whether memrchr is declared... yes
  411. checking whether <limits.h> defines MIN and MAX... no
  412. checking whether <sys/param.h> defines MIN and MAX... yes
  413. checking whether time_t is signed... yes
  414. checking whether alarm is declared... yes
  415. checking for working mktime... yes
  416. checking whether <sys/select.h> is self-contained... yes
  417. checking for library containing setsockopt... none needed
  418. checking whether select supports a 0 argument... yes
  419. checking whether select detects invalid fds... yes
  420. checking for O_CLOEXEC... yes
  421. checking for promoted mode_t type... mode_t
  422. checking for library containing posix_spawn... none required
  423. checking for posix_spawn... yes
  424. checking whether posix_spawn works... yes
  425. checking whether posix_spawnattr_setschedpolicy is supported... yes
  426. checking whether posix_spawnattr_setschedparam is supported... yes
  427. checking for sigset_t... yes
  428. checking for SIGPIPE... yes
  429. checking whether we are using the GNU C Library >= 2.1 or uClibc... yes
  430. checking whether C symbols are prefixed with underscore at the linker level... no
  431. checking whether snprintf returns a byte count as in C99... yes
  432. checking whether snprintf is declared... yes
  433. checking whether strdup is declared... yes
  434. checking whether strerror(0) succeeds... yes
  435. checking for strerror_r with POSIX signature... no
  436. checking whether __xpg_strerror_r works... yes
  437. checking whether strerror_r is declared... (cached) yes
  438. checking whether strndup is declared... yes
  439. checking whether strnlen is declared... yes
  440. checking for struct tm.tm_gmtoff... yes
  441. checking whether strtok_r is declared... yes
  442. checking for struct timespec in <time.h>... yes
  443. checking whether clearerr_unlocked is declared... yes
  444. checking whether feof_unlocked is declared... yes
  445. checking whether ferror_unlocked is declared... yes
  446. checking whether fgets_unlocked is declared... yes
  447. checking whether fputc_unlocked is declared... yes
  448. checking whether fread_unlocked is declared... yes
  449. checking whether fwrite_unlocked is declared... yes
  450. checking whether getc_unlocked is declared... yes
  451. checking whether getchar_unlocked is declared... yes
  452. checking whether putchar_unlocked is declared... yes
  453. checking whether the utimes function works... yes
  454. checking for inttypes.h... yes
  455. checking for stdint.h... yes
  456. checking for intmax_t... yes
  457. checking where to find the exponent in a 'double'... word 1 bit 20
  458. checking for snprintf... (cached) yes
  459. checking for strnlen... yes
  460. checking for wcslen... yes
  461. checking for wcsnlen... yes
  462. checking for mbrtowc... (cached) yes
  463. checking for wcrtomb... (cached) yes
  464. checking whether _snprintf is declared... no
  465. checking whether vsnprintf is declared... yes
  466. checking for alloca as a compiler built-in... yes
  467. checking whether btowc(0) is correct... yes
  468. checking whether btowc(EOF) is correct... yes
  469. checking for __builtin_expect... yes
  470. checking byteswap.h usability... yes
  471. checking byteswap.h presence... yes
  472. checking for byteswap.h... yes
  473. checking for library containing clock_gettime... none required
  474. checking for clock_gettime... yes
  475. checking for clock_settime... yes
  476. checking whether // is distinct from /... (cached) no
  477. checking whether dup2 works... yes
  478. checking for error_at_line... yes
  479. checking whether fcntl handles F_DUPFD correctly... yes
  480. checking whether fcntl understands F_DUPFD_CLOEXEC... needs runtime check
  481. checking whether fflush works on input streams... (cached) no
  482. checking for flexible array member... yes
  483. checking whether conversion from 'int' to 'long double' works... yes
  484. checking for working POSIX fnmatch... yes
  485. checking whether fopen recognizes a trailing slash... yes
  486. checking whether fpurge is declared... no
  487. checking for fseeko... (cached) yes
  488. checking whether fflush works on input streams... (cached) no
  489. checking for _fseeki64... no
  490. checking for ftello... (cached) yes
  491. checking whether ftello works... (cached) yes
  492. checking whether futimens works... yes
  493. checking how to do getaddrinfo, freeaddrinfo and getnameinfo... checking for library containing getaddrinfo... none required
  494. checking for getaddrinfo... yes
  495. checking whether gai_strerror is declared... yes
  496. checking whether gai_strerrorA is declared... no
  497. checking for gai_strerror with POSIX signature... yes
  498. checking for struct sockaddr.sa_len... no
  499. checking whether getaddrinfo is declared... yes
  500. checking whether freeaddrinfo is declared... yes
  501. checking whether getnameinfo is declared... yes
  502. checking for struct addrinfo... yes
  503. checking for working getdelim function... yes
  504. checking whether getdtablesize works... yes
  505. checking for getgroups... yes
  506. checking for working getgroups... yes
  507. checking whether getgroups handles negative values... yes
  508. checking for getline... yes
  509. checking for working getline function... yes
  510. checking for getpass without length limitations... yes
  511. checking whether program_invocation_name is declared... yes
  512. checking whether program_invocation_short_name is declared... yes
  513. checking whether __argv is declared... no
  514. checking whether gettimeofday clobbers localtime buffer... no
  515. checking for gettimeofday with POSIX signature... almost
  516. checking for group_member... yes
  517. checking for library containing gethostbyname... (cached) none required
  518. checking for gethostbyname... (cached) yes
  519. checking for library containing inet_ntop... (cached) none required
  520. checking whether inet_ntop is declared... (cached) yes
  521. checking whether the compiler generally respects inline... yes
  522. checking whether INT32_MAX < INTMAX_MAX... yes
  523. checking whether INT64_MAX == LONG_MAX... yes
  524. checking whether UINT32_MAX < UINTMAX_MAX... yes
  525. checking whether UINT64_MAX == ULONG_MAX... yes
  526. checking for ioctl... yes
  527. checking for ioctl with POSIX signature... no
  528. checking whether iswblank is declared... yes
  529. checking whether langinfo.h defines CODESET... yes
  530. checking whether langinfo.h defines T_FMT_AMPM... yes
  531. checking whether langinfo.h defines ALTMON_1... no
  532. checking whether langinfo.h defines ERA... yes
  533. checking whether langinfo.h defines YESEXPR... yes
  534. checking whether the compiler supports the __inline keyword... yes
  535. checking whether to use the included libunistring... yes
  536. checking whether link obeys POSIX... yes
  537. checking whether locale.h conforms to POSIX:2001... yes
  538. checking whether locale.h defines locale_t... yes
  539. checking whether struct lconv is properly defined... yes
  540. checking for pthread_rwlock_t... yes
  541. checking whether pthread_rwlock_rdlock prefers a writer to a reader... no
  542. checking whether lseek detects pipes... yes
  543. checking whether mbrtowc handles incomplete characters... yes
  544. checking whether mbrtowc works as well as mbtowc... yes
  545. checking whether mbrtowc handles a NULL pwc argument... yes
  546. checking whether mbrtowc handles a NULL string argument... yes
  547. checking whether mbrtowc has a correct return value... yes
  548. checking whether mbrtowc returns 0 when parsing a NUL character... yes
  549. checking whether mbrtowc works on empty input... no
  550. checking whether the C locale is free of encoding errors... no
  551. checking whether mbrtowc handles incomplete characters... (cached) yes
  552. checking whether mbrtowc works as well as mbtowc... (cached) yes
  553. checking whether mbrtowc handles incomplete characters... (cached) yes
  554. checking whether mbrtowc works as well as mbtowc... (cached) yes
  555. checking whether mbsrtowcs works... yes
  556. checking for memrchr... yes
  557. checking whether mkdir handles trailing slash... yes
  558. checking whether mkdir handles trailing dot... yes
  559. checking for working mkstemp... yes
  560. checking for __mktime_internal... no
  561. checking for library containing nanosleep... none required
  562. checking for working nanosleep... no (mishandles large arguments)
  563. checking whether <netinet/in.h> is self-contained... yes
  564. checking whether YESEXPR works... yes
  565. checking whether open recognizes a trailing slash... yes
  566. checking whether posix_spawn_file_actions_addclose works... yes
  567. checking whether posix_spawn_file_actions_adddup2 works... yes
  568. checking whether posix_spawn_file_actions_addopen works... yes
  569. checking for raise... yes
  570. checking for sigprocmask... yes
  571. checking for rawmemchr... yes
  572. checking for working re_compile_pattern... yes
  573. checking whether select supports a 0 argument... (cached) yes
  574. checking whether select detects invalid fds... (cached) yes
  575. checking for library containing getservbyname... (cached) none required
  576. checking for getservbyname... (cached) yes
  577. checking for struct sigaction.sa_sigaction... yes
  578. checking for volatile sig_atomic_t... yes
  579. checking for sighandler_t... yes
  580. checking for sigprocmask... (cached) yes
  581. checking for stdint.h... (cached) yes
  582. checking for SIZE_MAX... yes
  583. checking for snprintf... (cached) yes
  584. checking whether snprintf respects a size of 1... yes
  585. checking whether printf supports POSIX/XSI format strings with positions... yes
  586. checking for socklen_t... yes
  587. checking for posix_spawnattr_t... yes
  588. checking for posix_spawn_file_actions_t... yes
  589. checking for ssize_t... yes
  590. checking whether stat handles trailing slashes on files... yes
  591. checking for struct stat.st_atim.tv_nsec... yes
  592. checking whether struct stat.st_atim is of type struct timespec... yes
  593. checking for struct stat.st_birthtimespec.tv_nsec... no
  594. checking for struct stat.st_birthtimensec... no
  595. checking for struct stat.st_birthtim.tv_nsec... no
  596. checking for working stdalign.h... yes
  597. checking for good max_align_t... (cached) yes
  598. checking whether NULL can be used in arbitrary expressions... (cached) yes
  599. checking which flavor of printf attribute matches inttypes macros... system
  600. checking for strcasecmp... yes
  601. checking for strncasecmp... yes
  602. checking whether strncasecmp is declared... yes
  603. checking for strchrnul... yes
  604. checking whether strchrnul works... yes
  605. checking for working strerror function... yes
  606. checking for working strndup... yes
  607. checking for working strnlen... yes
  608. checking for strpbrk... yes
  609. checking for strtok_r... yes
  610. checking whether strtok_r works... yes
  611. checking for strtol... yes
  612. checking for strtoll... yes
  613. checking whether symlink handles trailing slash correctly... yes
  614. checking whether <sys/ioctl.h> declares ioctl... yes
  615. checking for nlink_t... (cached) yes
  616. checking whether localtime_r is declared... yes
  617. checking whether localtime_r is compatible with its POSIX signature... yes
  618. checking whether unlink honors trailing slashes... yes
  619. checking whether unlink of a parent directory fails as it should... guessing yes
  620. checking for ptrdiff_t... yes
  621. checking for vasprintf... yes
  622. checking for vsnprintf... yes
  623. checking whether snprintf respects a size of 1... (cached) yes
  624. checking whether printf supports POSIX/XSI format strings with positions... (cached) yes
  625. checking for waitid... yes
  626. checking whether mbrtowc handles incomplete characters... (cached) yes
  627. checking whether mbrtowc works as well as mbtowc... (cached) yes
  628. checking whether wcrtomb return value is correct... yes
  629. checking whether iswcntrl works... (cached) yes
  630. checking for towlower... (cached) yes
  631. checking for wctype_t... (cached) yes
  632. checking for wctrans_t... (cached) yes
  633. checking whether wcwidth is declared... yes
  634. checking whether wcwidth works reasonably in UTF-8 locales... yes
  635. checking for stdint.h... (cached) yes
  636. checking for getpagesize... yes
  637. checking for working mmap... yes
  638. checking for _LARGEFILE_SOURCE value needed for large files... (cached) no
  639. checking for strptime... (cached) yes
  640. checking for timegm... (cached) yes
  641. checking for vsnprintf... (cached) yes
  642. checking for vasprintf... (cached) yes
  643. checking for drand48... yes
  644. checking for pathconf... yes
  645. checking for strtoll... (cached) yes
  646. checking for usleep... yes
  647. checking for ftello... yes
  648. checking for sigblock... yes
  649. checking for sigsetjmp... no
  650. checking for memrchr... (cached) yes
  651. checking for wcwidth... (cached) yes
  652. checking for mbtowc... yes
  653. checking for sleep... yes
  654. checking for symlink... (cached) yes
  655. checking for utime... (cached) yes
  656. checking for strlcpy... no
  657. checking for random... yes
  658. checking for fmemopen... yes
  659. checking for pkg-config... /bin/pkg-config
  660. checking pkg-config is at least version 0.9.0... yes
  661. checking for LIBPSL... no
  662. checking for library containing psl_builtin... no
  663. configure: WARNING: *** libpsl was not found. Fallback to builtin cookie checking.
  664. checking for ZLIB... yes
  665. checking for OPENSSL... yes
  666. configure: compiling in support for SSL via OpenSSL
  667. checking for RAND_egd... yes
  668. checking for INET6 protocol support... yes
  669. checking for struct sockaddr_in6... yes
  670. checking for struct sockaddr_storage... (cached) yes
  671. checking for struct sockaddr_in6.sin6_scope_id... yes
  672. configure: Enabling support for IPv6.
  673. checking for makeinfo... ${SHELL} /svr-setup/wget-1.20/build-aux/missing makeinfo
  674. checking for perl5... no
  675. checking for perl... /bin/perl
  676. checking for pod2man... /bin/pod2man
  677. checking for library containing idn2_lookup_u8... no
  678. configure: WARNING: *** LIBIDN2 was not found. You will not be able to use IDN2008 support
  679. checking uuid.h usability... no
  680. checking uuid.h presence... no
  681. checking for uuid.h... no
  682. checking uuid/uuid.h usability... yes
  683. checking uuid/uuid.h presence... yes
  684. checking for uuid/uuid.h... yes
  685. checking for library containing uuid_generate... -luuid
  686. checking for PCRE2... no
  687. checking pcre2.h usability... no
  688. checking pcre2.h presence... no
  689. checking for pcre2.h... no
  690. checking for PCRE... yes
  691. checking pcre.h usability... yes
  692. checking pcre.h presence... yes
  693. checking for pcre.h... yes
  694. checking for gpgme-config... no
  695. checking for METALINK... no
  696. checking for fsetxattr... yes
  697. checking that generated files are newer than configure... done
  698. configure: creating ./config.status
  699. config.status: creating Makefile
  700. config.status: creating src/Makefile
  701. config.status: creating doc/Makefile
  702. config.status: creating util/Makefile
  703. config.status: creating po/Makefile.in
  704. config.status: creating tests/Makefile
  705. config.status: creating fuzz/Makefile
  706. config.status: creating lib/Makefile
  707. config.status: creating testenv/Makefile
  708. config.status: creating tests/certs/interca.conf
  709. config.status: creating tests/certs/rootca.conf
  710. config.status: creating src/config.h
  711. config.status: src/config.h is unchanged
  712. config.status: executing depfiles commands
  713. config.status: executing po-directories commands
  714. config.status: creating po/POTFILES
  715. config.status: creating po/Makefile
  716. configure: Summary of build options:
  717.  
  718.  Version:           1.20
  719.  Host OS:           linux-gnu
  720.  Install prefix:    /usr/local
  721.  Compiler:          ccache gcc -std=gnu11
  722.  CFlags:            -I /usr/local/include   -DHAVE_LIBSSL   -DNDEBUG -O2 -g -pipe -Wall -Wp,-D_FORTIFY_SOURCE=2 -fexceptions -fstack-protector-strong --param=ssp-buffer-size=4 -grecord-gcc-switches -m64 -mtune=generic
  723.  LDFlags:          
  724.  Libs:              -L /usr/local/lib -lpcre -luuid -lssl -lcrypto   -lz  
  725.  SSL:               openssl
  726.  Zlib:              yes
  727.  PSL:               no
  728.  PCRE:              yes, via libpcre
  729.  Digest:            yes
  730.  NTLM:              yes
  731.  OPIE:              yes
  732.  POSIX xattr:       yes
  733.  Debugging:         yes
  734.  Assertions:        no
  735.  Valgrind:          Valgrind testing not enabled
  736.  Metalink:          no
  737.  Resolver:          libc, --bind-dns-address and --dns-servers not available
  738.  GPGME:             no
  739.  IRI:               no
  740.  Fuzzing build:     no,
  741.  
  742. make  all-recursive
  743. make[1]: Entering directory `/svr-setup/wget-1.20'
  744. Making all in lib
  745. make[2]: Entering directory `/svr-setup/wget-1.20/lib'
  746.  GEN      alloca.h
  747.  GEN      fcntl.h
  748.  GEN      inttypes.h
  749.  GEN      langinfo.h
  750.  GEN      arpa/inet.h
  751.  GEN      limits.h
  752.  GEN      locale.h
  753.  GEN      netdb.h
  754.  GEN      signal.h
  755.  GEN      spawn.h
  756.  GEN      stdint.h
  757.  GEN      stdio.h
  758.  GEN      stdlib.h
  759.  GEN      string.h
  760.  GEN      strings.h
  761.  GEN      sys/file.h
  762.  GEN      sys/select.h
  763.  GEN      sys/socket.h
  764.  GEN      sys/ioctl.h
  765.  GEN      sys/time.h
  766.  GEN      sys/stat.h
  767.  GEN      sys/types.h
  768.  GEN      sys/uio.h
  769.  GEN      time.h
  770.  GEN      unicase.h
  771.  GEN      sys/wait.h
  772.  GEN      unictype.h
  773.  GEN      uninorm.h
  774.  GEN      unicase/special-casing.h
  775.  GEN      unistd.h
  776.  GEN      unistr.h
  777.  GEN      unitypes.h
  778.  GEN      uniwidth.h
  779.  GEN      wchar.h
  780.  GEN      wctype.h
  781. make  all-recursive
  782. make[3]: Entering directory `/svr-setup/wget-1.20/lib'
  783. make[4]: Entering directory `/svr-setup/wget-1.20/lib'
  784.  CC       base32.o
  785.  CC       binary-io.o
  786.  CC       c-ctype.o
  787.  CC       c-strcasecmp.o
  788.  CC       c-strncasecmp.o
  789.  CC       c-strcasestr.o
  790.  CC       cloexec.o
  791.  CC       af_alg.o
  792.  CC       md4.o
  793.  CC       md2.o
  794.  CC       md5.o
  795.  CC       sha1.o
  796.  CC       sha256.o
  797.  CC       sha512.o
  798.  CC       dirname.o
  799.  CC       basename.o
  800.  CC       dirname-lgpl.o
  801.  CC       basename-lgpl.o
  802.  CC       stripslash.o
  803.  CC       exitfail.o
  804.  CC       fatal-signal.o
  805.  CC       fd-hook.o
  806.  CC       fd-safer-flag.o
  807.  CC       dup-safer-flag.o
  808.  CC       freading.o
  809.  CC       getprogname.o
  810.  CC       gettime.o
  811.  CC       hard-locale.o
  812.  CC       localcharset.o
  813.  CC       glthread/lock.o
  814.  CC       malloca.o
  815.  CC       mbchar.o
  816.  CC       mbiter.o
  817.  CC       pipe2.o
  818.  CC       pipe2-safer.o
  819.  CC       quotearg.o
  820.  CC       sig-handler.o
  821.  CC       sockets.o
  822.  CC       spawn-pipe.o
  823.  CC       stat-time.o
  824.  CC       strnlen1.o
  825.  CC       sys_socket.o
  826.  CC       tempname.o
  827.  CC       timespec.o
  828.  CC       glthread/threadlib.o
  829.  CC       tmpdir.o
  830.  CC       u64.o
  831.  CC       unicase/cased.o
  832.  CC       unicase/empty-prefix-context.o
  833.  CC       unicase/empty-suffix-context.o
  834.  CC       unicase/ignorable.o
  835.  CC       unicase/special-casing.o
  836.  CC       unicase/tolower.o
  837.  CC       unicase/u8-casemap.o
  838.  CC       unicase/u8-tolower.o
  839.  CC       unictype/combiningclass.o
  840.  CC       unictype/pr_soft_dotted.o
  841.  CC       uninorm/decompose-internal.o
  842.  CC       uninorm/u8-normalize.o
  843.  CC       unistd.o
  844.  CC       dup-safer.o
  845.  CC       pipe-safer.o
  846.  CC       fd-safer.o
  847.  CC       unistr/u8-cpy.o
  848.  CC       unistr/u8-mbtouc-unsafe.o
  849.  CC       unistr/u8-mbtouc-unsafe-aux.o
  850.  CC       unistr/u8-strlen.o
  851.  CC       unistr/u8-uctomb.o
  852.  CC       unistr/u8-uctomb-aux.o
  853.  CC       uniwidth/width.o
  854.  CC       utimens.o
  855.  CC       wait-process.o
  856.  CC       wctype-h.o
  857.  CC       xmalloc.o
  858.  CC       xalloc-die.o
  859.  CC       xsize.o
  860.  CC       xstrndup.o
  861.  CC       asnprintf.o
  862.  CC       fcntl.o
  863.  CC       fflush.o
  864.  CC       fpurge.o
  865.  CC       fseek.o
  866.  CC       fseeko.o
  867.  CC       ioctl.o
  868.  CC       localtime-buffer.o
  869.  CC       mbrtowc.o
  870.  CC       mktime.o
  871.  CC       nanosleep.o
  872.  CC       nl_langinfo.o
  873.  CC       printf-args.o
  874.  CC       printf-parse.o
  875.  CC       strerror_r.o
  876.  CC       vasnprintf.o
  877.  CC       xmemdup0.o
  878.  AR       libgnu.a
  879. make[4]: Leaving directory `/svr-setup/wget-1.20/lib'
  880. make[3]: Leaving directory `/svr-setup/wget-1.20/lib'
  881. make[2]: Leaving directory `/svr-setup/wget-1.20/lib'
  882. Making all in src
  883. make[2]: Entering directory `/svr-setup/wget-1.20/src'
  884. make  all-am
  885. make[3]: Entering directory `/svr-setup/wget-1.20/src'
  886. if test -n ""; then cp "./build_info.c.in" .; fi
  887. /bin/perl "../build-aux/build_info.pl" \
  888.     "../src/build_info.c"
  889.   CC       connect.o
  890.   CC       convert.o
  891.   CC       cookies.o
  892.   CC       ftp.o
  893. if test -n ""; then rm -f build_info.c.in; fi
  894.   CC       css_.o
  895.   CC       css-url.o
  896.   CC       ftp-basic.o
  897.   CC       ftp-ls.o
  898.   CC       hash.o
  899.   CC       host.o
  900.   CC       hsts.o
  901.   CC       html-parse.o
  902.   CC       html-url.o
  903.   CC       http.o
  904.   CC       init.o
  905.   CC       log.o
  906. hsts.c: In function 'hsts_store_save':
  907. hsts.c:577:21: warning: ignoring return value of 'ftruncate', declared with attribute warn_unused_result [-Wunused-result]
  908.            ftruncate (fd, 0);
  909.                      ^
  910.   CC       main.o
  911.   CC       netrc.o
  912.   CC       progress.o
  913.   CC       ptimer.o
  914.   CC       recur.o
  915.   CC       res.o
  916.   CC       retr.o
  917.   CC       spider.o
  918.   CC       url.o
  919.   CC       warc.o
  920.   CC       xattr.o
  921.   CC       utils.o
  922.   CC       exits.o
  923.   CC       build_info.o
  924. echo '/* version.c */' > version.c
  925. echo '/* Autogenerated by Makefile - DO NOT EDIT */' >> version.c
  926. echo '' >> version.c
  927.   CC       ftp-opie.o
  928. echo '#include "version.h"' >> version.c
  929.   CC       openssl.o
  930.   CC       http-ntlm.o
  931. echo 'const char *version_string = "1.20";' >> version.c
  932. echo 'const char *compilation_string = "'ccache gcc -std=gnu11 -DHAVE_CONFIG_H -DSYSTEM_WGETRC=\"/usr/local/etc/wgetrc\" -DLOCALEDIR=\"/usr/local/share/locale\" -I.  -I../lib -I../lib   -I /usr/local/include   -DHAVE_LIBSSL   -DNDEBUG -O2 -g -pipe -Wall -Wp,-D_FORTIFY_SOURCE=2 -fexceptions -fstack-protector-strong --param=ssp-buffer-size=4 -grecord-gcc-switches -m64 -mtune=generic'";' \
  933.     | sed -e 's/[\\"]/\\&/g' -e 's/\\"/"/' -e 's/\\";$/";/' >> version.c
  934. echo 'const char *link_string = "'ccache gcc -std=gnu11  -I /usr/local/include   -DHAVE_LIBSSL   -DNDEBUG -O2 -g -pipe -Wall -Wp,-D_FORTIFY_SOURCE=2 -fexceptions -fstack-protector-strong --param=ssp-buffer-size=4 -grecord-gcc-switches -m64 -mtune=generic \
  935.   -L /usr/local/lib -lpcre -luuid -lssl -lcrypto   -lz    ftp-opie.o openssl.o http-ntlm.o ../lib/libgnu.a              '";' \
  936.     | sed -e 's/[\\"]/\\&/g' -e 's/\\"/"/' -e 's/\\";$/";/' >> version.c
  937.   CC       version.o
  938.   CCLD     wget
  939. openssl.o: In function `init_prng':
  940. /svr-setup/wget-1.20/src/openssl.c:92: undefined reference to `RAND_egd'
  941. openssl.o: In function `ssl_init':
  942. /svr-setup/wget-1.20/src/openssl.c:207: undefined reference to `SSL_library_init'
  943. /svr-setup/wget-1.20/src/openssl.c:208: undefined reference to `SSL_load_error_strings'
  944. /svr-setup/wget-1.20/src/openssl.c:211: undefined reference to `OPENSSL_add_all_algorithms_noconf'
  945. /svr-setup/wget-1.20/src/openssl.c:212: undefined reference to `SSL_library_init'
  946. /svr-setup/wget-1.20/src/openssl.c:225: undefined reference to `SSLv3_client_method'
  947. /svr-setup/wget-1.20/src/openssl.c:231: undefined reference to `SSLv23_client_method'
  948. openssl.o: In function `ssl_connect_wget':
  949. /svr-setup/wget-1.20/src/openssl.c:650: undefined reference to `SSL_state'
  950. openssl.o: In function `ssl_check_certificate':
  951. /svr-setup/wget-1.20/src/openssl.c:918: undefined reference to `sk_num'
  952. /svr-setup/wget-1.20/src/openssl.c:922: undefined reference to `sk_value'
  953. /svr-setup/wget-1.20/src/openssl.c:963: undefined reference to `sk_pop_free'
  954. /svr-setup/wget-1.20/src/openssl.c:963: undefined reference to `sk_pop_free'
  955. /svr-setup/wget-1.20/src/openssl.c:963: undefined reference to `sk_pop_free'
  956. collect2: error: ld returned 1 exit status
  957. make[3]: *** [wget] Error 1
  958. make[3]: Leaving directory `/svr-setup/wget-1.20/src'
  959. make[2]: *** [all] Error 2
  960. make[2]: Leaving directory `/svr-setup/wget-1.20/src'
  961. make[1]: *** [all-recursive] Error 1
  962. make[1]: Leaving directory `/svr-setup/wget-1.20'
  963. make: *** [all] Error 2
  964. make  install-recursive
  965. make[1]: Entering directory `/svr-setup/wget-1.20'
  966. Making install in lib
  967. make[2]: Entering directory `/svr-setup/wget-1.20/lib'
  968. make  install-recursive
  969. make[3]: Entering directory `/svr-setup/wget-1.20/lib'
  970. make[4]: Entering directory `/svr-setup/wget-1.20/lib'
  971. make[5]: Entering directory `/svr-setup/wget-1.20/lib'
  972. make[5]: Nothing to be done for `install-exec-am'.
  973. make[5]: Nothing to be done for `install-data-am'.
  974. make[5]: Leaving directory `/svr-setup/wget-1.20/lib'
  975. make[4]: Leaving directory `/svr-setup/wget-1.20/lib'
  976. make[3]: Leaving directory `/svr-setup/wget-1.20/lib'
  977. make[2]: Leaving directory `/svr-setup/wget-1.20/lib'
  978. Making install in src
  979. make[2]: Entering directory `/svr-setup/wget-1.20/src'
  980.   CCLD     wget
  981. openssl.o: In function `init_prng':
  982. /svr-setup/wget-1.20/src/openssl.c:92: undefined reference to `RAND_egd'
  983. openssl.o: In function `ssl_init':
  984. /svr-setup/wget-1.20/src/openssl.c:207: undefined reference to `SSL_library_init'
  985. /svr-setup/wget-1.20/src/openssl.c:208: undefined reference to `SSL_load_error_strings'
  986. /svr-setup/wget-1.20/src/openssl.c:211: undefined reference to `OPENSSL_add_all_algorithms_noconf'
  987. /svr-setup/wget-1.20/src/openssl.c:212: undefined reference to `SSL_library_init'
  988. /svr-setup/wget-1.20/src/openssl.c:225: undefined reference to `SSLv3_client_method'
  989. /svr-setup/wget-1.20/src/openssl.c:231: undefined reference to `SSLv23_client_method'
  990. openssl.o: In function `ssl_connect_wget':
  991. /svr-setup/wget-1.20/src/openssl.c:650: undefined reference to `SSL_state'
  992. openssl.o: In function `ssl_check_certificate':
  993. /svr-setup/wget-1.20/src/openssl.c:918: undefined reference to `sk_num'
  994. /svr-setup/wget-1.20/src/openssl.c:922: undefined reference to `sk_value'
  995. /svr-setup/wget-1.20/src/openssl.c:963: undefined reference to `sk_pop_free'
  996. /svr-setup/wget-1.20/src/openssl.c:963: undefined reference to `sk_pop_free'
  997. /svr-setup/wget-1.20/src/openssl.c:963: undefined reference to `sk_pop_free'
  998. collect2: error: ld returned 1 exit status
  999. make[2]: *** [wget] Error 1
  1000. make[2]: Leaving directory `/svr-setup/wget-1.20/src'
  1001. make[1]: *** [install-recursive] Error 1
  1002. make[1]: Leaving directory `/svr-setup/wget-1.20'
  1003. make: *** [install] Error 2
  1004.  
  1005. --------------------------------------------------------
  1006. (Bldconfig -p | grep libpcre.so.1
  1007.     libpcre.so.1 (libc6,x86-64) => /usr/local/lib/libpcre.so.1
  1008.     libpcre.so.1 (libc6,x86-64) => /lib64/libpcre.so.1
  1009.  
  1010. ldd alias wget='/usr/local/bin/wget'
  1011.     /usr/local/bin/wget
  1012. alias:
  1013. ldd: ./alias: No such file or directory
  1014. wget='/usr/local/bin/wget':
  1015. ldd: wget='/usr/local/bin/wget': No such file or directory
  1016. /usr/local/bin/wget:
  1017.     linux-vdso.so.1 =>  (0x00007fff0b5e9000)
  1018.     libpcre.so.1 => /usr/local/lib/libpcre.so.1 (0x00007fc651b76000)
  1019.     libssl.so.10 => /lib64/libssl.so.10 (0x00007fc651904000)
  1020.     libcrypto.so.10 => /lib64/libcrypto.so.10 (0x00007fc6514a3000)
  1021.     libz.so.1 => /lib64/libz.so.1 (0x00007fc65128d000)
  1022.     libc.so.6 => /lib64/libc.so.6 (0x00007fc650ec0000)
  1023.     libpthread.so.0 => /lib64/libpthread.so.0 (0x00007fc650ca4000)
  1024.     libgssapi_krb5.so.2 => /lib64/libgssapi_krb5.so.2 (0x00007fc650a57000)
  1025.     libkrb5.so.3 => /lib64/libkrb5.so.3 (0x00007fc65076e000)
  1026.     libcom_err.so.2 => /lib64/libcom_err.so.2 (0x00007fc65056a000)
  1027.     libk5crypto.so.3 => /lib64/libk5crypto.so.3 (0x00007fc65034f000)
  1028.     libdl.so.2 => /lib64/libdl.so.2 (0x00007fc65014b000)
  1029.     /lib64/ld-linux-x86-64.so.2 (0x00007fc651de5000)
  1030.     libkrb5support.so.0 => /lib64/libkrb5support.so.0 (0x00007fc64ff3c000)
  1031.     libkeyutils.so.1 => /lib64/libkeyutils.so.1 (0x00007fc64fd38000)
  1032.     libresolv.so.2 => /lib64/libresolv.so.2 (0x00007fc64fb1f000)
  1033.     libselinux.so.1 => /lib64/libselinux.so.1 (0x00007fc64f8f8000)
  1034. --------------------------------------------------------
  1035. (Bwget -V
  1036. (BGNU Wget 1.19.4 built on linux-gnu.
  1037.  
  1038. -cares +digest -gpgme +https +ipv6 -iri +large-file -metalink +nls
  1039. +ntlm +opie -psl +ssl/openssl
  1040.  
  1041. Wgetrc:
  1042.    /usr/local/etc/wgetrc (system)
  1043. Locale:
  1044.    /usr/local/share/locale
  1045. Compile:
  1046.    ccache gcc -DHAVE_CONFIG_H -DSYSTEM_WGETRC="/usr/local/etc/wgetrc"
  1047.    -DLOCALEDIR="/usr/local/share/locale" -I. -I../lib -I../lib -I
  1048.    /usr/local/include -DHAVE_LIBSSL -DNDEBUG -O2 -g -pipe -Wall
  1049.    -Wp,-D_FORTIFY_SOURCE=2 -fexceptions -fstack-protector-strong
  1050.    --param=ssp-buffer-size=4 -grecord-gcc-switches -m64 -mtune=generic
  1051. Link:
  1052.    ccache gcc -I /usr/local/include -DHAVE_LIBSSL -DNDEBUG -O2 -g
  1053.    -pipe -Wall -Wp,-D_FORTIFY_SOURCE=2 -fexceptions
  1054.    -fstack-protector-strong --param=ssp-buffer-size=4
  1055.    -grecord-gcc-switches -m64 -mtune=generic -L /usr/local/lib -lpcre
  1056.    -lssl -lcrypto -lz ftp-opie.o openssl.o http-ntlm.o ../lib/libgnu.a
  1057.  
  1058. Copyright (C) 2015 Free Software Foundation, Inc.
  1059. License GPLv3+: GNU GPL version 3 or later
  1060. <http://www.gnu.org/licenses/gpl.html>.
  1061. This is free software: you are free to change and redistribute it.
  1062. There is NO WARRANTY, to the extent permitted by law.
  1063.  
  1064. Originally written by Hrvoje Niksic <hniksic@xemacs.org>.
  1065. Please send bug reports and questions to <bug-wget@gnu.org>.
  1066. --------------------------------------------------------
  1067. (Bwget 1.20 failed to update, still using system wget
  1068. (Binstall log: /root/centminlogs/wget_source_install_051218-211913.log
  1069. (Bstrace make log (gzip compressed): /root/centminlogs/strace_wget_make_051218-211913.log.gz
  1070. (Bstrace make install log (gzip compressed): /root/centminlogs/strace_wget_make_install_051218-211913.log.gz
  1071. (B--------------------------------------------------------
  1072. (B
  1073.  
  1074. Total wget Install Time: 30.937903697 seconds
RAW Paste Data