SHARE
TWEET

Untitled

a guest Dec 27th, 2013 468 Never
Not a member of Pastebin yet? Sign Up, it unlocks many cool features!
  1.  
  2. C:\Users\user\Documents\Modding\development\1.7\forge>gradlew.bat setupD
  3. ecompWorkspace
  4. ****************************
  5.  Powered By MCP:
  6.  http://mcp.ocean-labs.de/
  7.  Searge, ProfMobius, Fesh0r,
  8.  R4wk, ZeuX, IngisKahn
  9.  MCP Data version : unknown
  10. ****************************
  11. :downloadMcpTools UP-TO-DATE
  12. :extractUserDev
  13. :genSrgs UP-TO-DATE
  14. :downloadClient SKIPPED
  15. :downloadServer SKIPPED
  16. :mergeJars SKIPPED
  17. :deobfuscateJar UP-TO-DATE
  18. :decompile FAILED
  19.  
  20. FAILURE: Build failed with an exception.
  21.  
  22. * What went wrong:
  23. Execution failed for task ':decompile'.
  24. > java.lang.NullPointerException (no error message)
  25.  
  26. * Try:
  27. Run with --stacktrace option to get the stack trace. Run with --info or --debug
  28. option to get more log output.
  29.  
  30. BUILD FAILED
  31.  
  32. Total time: 1 mins 50.437 secs
  33.  
  34. C:\Users\userDocuments\Modding\development\1.7\forge>gradlew.bat setupD
  35. ecompWorkspace --stacktrace
  36. ****************************
  37.  Powered By MCP:
  38.  http://mcp.ocean-labs.de/
  39.  Searge, ProfMobius, Fesh0r,
  40.  R4wk, ZeuX, IngisKahn
  41.  MCP Data version : unknown
  42. ****************************
  43. :downloadMcpTools UP-TO-DATE
  44. :extractUserDev
  45. :genSrgs UP-TO-DATE
  46. :downloadClient SKIPPED
  47. :downloadServer SKIPPED
  48. :mergeJars SKIPPED
  49. :deobfuscateJar UP-TO-DATE
  50. :decompile FAILED
  51.  
  52. FAILURE: Build failed with an exception.
  53.  
  54. * What went wrong:
  55. Execution failed for task ':decompile'.
  56. > java.lang.NullPointerException (no error message)
  57.  
  58. * Try:
  59. Run with --info or --debug option to get more log output.
  60.  
  61. * Exception is:
  62. org.gradle.api.tasks.TaskExecutionException: Execution failed for task ':decompi
  63. le'.
  64.         at org.gradle.api.internal.tasks.execution.ExecuteActionsTaskExecuter.ex
  65. ecuteActions(ExecuteActionsTaskExecuter.java:69)
  66.         at org.gradle.api.internal.tasks.execution.ExecuteActionsTaskExecuter.ex
  67. ecute(ExecuteActionsTaskExecuter.java:46)
  68.         at org.gradle.api.internal.tasks.execution.PostExecutionAnalysisTaskExec
  69. uter.execute(PostExecutionAnalysisTaskExecuter.java:35)
  70.         at org.gradle.api.internal.tasks.execution.SkipUpToDateTaskExecuter.exec
  71. ute(SkipUpToDateTaskExecuter.java:64)
  72.         at org.gradle.api.internal.tasks.execution.ValidatingTaskExecuter.execut
  73. e(ValidatingTaskExecuter.java:58)
  74.         at org.gradle.api.internal.tasks.execution.SkipEmptySourceFilesTaskExecu
  75. ter.execute(SkipEmptySourceFilesTaskExecuter.java:42)
  76.         at org.gradle.api.internal.tasks.execution.SkipTaskWithNoActionsExecuter
  77. .execute(SkipTaskWithNoActionsExecuter.java:52)
  78.         at org.gradle.api.internal.tasks.execution.SkipOnlyIfTaskExecuter.execut
  79. e(SkipOnlyIfTaskExecuter.java:53)
  80.         at org.gradle.api.internal.tasks.execution.ExecuteAtMostOnceTaskExecuter
  81. .execute(ExecuteAtMostOnceTaskExecuter.java:43)
  82.         at org.gradle.api.internal.AbstractTask.executeWithoutThrowingTaskFailur
  83. e(AbstractTask.java:283)
  84.         at org.gradle.execution.taskgraph.AbstractTaskPlanExecutor$TaskExecutorW
  85. orker.executeTask(AbstractTaskPlanExecutor.java:79)
  86.         at org.gradle.execution.taskgraph.AbstractTaskPlanExecutor$TaskExecutorW
  87. orker.processTask(AbstractTaskPlanExecutor.java:63)
  88.         at org.gradle.execution.taskgraph.AbstractTaskPlanExecutor$TaskExecutorW
  89. orker.run(AbstractTaskPlanExecutor.java:51)
  90.         at org.gradle.execution.taskgraph.DefaultTaskPlanExecutor$1.run(DefaultT
  91. askPlanExecutor.java:33)
  92.         at org.gradle.internal.Factories$1.create(Factories.java:22)
  93.         at org.gradle.cache.internal.DefaultCacheAccess.longRunningOperation(Def
  94. aultCacheAccess.java:214)
  95.         at org.gradle.cache.internal.DefaultCacheAccess.longRunningOperation(Def
  96. aultCacheAccess.java:276)
  97.         at org.gradle.cache.internal.DefaultPersistentDirectoryStore.longRunning
  98. Operation(DefaultPersistentDirectoryStore.java:142)
  99.         at org.gradle.api.internal.changedetection.state.DefaultTaskArtifactStat
  100. eCacheAccess.longRunningOperation(DefaultTaskArtifactStateCacheAccess.java:78)
  101.         at org.gradle.execution.taskgraph.DefaultTaskPlanExecutor.process(Defaul
  102. tTaskPlanExecutor.java:31)
  103.         at org.gradle.execution.taskgraph.DefaultTaskGraphExecuter.execute(Defau
  104. ltTaskGraphExecuter.java:86)
  105.         at org.gradle.execution.SelectedTaskExecutionAction.execute(SelectedTask
  106. ExecutionAction.java:29)
  107.         at org.gradle.execution.DefaultBuildExecuter.execute(DefaultBuildExecute
  108. r.java:61)
  109.         at org.gradle.execution.DefaultBuildExecuter.access$200(DefaultBuildExec
  110. uter.java:23)
  111.         at org.gradle.execution.DefaultBuildExecuter$2.proceed(DefaultBuildExecu
  112. ter.java:67)
  113.         at org.gradle.execution.DryRunBuildExecutionAction.execute(DryRunBuildEx
  114. ecutionAction.java:32)
  115.         at org.gradle.execution.DefaultBuildExecuter.execute(DefaultBuildExecute
  116. r.java:61)
  117.         at org.gradle.execution.DefaultBuildExecuter.execute(DefaultBuildExecute
  118. r.java:54)
  119.         at org.gradle.initialization.DefaultGradleLauncher.doBuildStages(Default
  120. GradleLauncher.java:166)
  121.         at org.gradle.initialization.DefaultGradleLauncher.doBuild(DefaultGradle
  122. Launcher.java:113)
  123.         at org.gradle.initialization.DefaultGradleLauncher.run(DefaultGradleLaun
  124. cher.java:81)
  125.         at org.gradle.launcher.exec.InProcessBuildActionExecuter$DefaultBuildCon
  126. troller.run(InProcessBuildActionExecuter.java:64)
  127.         at org.gradle.launcher.cli.ExecuteBuildAction.run(ExecuteBuildAction.jav
  128. a:33)
  129.         at org.gradle.launcher.cli.ExecuteBuildAction.run(ExecuteBuildAction.jav
  130. a:24)
  131.         at org.gradle.launcher.exec.InProcessBuildActionExecuter.execute(InProce
  132. ssBuildActionExecuter.java:35)
  133.         at org.gradle.launcher.exec.InProcessBuildActionExecuter.execute(InProce
  134. ssBuildActionExecuter.java:26)
  135.         at org.gradle.launcher.cli.RunBuildAction.run(RunBuildAction.java:50)
  136.         at org.gradle.api.internal.Actions$RunnableActionAdapter.execute(Actions
  137. .java:171)
  138.         at org.gradle.launcher.cli.CommandLineActionFactory$ParseAndBuildAction.
  139. execute(CommandLineActionFactory.java:201)
  140.         at org.gradle.launcher.cli.CommandLineActionFactory$ParseAndBuildAction.
  141. execute(CommandLineActionFactory.java:174)
  142.         at org.gradle.launcher.cli.CommandLineActionFactory$WithLogging.execute(
  143. CommandLineActionFactory.java:170)
  144.         at org.gradle.launcher.cli.CommandLineActionFactory$WithLogging.execute(
  145. CommandLineActionFactory.java:139)
  146.         at org.gradle.launcher.cli.ExceptionReportingAction.execute(ExceptionRep
  147. ortingAction.java:33)
  148.         at org.gradle.launcher.cli.ExceptionReportingAction.execute(ExceptionRep
  149. ortingAction.java:22)
  150.         at org.gradle.launcher.Main.doAction(Main.java:46)
  151.         at org.gradle.launcher.bootstrap.EntryPoint.run(EntryPoint.java:45)
  152.         at org.gradle.launcher.Main.main(Main.java:37)
  153.         at org.gradle.launcher.bootstrap.ProcessBootstrap.runNoExit(ProcessBoots
  154. trap.java:50)
  155.         at org.gradle.launcher.bootstrap.ProcessBootstrap.run(ProcessBootstrap.j
  156. ava:32)
  157.         at org.gradle.launcher.GradleMain.main(GradleMain.java:23)
  158.         at org.gradle.wrapper.BootstrapMainStarter.start(BootstrapMainStarter.ja
  159. va:30)
  160.         at org.gradle.wrapper.WrapperExecutor.execute(WrapperExecutor.java:127)
  161.         at org.gradle.wrapper.GradleWrapperMain.main(GradleWrapperMain.java:58)
  162. Caused by: java.lang.NullPointerException
  163.         at net.minecraftforge.gradle.tasks.DecompileTask.applyPatchDirectory(Dec
  164. ompileTask.java:224)
  165.         at net.minecraftforge.gradle.tasks.DecompileTask.doMCPStuff(DecompileTas
  166. k.java:91)
  167.         at org.gradle.util.JavaMethod.invoke(JavaMethod.java:62)
  168.         at org.gradle.api.internal.project.taskfactory.AnnotationProcessingTaskF
  169. actory$StandardTaskAction.doExecute(AnnotationProcessingTaskFactory.java:219)
  170.         at org.gradle.api.internal.project.taskfactory.AnnotationProcessingTaskF
  171. actory$StandardTaskAction.execute(AnnotationProcessingTaskFactory.java:212)
  172.         at org.gradle.api.internal.project.taskfactory.AnnotationProcessingTaskF
  173. actory$StandardTaskAction.execute(AnnotationProcessingTaskFactory.java:201)
  174.         at org.gradle.api.internal.AbstractTask$TaskActionWrapper.execute(Abstra
  175. ctTask.java:527)
  176.         at org.gradle.api.internal.AbstractTask$TaskActionWrapper.execute(Abstra
  177. ctTask.java:510)
  178.         at org.gradle.api.internal.tasks.execution.ExecuteActionsTaskExecuter.ex
  179. ecuteAction(ExecuteActionsTaskExecuter.java:80)
  180.         at org.gradle.api.internal.tasks.execution.ExecuteActionsTaskExecuter.ex
  181. ecuteActions(ExecuteActionsTaskExecuter.java:61)
  182.         ... 52 more
  183.  
  184.  
  185. BUILD FAILED
  186.  
  187. Total time: 1 mins 49.95 secs
  188.  
  189. C:\Users\Douglas Benn\Documents\Modding\development\1.7\forge>
RAW Paste Data
We use cookies for various purposes including analytics. By continuing to use Pastebin, you agree to our use of cookies as described in the Cookies Policy. OK, I Understand
Top