daily pastebin goal
23%
SHARE
TWEET

pyenv_failure_log

n8henrie Nov 1st, 2018 (edited) 33 Never
Not a member of Pastebin yet? Sign Up, it unlocks many cool features!
  1. /var/folders/xv/gqk_1btj70v8gfz8xb0ydw940000gn/T/python-build.20181101195354.61397 ~/work
  2. /var/folders/xv/gqk_1btj70v8gfz8xb0ydw940000gn/T/python-build.20181101195354.61397/Python-3.7.1 /var/folders/xv/gqk_1btj70v8gfz8xb0ydw940000gn/T/python-build.20181101195354.61397 ~/work
  3. checking build system type... x86_64-apple-darwin18.0.0
  4. checking host system type... x86_64-apple-darwin18.0.0
  5. checking for python3.7... python3.7
  6. checking for --enable-universalsdk... no
  7. checking for --with-universal-archs... no
  8. checking MACHDEP... checking for --without-gcc... no
  9. checking for --with-icc... no
  10. checking for gcc... clang
  11. checking whether the C compiler works... yes
  12. checking for C compiler default output file name... a.out
  13. checking for suffix of executables...
  14. checking whether we are cross compiling... no
  15. checking for suffix of object files... o
  16. checking whether we are using the GNU C compiler... yes
  17. checking whether clang accepts -g... yes
  18. checking for clang option to accept ISO C89... none needed
  19. checking how to run the C preprocessor... clang -E
  20. checking for grep that handles long lines and -e... /usr/local/bin/grep
  21. checking for a sed that does not truncate output... /usr/local/opt/gnu-sed/libexec/gnubin/sed
  22. checking for --with-cxx-main=<compiler>... no
  23. checking for clang++... no
  24. configure:
  25.  
  26.   By default, distutils will build C++ extension modules with "clang++".
  27.   If this is not intended, then set CXX on the configure command line.
  28.  
  29. checking for the platform triplet based on compiler characteristics... darwin
  30. checking for -Wl,--no-as-needed... no
  31. checking for egrep... /usr/local/bin/grep -E
  32. checking for ANSI C header files... yes
  33. checking for sys/types.h... yes
  34. checking for sys/stat.h... yes
  35. checking for stdlib.h... yes
  36. checking for string.h... yes
  37. checking for memory.h... yes
  38. checking for strings.h... yes
  39. checking for inttypes.h... yes
  40. checking for stdint.h... yes
  41. checking for unistd.h... yes
  42. checking minix/config.h usability... no
  43. checking minix/config.h presence... no
  44. checking for minix/config.h... no
  45. checking whether it is safe to define __EXTENSIONS__... yes
  46. checking for the Android API level... not Android
  47. checking for --with-suffix...
  48. checking for case-insensitive build directory... yes
  49. checking LIBRARY... libpython$(VERSION)$(ABIFLAGS).a
  50. checking LINKCC... $(PURIFY) $(MAINCC)
  51. checking for GNU ld... no
  52. checking for --enable-shared... no
  53. checking for --enable-profiling... no
  54. checking LDLIBRARY... libpython$(VERSION)$(ABIFLAGS).a
  55. checking for ar... ar
  56. checking for readelf... readelf
  57. checking for a BSD-compatible install... /usr/local/opt/coreutils/libexec/gnubin/install -c
  58. checking for a thread-safe mkdir -p... /usr/local/opt/coreutils/libexec/gnubin/mkdir -p
  59. checking for --with-pydebug... no
  60. checking for --with-assertions... no
  61. checking for --enable-optimizations... no
  62. checking for --with-lto... no
  63. checking target system type... x86_64-apple-darwin18.0.0
  64. checking for -llvm-profdata... no
  65. checking for llvm-profdata... ''
  66. configure: llvm-profdata found via xcrun: /usr/bin/xcrun llvm-profdata
  67. checking for -Wextra... yes
  68. checking whether clang accepts and needs -fno-strict-aliasing... no
  69. checking if we can turn off clang unused result warning... yes
  70. checking if we can turn off clang unused parameter warning... yes
  71. checking if we can turn off clang missing field initializers warning... yes
  72. checking if we can turn off clang invalid function cast warning... no
  73. checking if we can turn on clang mixed sign comparison warning... yes
  74. checking if we can turn on clang unreachable code warning... yes
  75. checking if we can turn on clang strict-prototypes warning... yes
  76. checking if we can make implicit function declaration an error in clang... yes
  77. checking which MACOSX_DEPLOYMENT_TARGET to use... 10.14
  78. checking whether pthreads are available without options... yes
  79. checking whether clang++ also accepts flags for thread support... no
  80. checking for ANSI C header files... (cached) yes
  81. checking asm/types.h usability... no
  82. checking asm/types.h presence... no
  83. checking for asm/types.h... no
  84. checking crypt.h usability... no
  85. checking crypt.h presence... no
  86. checking for crypt.h... no
  87. checking conio.h usability... no
  88. checking conio.h presence... no
  89. checking for conio.h... no
  90. checking direct.h usability... no
  91. checking direct.h presence... no
  92. checking for direct.h... no
  93. checking dlfcn.h usability... yes
  94. checking dlfcn.h presence... yes
  95. checking for dlfcn.h... yes
  96. checking errno.h usability... yes
  97. checking errno.h presence... yes
  98. checking for errno.h... yes
  99. checking fcntl.h usability... yes
  100. checking fcntl.h presence... yes
  101. checking for fcntl.h... yes
  102. checking grp.h usability... yes
  103. checking grp.h presence... yes
  104. checking for grp.h... yes
  105. checking ieeefp.h usability... no
  106. checking ieeefp.h presence... no
  107. checking for ieeefp.h... no
  108. checking io.h usability... no
  109. checking io.h presence... no
  110. checking for io.h... no
  111. checking langinfo.h usability... yes
  112. checking langinfo.h presence... yes
  113. checking for langinfo.h... yes
  114. checking libintl.h usability... no
  115. checking libintl.h presence... no
  116. checking for libintl.h... no
  117. checking process.h usability... no
  118. checking process.h presence... no
  119. checking for process.h... no
  120. checking pthread.h usability... yes
  121. checking pthread.h presence... yes
  122. checking for pthread.h... yes
  123. checking sched.h usability... yes
  124. checking sched.h presence... yes
  125. checking for sched.h... yes
  126. checking shadow.h usability... no
  127. checking shadow.h presence... no
  128. checking for shadow.h... no
  129. checking signal.h usability... yes
  130. checking signal.h presence... yes
  131. checking for signal.h... yes
  132. checking stropts.h usability... no
  133. checking stropts.h presence... no
  134. checking for stropts.h... no
  135. checking termios.h usability... yes
  136. checking termios.h presence... yes
  137. checking for termios.h... yes
  138. checking for unistd.h... (cached) yes
  139. checking utime.h usability... yes
  140. checking utime.h presence... yes
  141. checking for utime.h... yes
  142. checking poll.h usability... yes
  143. checking poll.h presence... yes
  144. checking for poll.h... yes
  145. checking sys/devpoll.h usability... no
  146. checking sys/devpoll.h presence... no
  147. checking for sys/devpoll.h... no
  148. checking sys/epoll.h usability... no
  149. checking sys/epoll.h presence... no
  150. checking for sys/epoll.h... no
  151. checking sys/poll.h usability... yes
  152. checking sys/poll.h presence... yes
  153. checking for sys/poll.h... yes
  154. checking sys/audioio.h usability... no
  155. checking sys/audioio.h presence... no
  156. checking for sys/audioio.h... no
  157. checking sys/xattr.h usability... yes
  158. checking sys/xattr.h presence... yes
  159. checking for sys/xattr.h... yes
  160. checking sys/bsdtty.h usability... no
  161. checking sys/bsdtty.h presence... no
  162. checking for sys/bsdtty.h... no
  163. checking sys/event.h usability... yes
  164. checking sys/event.h presence... yes
  165. checking for sys/event.h... yes
  166. checking sys/file.h usability... yes
  167. checking sys/file.h presence... yes
  168. checking for sys/file.h... yes
  169. checking sys/ioctl.h usability... yes
  170. checking sys/ioctl.h presence... yes
  171. checking for sys/ioctl.h... yes
  172. checking sys/kern_control.h usability... yes
  173. checking sys/kern_control.h presence... yes
  174. checking for sys/kern_control.h... yes
  175. checking sys/loadavg.h usability... no
  176. checking sys/loadavg.h presence... no
  177. checking for sys/loadavg.h... no
  178. checking sys/lock.h usability... yes
  179. checking sys/lock.h presence... yes
  180. checking for sys/lock.h... yes
  181. checking sys/mkdev.h usability... no
  182. checking sys/mkdev.h presence... no
  183. checking for sys/mkdev.h... no
  184. checking sys/modem.h usability... no
  185. checking sys/modem.h presence... no
  186. checking for sys/modem.h... no
  187. checking sys/param.h usability... yes
  188. checking sys/param.h presence... yes
  189. checking for sys/param.h... yes
  190. checking sys/random.h usability... yes
  191. checking sys/random.h presence... yes
  192. checking for sys/random.h... yes
  193. checking sys/select.h usability... yes
  194. checking sys/select.h presence... yes
  195. checking for sys/select.h... yes
  196. checking sys/sendfile.h usability... no
  197. checking sys/sendfile.h presence... no
  198. checking for sys/sendfile.h... no
  199. checking sys/socket.h usability... yes
  200. checking sys/socket.h presence... yes
  201. checking for sys/socket.h... yes
  202. checking sys/statvfs.h usability... yes
  203. checking sys/statvfs.h presence... yes
  204. checking for sys/statvfs.h... yes
  205. checking for sys/stat.h... (cached) yes
  206. checking sys/syscall.h usability... yes
  207. checking sys/syscall.h presence... yes
  208. checking for sys/syscall.h... yes
  209. checking sys/sys_domain.h usability... yes
  210. checking sys/sys_domain.h presence... yes
  211. checking for sys/sys_domain.h... yes
  212. checking sys/termio.h usability... no
  213. checking sys/termio.h presence... no
  214. checking for sys/termio.h... no
  215. checking sys/time.h usability... yes
  216. checking sys/time.h presence... yes
  217. checking for sys/time.h... yes
  218. checking sys/times.h usability... yes
  219. checking sys/times.h presence... yes
  220. checking for sys/times.h... yes
  221. checking for sys/types.h... (cached) yes
  222. checking sys/uio.h usability... yes
  223. checking sys/uio.h presence... yes
  224. checking for sys/uio.h... yes
  225. checking sys/un.h usability... yes
  226. checking sys/un.h presence... yes
  227. checking for sys/un.h... yes
  228. checking sys/utsname.h usability... yes
  229. checking sys/utsname.h presence... yes
  230. checking for sys/utsname.h... yes
  231. checking sys/wait.h usability... yes
  232. checking sys/wait.h presence... yes
  233. checking for sys/wait.h... yes
  234. checking pty.h usability... no
  235. checking pty.h presence... no
  236. checking for pty.h... no
  237. checking libutil.h usability... no
  238. checking libutil.h presence... no
  239. checking for libutil.h... no
  240. checking sys/resource.h usability... yes
  241. checking sys/resource.h presence... yes
  242. checking for sys/resource.h... yes
  243. checking netpacket/packet.h usability... no
  244. checking netpacket/packet.h presence... no
  245. checking for netpacket/packet.h... no
  246. checking sysexits.h usability... yes
  247. checking sysexits.h presence... yes
  248. checking for sysexits.h... yes
  249. checking bluetooth.h usability... no
  250. checking bluetooth.h presence... no
  251. checking for bluetooth.h... no
  252. checking linux/tipc.h usability... no
  253. checking linux/tipc.h presence... no
  254. checking for linux/tipc.h... no
  255. checking linux/random.h usability... no
  256. checking linux/random.h presence... no
  257. checking for linux/random.h... no
  258. checking spawn.h usability... yes
  259. checking spawn.h presence... yes
  260. checking for spawn.h... yes
  261. checking util.h usability... yes
  262. checking util.h presence... yes
  263. checking for util.h... yes
  264. checking alloca.h usability... yes
  265. checking alloca.h presence... yes
  266. checking for alloca.h... yes
  267. checking endian.h usability... no
  268. checking endian.h presence... no
  269. checking for endian.h... no
  270. checking sys/endian.h usability... no
  271. checking sys/endian.h presence... no
  272. checking for sys/endian.h... no
  273. checking sys/sysmacros.h usability... no
  274. checking sys/sysmacros.h presence... no
  275. checking for sys/sysmacros.h... no
  276. checking for dirent.h that defines DIR... yes
  277. checking for library containing opendir... none required
  278. checking whether sys/types.h defines makedev... yes
  279. checking bluetooth/bluetooth.h usability... no
  280. checking bluetooth/bluetooth.h presence... no
  281. checking for bluetooth/bluetooth.h... no
  282. checking for net/if.h... yes
  283. checking for linux/netlink.h... no
  284. checking for linux/vm_sockets.h... no
  285. checking for linux/can.h... no
  286. checking for linux/can/raw.h... no
  287. checking for linux/can/bcm.h... no
  288. checking for clock_t in time.h... yes
  289. checking for makedev... yes
  290. checking for le64toh... no
  291. checking for mode_t... yes
  292. checking for off_t... yes
  293. checking for pid_t... yes
  294. checking for size_t... yes
  295. checking for uid_t in sys/types.h... yes
  296. checking for ssize_t... yes
  297. checking for __uint128_t... yes
  298. checking size of int... 4
  299. checking size of long... 8
  300. checking size of long long... 8
  301. checking size of void *... 8
  302. checking size of short... 2
  303. checking size of float... 4
  304. checking size of double... 8
  305. checking size of fpos_t... 8
  306. checking size of size_t... 8
  307. checking size of pid_t... 4
  308. checking size of uintptr_t... 8
  309. checking for long double support... yes
  310. checking size of long double... 16
  311. checking size of _Bool... 1
  312. checking size of off_t... 8
  313. checking whether to enable large file support... no
  314. checking size of time_t... 8
  315. checking for pthread_t... yes
  316. checking size of pthread_t... 8
  317. checking size of pthread_key_t... 8
  318. checking whether pthread_key_t is compatible with int... no
  319. checking for --enable-framework... no
  320. checking for dyld... always on for Darwin
  321. checking the extension of shared libraries... .so
  322. checking LDSHARED... $(CC) -bundle -undefined dynamic_lookup
  323. checking CCSHARED...
  324. checking LINKFORSHARED... -Wl,-stack_size,1000000  -framework CoreFoundation
  325. checking CFLAGSFORSHARED...
  326. checking SHLIBS... $(LIBS)
  327. checking for sendfile in -lsendfile... no
  328. checking for dlopen in -ldl... yes
  329. checking for shl_load in -ldld... no
  330. checking uuid/uuid.h usability... yes
  331. checking uuid/uuid.h presence... yes
  332. checking for uuid/uuid.h... yes
  333. checking uuid.h usability... no
  334. checking uuid.h presence... no
  335. checking for uuid.h... no
  336. checking for uuid_generate_time_safe... no
  337. checking for uuid_create... no
  338. checking for uuid_enc_be... no
  339. checking for library containing sem_init... none required
  340. checking for textdomain in -lintl... no
  341. checking aligned memory access is required... no
  342. checking for --with-hash-algorithm... default
  343. checking for --with-address-sanitizer... no
  344. checking for t_open in -lnsl... no
  345. checking for socket in -lsocket... no
  346. checking for --with-libs... no
  347. checking for pkg-config... /usr/local/bin/pkg-config
  348. checking pkg-config is at least version 0.9.0... yes
  349. checking for --with-system-expat... no
  350. checking for --with-system-ffi... no
  351. checking for --with-system-libmpdec... no
  352. checking for --enable-loadable-sqlite-extensions... no
  353. checking for --with-tcltk-includes... default
  354. checking for --with-tcltk-libs... default
  355. checking for --with-dbmliborder...
  356. checking if PTHREAD_SCOPE_SYSTEM is supported... yes
  357. checking for pthread_sigmask... yes
  358. checking for pthread_getcpuclockid... no
  359. checking if --enable-ipv6 is specified... yes
  360. checking if RFC2553 API is available... yes
  361. checking ipv6 stack type... kame
  362. using libc
  363. checking for CAN_RAW_FD_FRAMES... no
  364. checking for --with-doc-strings... yes
  365. checking for --with-pymalloc... yes
  366. checking for --with-c-locale-coercion... yes
  367. checking for --with-valgrind... no
  368. checking for --with-dtrace... no
  369. checking for dlopen... yes
  370. checking DYNLOADFILE... dynload_shlib.o
  371. checking MACHDEP_OBJS... none
  372. checking for alarm... yes
  373. checking for accept4... no
  374. checking for setitimer... yes
  375. checking for getitimer... yes
  376. checking for bind_textdomain_codeset... no
  377. checking for chown... yes
  378. checking for clock... yes
  379. checking for confstr... yes
  380. checking for ctermid... yes
  381. checking for dup3... no
  382. checking for execv... yes
  383. checking for faccessat... yes
  384. checking for fchmod... yes
  385. checking for fchmodat... yes
  386. checking for fchown... yes
  387. checking for fchownat... yes
  388. checking for fexecve... no
  389. checking for fdopendir... yes
  390. checking for fork... yes
  391. checking for fpathconf... yes
  392. checking for fstatat... yes
  393. checking for ftime... yes
  394. checking for ftruncate... yes
  395. checking for futimesat... no
  396. checking for futimens... yes
  397. checking for futimes... yes
  398. checking for gai_strerror... yes
  399. checking for getentropy... yes
  400. checking for getgrouplist... yes
  401. checking for getgroups... yes
  402. checking for getlogin... yes
  403. checking for getloadavg... yes
  404. checking for getpeername... yes
  405. checking for getpgid... yes
  406. checking for getpid... yes
  407. checking for getpriority... yes
  408. checking for getresuid... no
  409. checking for getresgid... no
  410. checking for getpwent... yes
  411. checking for getspnam... no
  412. checking for getspent... no
  413. checking for getsid... yes
  414. checking for getwd... yes
  415. checking for if_nameindex... yes
  416. checking for initgroups... yes
  417. checking for kill... yes
  418. checking for killpg... yes
  419. checking for lchown... yes
  420. checking for lockf... yes
  421. checking for linkat... yes
  422. checking for lstat... yes
  423. checking for lutimes... yes
  424. checking for mmap... yes
  425. checking for memrchr... no
  426. checking for mbrtowc... yes
  427. checking for mkdirat... yes
  428. checking for mkfifo... yes
  429. checking for mkfifoat... no
  430. checking for mknod... yes
  431. checking for mknodat... no
  432. checking for mktime... yes
  433. checking for mremap... no
  434. checking for nice... yes
  435. checking for openat... yes
  436. checking for pathconf... yes
  437. checking for pause... yes
  438. checking for pipe2... no
  439. checking for plock... no
  440. checking for poll... yes
  441. checking for posix_fallocate... no
  442. checking for posix_fadvise... no
  443. checking for posix_spawn... yes
  444. checking for pread... yes
  445. checking for preadv... no
  446. checking for preadv2... no
  447. checking for pthread_init... no
  448. checking for pthread_kill... yes
  449. checking for putenv... yes
  450. checking for pwrite... yes
  451. checking for pwritev... no
  452. checking for pwritev2... no
  453. checking for readlink... yes
  454. checking for readlinkat... yes
  455. checking for readv... yes
  456. checking for realpath... yes
  457. checking for renameat... yes
  458. checking for sem_open... yes
  459. checking for sem_timedwait... no
  460. checking for sem_getvalue... yes
  461. checking for sem_unlink... yes
  462. checking for sendfile... yes
  463. checking for setegid... yes
  464. checking for seteuid... yes
  465. checking for setgid... yes
  466. checking for sethostname... yes
  467. checking for setlocale... yes
  468. checking for setregid... yes
  469. checking for setreuid... yes
  470. checking for setresuid... no
  471. checking for setresgid... no
  472. checking for setsid... yes
  473. checking for setpgid... yes
  474. checking for setpgrp... yes
  475. checking for setpriority... yes
  476. checking for setuid... yes
  477. checking for setvbuf... yes
  478. checking for sched_get_priority_max... yes
  479. checking for sched_setaffinity... no
  480. checking for sched_setscheduler... no
  481. checking for sched_setparam... no
  482. checking for sched_rr_get_interval... no
  483. checking for sigaction... yes
  484. checking for sigaltstack... yes
  485. checking for siginterrupt... yes
  486. checking for sigpending... yes
  487. checking for sigrelse... yes
  488. checking for sigtimedwait... no
  489. checking for sigwait... yes
  490. checking for sigwaitinfo... no
  491. checking for snprintf... yes
  492. checking for strftime... yes
  493. checking for strlcpy... yes
  494. checking for symlinkat... yes
  495. checking for sync... yes
  496. checking for sysconf... yes
  497. checking for tcgetpgrp... yes
  498. checking for tcsetpgrp... yes
  499. checking for tempnam... yes
  500. checking for timegm... yes
  501. checking for times... yes
  502. checking for tmpfile... yes
  503. checking for tmpnam... yes
  504. checking for tmpnam_r... no
  505. checking for truncate... yes
  506. checking for uname... yes
  507. checking for unlinkat... yes
  508. checking for unsetenv... yes
  509. checking for utimensat... yes
  510. checking for utimes... yes
  511. checking for waitid... yes
  512. checking for waitpid... yes
  513. checking for wait3... yes
  514. checking for wait4... yes
  515. checking for wcscoll... yes
  516. checking for wcsftime... yes
  517. checking for wcsxfrm... yes
  518. checking for wmemcmp... yes
  519. checking for writev... yes
  520. checking for _getpty... no
  521. checking for lchmod... yes
  522. checking whether dirfd is declared... yes
  523. checking for chroot... yes
  524. checking for link... yes
  525. checking for symlink... yes
  526. checking for fchdir... yes
  527. checking for fsync... yes
  528. checking for fdatasync... no
  529. checking for epoll... no
  530. checking for epoll_create1... no
  531. checking for kqueue... yes
  532. checking for prlimit... no
  533. checking for ctermid_r... yes
  534. checking for flock declaration... yes
  535. checking for flock... yes
  536. checking for getpagesize... yes
  537. checking for broken unsetenv... no
  538. checking for true... true
  539. checking for inet_aton in -lc... yes
  540. checking for chflags... yes
  541. checking for lchflags... yes
  542. checking for inflateCopy in -lz... yes
  543. checking for hstrerror... yes
  544. checking for inet_aton... yes
  545. checking for inet_pton... yes
  546. checking for setgroups... yes
  547. checking for openpty... yes
  548. checking for forkpty... yes
  549. checking for fseek64... no
  550. checking for fseeko... yes
  551. checking for fstatvfs... yes
  552. checking for ftell64... no
  553. checking for ftello... yes
  554. checking for statvfs... yes
  555. checking for dup2... yes
  556. checking for strdup... yes
  557. checking for getpgrp... yes
  558. checking for setpgrp... (cached) yes
  559. checking for gettimeofday... yes
  560. checking for clock_gettime... yes
  561. checking for clock_getres... yes
  562. checking for clock_settime... yes
  563. checking for major... yes
  564. checking for getaddrinfo... yes
  565. checking getaddrinfo bug... no
  566. checking for getnameinfo... yes
  567. checking whether time.h and sys/time.h may both be included... yes
  568. checking whether struct tm is in sys/time.h or time.h... time.h
  569. checking for struct tm.tm_zone... yes
  570. checking for struct stat.st_rdev... yes
  571. checking for struct stat.st_blksize... yes
  572. checking for struct stat.st_flags... yes
  573. checking for struct stat.st_gen... yes
  574. checking for struct stat.st_birthtime... yes
  575. checking for struct stat.st_blocks... yes
  576. checking for struct passwd.pw_gecos... yes
  577. checking for struct passwd.pw_passwd... yes
  578. checking for siginfo_t.si_band... yes
  579. checking for time.h that defines altzone... no
  580. checking whether sys/select.h and sys/time.h may both be included... yes
  581. checking for addrinfo... yes
  582. checking for sockaddr_storage... yes
  583. checking for sockaddr_alg... no
  584. checking whether char is unsigned... no
  585. checking for an ANSI C-conforming const... yes
  586. checking for working signed char... yes
  587. checking for prototypes... yes
  588. checking for variable length prototypes and stdarg.h... yes
  589. checking for socketpair... yes
  590. checking if sockaddr has sa_len member... yes
  591. checking for gethostbyname_r... no
  592. checking for gethostbyname... yes
  593. checking for __fpu_control... no
  594. checking for __fpu_control in -lieee... no
  595. checking for --with-libm=STRING... default LIBM=""
  596. checking for --with-libc=STRING... default LIBC=""
  597. checking for x64 gcc inline assembler... yes
  598. checking whether C doubles are little-endian IEEE 754 binary64... yes
  599. checking whether C doubles are big-endian IEEE 754 binary64... no
  600. checking whether C doubles are ARM mixed-endian IEEE 754 binary64... no
  601. checking whether we can use gcc inline assembler to get and set x87 control word... yes
  602. checking whether we can use gcc inline assembler to get and set mc68881 fpcr... no
  603. checking for x87-style double rounding... no
  604. checking for acosh... yes
  605. checking for asinh... yes
  606. checking for atanh... yes
  607. checking for copysign... yes
  608. checking for erf... yes
  609. checking for erfc... yes
  610. checking for expm1... yes
  611. checking for finite... yes
  612. checking for gamma... yes
  613. checking for hypot... yes
  614. checking for lgamma... yes
  615. checking for log1p... yes
  616. checking for log2... yes
  617. checking for round... yes
  618. checking for tgamma... yes
  619. checking whether isinf is declared... yes
  620. checking whether isnan is declared... yes
  621. checking whether isfinite is declared... yes
  622. checking whether tanh preserves the sign of zero... yes
  623. checking whether log1p drops the sign of negative zero... no
  624. checking whether POSIX semaphores are enabled... yes
  625. checking for broken sem_getvalue... yes
  626. checking whether RTLD_LAZY is declared... yes
  627. checking whether RTLD_NOW is declared... yes
  628. checking whether RTLD_GLOBAL is declared... yes
  629. checking whether RTLD_LOCAL is declared... yes
  630. checking whether RTLD_NODELETE is declared... yes
  631. checking whether RTLD_NOLOAD is declared... yes
  632. checking whether RTLD_DEEPBIND is declared... no
  633. checking whether RTLD_MEMBER is declared... no
  634. checking digit size for Python's longs... no value specified
  635. checking wchar.h usability... yes
  636. checking wchar.h presence... yes
  637. checking for wchar.h... yes
  638. checking size of wchar_t... 4
  639. checking for UCS-4 tcl... no
  640. checking whether wchar_t is signed... yes
  641. checking whether wchar_t is usable... no
  642. checking whether byte ordering is bigendian... no
  643. checking ABIFLAGS... m
  644. checking SOABI... cpython-37m-darwin
  645. checking LDVERSION... $(VERSION)$(ABIFLAGS)
  646. checking whether right shift extends the sign bit... yes
  647. checking for getc_unlocked() and friends... yes
  648. checking how to link readline libs... -lreadline
  649. checking for rl_pre_input_hook in -lreadline... yes
  650. checking for rl_completion_display_matches_hook in -lreadline... yes
  651. checking for rl_resize_terminal in -lreadline... yes
  652. checking for rl_completion_matches in -lreadline... yes
  653. checking for append_history in -lreadline... yes
  654. checking for broken nice()... no
  655. checking for broken poll()... no
  656. checking for working tzset()... yes
  657. checking for tv_nsec in struct stat... no
  658. checking for tv_nsec2 in struct stat... yes
  659. checking curses.h usability... yes
  660. checking curses.h presence... yes
  661. checking for curses.h... yes
  662. checking ncurses.h usability... yes
  663. checking ncurses.h presence... yes
  664. checking for ncurses.h... yes
  665. checking for term.h... yes
  666. checking whether mvwdelch is an expression... yes
  667. checking whether WINDOW has _flags... yes
  668. checking for is_pad... no
  669. checking for is_term_resized... yes
  670. checking for resize_term... yes
  671. checking for resizeterm... yes
  672. checking for immedok... yes
  673. checking for syncok... yes
  674. checking for wchgat... yes
  675. checking for filter... yes
  676. checking for has_key... yes
  677. checking for typeahead... yes
  678. checking for use_env... yes
  679. configure: checking for device files
  680. checking for /dev/ptmx... yes
  681. checking for /dev/ptc... no
  682. checking for %zd printf() format support... yes
  683. checking for socklen_t... yes
  684. checking for broken mbstowcs... no
  685. checking for --with-computed-gotos... no value specified
  686. checking whether clang supports computed gotos... yes
  687. checking for build directories... done
  688. checking for -O2... yes
  689. checking for glibc _FORTIFY_SOURCE/memmove bug... no
  690. checking for stdatomic.h... yes
  691. checking for GCC >= 4.7 __atomic builtins... yes
  692. checking for ensurepip... upgrade
  693. checking if the dirent structure of a d_type field... yes
  694. checking for the Linux getrandom() syscall... no
  695. checking for the getrandom() function... no
  696. checking for pkg-config... /usr/local/bin/pkg-config
  697. checking whether compiling and linking against OpenSSL works... yes
  698. checking for X509_VERIFY_PARAM_set1_host in libssl... yes
  699. checking for --with-ssl-default-suites... python
  700. configure: creating ./config.status
  701. config.status: creating Makefile.pre
  702. config.status: creating Misc/python.pc
  703. config.status: creating Misc/python-config.sh
  704. config.status: creating Modules/ld_so_aix
  705. config.status: creating pyconfig.h
  706. creating Modules/Setup
  707. creating Modules/Setup.local
  708. creating Makefile
  709.  
  710.  
  711. If you want a release build with all stable optimizations active (PGO, etc),
  712. please run ./configure --enable-optimizations
  713.  
  714.  
  715. clang -c -Wno-unused-result -Wsign-compare -Wunreachable-code -DNDEBUG -g -fwrapv -O3 -Wall -I/usr/local/opt/openssl/include  -I/usr/local/opt/openssl/include  -std=c99 -Wextra -Wno-unused-result -Wno-unused-parameter -Wno-missing-field-initializers -Wstrict-prototypes -Werror=implicit-function-declaration   -I. -I./Include -I/usr/local/opt/readline/include -I/usr/local/opt/readline/include -I/usr/local/opt/openssl/include -I/usr/local/var/pyenv/versions/3.7.1/include  -I/usr/local/opt/readline/include -I/usr/local/opt/readline/include -I/usr/local/opt/openssl/include -I/usr/local/var/pyenv/versions/3.7.1/include   -DPy_BUILD_CORE -o Programs/python.o ./Programs/python.c
  716. clang -c -Wno-unused-result -Wsign-compare -Wunreachable-code -DNDEBUG -g -fwrapv -O3 -Wall -I/usr/local/opt/openssl/include  -I/usr/local/opt/openssl/include  -std=c99 -Wextra -Wno-unused-result -Wno-unused-parameter -Wno-missing-field-initializers -Wstrict-prototypes -Werror=implicit-function-declaration   -I. -I./Include -I/usr/local/opt/readline/include -I/usr/local/opt/readline/include -I/usr/local/opt/openssl/include -I/usr/local/var/pyenv/versions/3.7.1/include  -I/usr/local/opt/readline/include -I/usr/local/opt/readline/include -I/usr/local/opt/openssl/include -I/usr/local/var/pyenv/versions/3.7.1/include   -DPy_BUILD_CORE -o Parser/acceler.o Parser/acceler.c
  717. clang -c -Wno-unused-result -Wsign-compare -Wunreachable-code -DNDEBUG -g -fwrapv -O3 -Wall -I/usr/local/opt/openssl/include  -I/usr/local/opt/openssl/include  -std=c99 -Wextra -Wno-unused-result -Wno-unused-parameter -Wno-missing-field-initializers -Wstrict-prototypes -Werror=implicit-function-declaration   -I. -I./Include -I/usr/local/opt/readline/include -I/usr/local/opt/readline/include -I/usr/local/opt/openssl/include -I/usr/local/var/pyenv/versions/3.7.1/include  -I/usr/local/opt/readline/include -I/usr/local/opt/readline/include -I/usr/local/opt/openssl/include -I/usr/local/var/pyenv/versions/3.7.1/include   -DPy_BUILD_CORE -o Parser/grammar1.o Parser/grammar1.c
  718. clang -c -Wno-unused-result -Wsign-compare -Wunreachable-code -DNDEBUG -g -fwrapv -O3 -Wall -I/usr/local/opt/openssl/include  -I/usr/local/opt/openssl/include  -std=c99 -Wextra -Wno-unused-result -Wno-unused-parameter -Wno-missing-field-initializers -Wstrict-prototypes -Werror=implicit-function-declaration   -I. -I./Include -I/usr/local/opt/readline/include -I/usr/local/opt/readline/include -I/usr/local/opt/openssl/include -I/usr/local/var/pyenv/versions/3.7.1/include  -I/usr/local/opt/readline/include -I/usr/local/opt/readline/include -I/usr/local/opt/openssl/include -I/usr/local/var/pyenv/versions/3.7.1/include   -DPy_BUILD_CORE -o Parser/listnode.o Parser/listnode.c
  719. clang -c -Wno-unused-result -Wsign-compare -Wunreachable-code -DNDEBUG -g -fwrapv -O3 -Wall -I/usr/local/opt/openssl/include  -I/usr/local/opt/openssl/include  -std=c99 -Wextra -Wno-unused-result -Wno-unused-parameter -Wno-missing-field-initializers -Wstrict-prototypes -Werror=implicit-function-declaration   -I. -I./Include -I/usr/local/opt/readline/include -I/usr/local/opt/readline/include -I/usr/local/opt/openssl/include -I/usr/local/var/pyenv/versions/3.7.1/include  -I/usr/local/opt/readline/include -I/usr/local/opt/readline/include -I/usr/local/opt/openssl/include -I/usr/local/var/pyenv/versions/3.7.1/include   -DPy_BUILD_CORE -o Parser/node.o Parser/node.c
  720. clang -c -Wno-unused-result -Wsign-compare -Wunreachable-code -DNDEBUG -g -fwrapv -O3 -Wall -I/usr/local/opt/openssl/include  -I/usr/local/opt/openssl/include  -std=c99 -Wextra -Wno-unused-result -Wno-unused-parameter -Wno-missing-field-initializers -Wstrict-prototypes -Werror=implicit-function-declaration   -I. -I./Include -I/usr/local/opt/readline/include -I/usr/local/opt/readline/include -I/usr/local/opt/openssl/include -I/usr/local/var/pyenv/versions/3.7.1/include  -I/usr/local/opt/readline/include -I/usr/local/opt/readline/include -I/usr/local/opt/openssl/include -I/usr/local/var/pyenv/versions/3.7.1/include   -DPy_BUILD_CORE -o Parser/parser.o Parser/parser.c
  721. clang -c -Wno-unused-result -Wsign-compare -Wunreachable-code -DNDEBUG -g -fwrapv -O3 -Wall -I/usr/local/opt/openssl/include  -I/usr/local/opt/openssl/include  -std=c99 -Wextra -Wno-unused-result -Wno-unused-parameter -Wno-missing-field-initializers -Wstrict-prototypes -Werror=implicit-function-declaration   -I. -I./Include -I/usr/local/opt/readline/include -I/usr/local/opt/readline/include -I/usr/local/opt/openssl/include -I/usr/local/var/pyenv/versions/3.7.1/include  -I/usr/local/opt/readline/include -I/usr/local/opt/readline/include -I/usr/local/opt/openssl/include -I/usr/local/var/pyenv/versions/3.7.1/include   -DPy_BUILD_CORE -o Parser/bitset.o Parser/bitset.c
  722. clang -c -Wno-unused-result -Wsign-compare -Wunreachable-code -DNDEBUG -g -fwrapv -O3 -Wall -I/usr/local/opt/openssl/include  -I/usr/local/opt/openssl/include  -std=c99 -Wextra -Wno-unused-result -Wno-unused-parameter -Wno-missing-field-initializers -Wstrict-prototypes -Werror=implicit-function-declaration   -I. -I./Include -I/usr/local/opt/readline/include -I/usr/local/opt/readline/include -I/usr/local/opt/openssl/include -I/usr/local/var/pyenv/versions/3.7.1/include  -I/usr/local/opt/readline/include -I/usr/local/opt/readline/include -I/usr/local/opt/openssl/include -I/usr/local/var/pyenv/versions/3.7.1/include   -DPy_BUILD_CORE -o Parser/metagrammar.o Parser/metagrammar.c
  723. clang -c -Wno-unused-result -Wsign-compare -Wunreachable-code -DNDEBUG -g -fwrapv -O3 -Wall -I/usr/local/opt/openssl/include  -I/usr/local/opt/openssl/include  -std=c99 -Wextra -Wno-unused-result -Wno-unused-parameter -Wno-missing-field-initializers -Wstrict-prototypes -Werror=implicit-function-declaration   -I. -I./Include -I/usr/local/opt/readline/include -I/usr/local/opt/readline/include -I/usr/local/opt/openssl/include -I/usr/local/var/pyenv/versions/3.7.1/include  -I/usr/local/opt/readline/include -I/usr/local/opt/readline/include -I/usr/local/opt/openssl/include -I/usr/local/var/pyenv/versions/3.7.1/include   -DPy_BUILD_CORE -o Parser/firstsets.o Parser/firstsets.c
  724. clang -c -Wno-unused-result -Wsign-compare -Wunreachable-code -DNDEBUG -g -fwrapv -O3 -Wall -I/usr/local/opt/openssl/include  -I/usr/local/opt/openssl/include  -std=c99 -Wextra -Wno-unused-result -Wno-unused-parameter -Wno-missing-field-initializers -Wstrict-prototypes -Werror=implicit-function-declaration   -I. -I./Include -I/usr/local/opt/readline/include -I/usr/local/opt/readline/include -I/usr/local/opt/openssl/include -I/usr/local/var/pyenv/versions/3.7.1/include  -I/usr/local/opt/readline/include -I/usr/local/opt/readline/include -I/usr/local/opt/openssl/include -I/usr/local/var/pyenv/versions/3.7.1/include   -DPy_BUILD_CORE -o Parser/grammar.o Parser/grammar.c
  725. clang -c -Wno-unused-result -Wsign-compare -Wunreachable-code -DNDEBUG -g -fwrapv -O3 -Wall -I/usr/local/opt/openssl/include  -I/usr/local/opt/openssl/include  -std=c99 -Wextra -Wno-unused-result -Wno-unused-parameter -Wno-missing-field-initializers -Wstrict-prototypes -Werror=implicit-function-declaration   -I. -I./Include -I/usr/local/opt/readline/include -I/usr/local/opt/readline/include -I/usr/local/opt/openssl/include -I/usr/local/var/pyenv/versions/3.7.1/include  -I/usr/local/opt/readline/include -I/usr/local/opt/readline/include -I/usr/local/opt/openssl/include -I/usr/local/var/pyenv/versions/3.7.1/include   -DPy_BUILD_CORE -o Parser/pgen.o Parser/pgen.c
  726. clang -c -Wno-unused-result -Wsign-compare -Wunreachable-code -DNDEBUG -g -fwrapv -O3 -Wall -I/usr/local/opt/openssl/include  -I/usr/local/opt/openssl/include  -std=c99 -Wextra -Wno-unused-result -Wno-unused-parameter -Wno-missing-field-initializers -Wstrict-prototypes -Werror=implicit-function-declaration   -I. -I./Include -I/usr/local/opt/readline/include -I/usr/local/opt/readline/include -I/usr/local/opt/openssl/include -I/usr/local/var/pyenv/versions/3.7.1/include  -I/usr/local/opt/readline/include -I/usr/local/opt/readline/include -I/usr/local/opt/openssl/include -I/usr/local/var/pyenv/versions/3.7.1/include   -DPy_BUILD_CORE -o Parser/myreadline.o Parser/myreadline.c
  727. clang -c -Wno-unused-result -Wsign-compare -Wunreachable-code -DNDEBUG -g -fwrapv -O3 -Wall -I/usr/local/opt/openssl/include  -I/usr/local/opt/openssl/include  -std=c99 -Wextra -Wno-unused-result -Wno-unused-parameter -Wno-missing-field-initializers -Wstrict-prototypes -Werror=implicit-function-declaration   -I. -I./Include -I/usr/local/opt/readline/include -I/usr/local/opt/readline/include -I/usr/local/opt/openssl/include -I/usr/local/var/pyenv/versions/3.7.1/include  -I/usr/local/opt/readline/include -I/usr/local/opt/readline/include -I/usr/local/opt/openssl/include -I/usr/local/var/pyenv/versions/3.7.1/include   -DPy_BUILD_CORE -o Parser/parsetok.o Parser/parsetok.c
  728. clang -c -Wno-unused-result -Wsign-compare -Wunreachable-code -DNDEBUG -g -fwrapv -O3 -Wall -I/usr/local/opt/openssl/include  -I/usr/local/opt/openssl/include  -std=c99 -Wextra -Wno-unused-result -Wno-unused-parameter -Wno-missing-field-initializers -Wstrict-prototypes -Werror=implicit-function-declaration   -I. -I./Include -I/usr/local/opt/readline/include -I/usr/local/opt/readline/include -I/usr/local/opt/openssl/include -I/usr/local/var/pyenv/versions/3.7.1/include  -I/usr/local/opt/readline/include -I/usr/local/opt/readline/include -I/usr/local/opt/openssl/include -I/usr/local/var/pyenv/versions/3.7.1/include   -DPy_BUILD_CORE -o Parser/tokenizer.o Parser/tokenizer.c
  729. clang -c -Wno-unused-result -Wsign-compare -Wunreachable-code -DNDEBUG -g -fwrapv -O3 -Wall -I/usr/local/opt/openssl/include  -I/usr/local/opt/openssl/include  -std=c99 -Wextra -Wno-unused-result -Wno-unused-parameter -Wno-missing-field-initializers -Wstrict-prototypes -Werror=implicit-function-declaration   -I. -I./Include -I/usr/local/opt/readline/include -I/usr/local/opt/readline/include -I/usr/local/opt/openssl/include -I/usr/local/var/pyenv/versions/3.7.1/include  -I/usr/local/opt/readline/include -I/usr/local/opt/readline/include -I/usr/local/opt/openssl/include -I/usr/local/var/pyenv/versions/3.7.1/include   -DPy_BUILD_CORE -o Objects/abstract.o Objects/abstract.c
  730. clang -c -Wno-unused-result -Wsign-compare -Wunreachable-code -DNDEBUG -g -fwrapv -O3 -Wall -I/usr/local/opt/openssl/include  -I/usr/local/opt/openssl/include  -std=c99 -Wextra -Wno-unused-result -Wno-unused-parameter -Wno-missing-field-initializers -Wstrict-prototypes -Werror=implicit-function-declaration   -I. -I./Include -I/usr/local/opt/readline/include -I/usr/local/opt/readline/include -I/usr/local/opt/openssl/include -I/usr/local/var/pyenv/versions/3.7.1/include  -I/usr/local/opt/readline/include -I/usr/local/opt/readline/include -I/usr/local/opt/openssl/include -I/usr/local/var/pyenv/versions/3.7.1/include   -DPy_BUILD_CORE -o Objects/accu.o Objects/accu.c
  731. clang -c -Wno-unused-result -Wsign-compare -Wunreachable-code -DNDEBUG -g -fwrapv -O3 -Wall -I/usr/local/opt/openssl/include  -I/usr/local/opt/openssl/include  -std=c99 -Wextra -Wno-unused-result -Wno-unused-parameter -Wno-missing-field-initializers -Wstrict-prototypes -Werror=implicit-function-declaration   -I. -I./Include -I/usr/local/opt/readline/include -I/usr/local/opt/readline/include -I/usr/local/opt/openssl/include -I/usr/local/var/pyenv/versions/3.7.1/include  -I/usr/local/opt/readline/include -I/usr/local/opt/readline/include -I/usr/local/opt/openssl/include -I/usr/local/var/pyenv/versions/3.7.1/include   -DPy_BUILD_CORE -o Objects/boolobject.o Objects/boolobject.c
  732. clang -c -Wno-unused-result -Wsign-compare -Wunreachable-code -DNDEBUG -g -fwrapv -O3 -Wall -I/usr/local/opt/openssl/include  -I/usr/local/opt/openssl/include  -std=c99 -Wextra -Wno-unused-result -Wno-unused-parameter -Wno-missing-field-initializers -Wstrict-prototypes -Werror=implicit-function-declaration   -I. -I./Include -I/usr/local/opt/readline/include -I/usr/local/opt/readline/include -I/usr/local/opt/openssl/include -I/usr/local/var/pyenv/versions/3.7.1/include  -I/usr/local/opt/readline/include -I/usr/local/opt/readline/include -I/usr/local/opt/openssl/include -I/usr/local/var/pyenv/versions/3.7.1/include   -DPy_BUILD_CORE -o Objects/bytes_methods.o Objects/bytes_methods.c
  733. clang -c -Wno-unused-result -Wsign-compare -Wunreachable-code -DNDEBUG -g -fwrapv -O3 -Wall -I/usr/local/opt/openssl/include  -I/usr/local/opt/openssl/include  -std=c99 -Wextra -Wno-unused-result -Wno-unused-parameter -Wno-missing-field-initializers -Wstrict-prototypes -Werror=implicit-function-declaration   -I. -I./Include -I/usr/local/opt/readline/include -I/usr/local/opt/readline/include -I/usr/local/opt/openssl/include -I/usr/local/var/pyenv/versions/3.7.1/include  -I/usr/local/opt/readline/include -I/usr/local/opt/readline/include -I/usr/local/opt/openssl/include -I/usr/local/var/pyenv/versions/3.7.1/include   -DPy_BUILD_CORE -o Objects/bytearrayobject.o Objects/bytearrayobject.c
  734. clang -c -Wno-unused-result -Wsign-compare -Wunreachable-code -DNDEBUG -g -fwrapv -O3 -Wall -I/usr/local/opt/openssl/include  -I/usr/local/opt/openssl/include  -std=c99 -Wextra -Wno-unused-result -Wno-unused-parameter -Wno-missing-field-initializers -Wstrict-prototypes -Werror=implicit-function-declaration   -I. -I./Include -I/usr/local/opt/readline/include -I/usr/local/opt/readline/include -I/usr/local/opt/openssl/include -I/usr/local/var/pyenv/versions/3.7.1/include  -I/usr/local/opt/readline/include -I/usr/local/opt/readline/include -I/usr/local/opt/openssl/include -I/usr/local/var/pyenv/versions/3.7.1/include   -DPy_BUILD_CORE -o Objects/bytesobject.o Objects/bytesobject.c
  735. clang -c -Wno-unused-result -Wsign-compare -Wunreachable-code -DNDEBUG -g -fwrapv -O3 -Wall -I/usr/local/opt/openssl/include  -I/usr/local/opt/openssl/include  -std=c99 -Wextra -Wno-unused-result -Wno-unused-parameter -Wno-missing-field-initializers -Wstrict-prototypes -Werror=implicit-function-declaration   -I. -I./Include -I/usr/local/opt/readline/include -I/usr/local/opt/readline/include -I/usr/local/opt/openssl/include -I/usr/local/var/pyenv/versions/3.7.1/include  -I/usr/local/opt/readline/include -I/usr/local/opt/readline/include -I/usr/local/opt/openssl/include -I/usr/local/var/pyenv/versions/3.7.1/include   -DPy_BUILD_CORE -o Objects/call.o Objects/call.c
  736. clang -c -Wno-unused-result -Wsign-compare -Wunreachable-code -DNDEBUG -g -fwrapv -O3 -Wall -I/usr/local/opt/openssl/include  -I/usr/local/opt/openssl/include  -std=c99 -Wextra -Wno-unused-result -Wno-unused-parameter -Wno-missing-field-initializers -Wstrict-prototypes -Werror=implicit-function-declaration   -I. -I./Include -I/usr/local/opt/readline/include -I/usr/local/opt/readline/include -I/usr/local/opt/openssl/include -I/usr/local/var/pyenv/versions/3.7.1/include  -I/usr/local/opt/readline/include -I/usr/local/opt/readline/include -I/usr/local/opt/openssl/include -I/usr/local/var/pyenv/versions/3.7.1/include   -DPy_BUILD_CORE -o Objects/cellobject.o Objects/cellobject.c
  737. clang -c -Wno-unused-result -Wsign-compare -Wunreachable-code -DNDEBUG -g -fwrapv -O3 -Wall -I/usr/local/opt/openssl/include  -I/usr/local/opt/openssl/include  -std=c99 -Wextra -Wno-unused-result -Wno-unused-parameter -Wno-missing-field-initializers -Wstrict-prototypes -Werror=implicit-function-declaration   -I. -I./Include -I/usr/local/opt/readline/include -I/usr/local/opt/readline/include -I/usr/local/opt/openssl/include -I/usr/local/var/pyenv/versions/3.7.1/include  -I/usr/local/opt/readline/include -I/usr/local/opt/readline/include -I/usr/local/opt/openssl/include -I/usr/local/var/pyenv/versions/3.7.1/include   -DPy_BUILD_CORE -o Objects/classobject.o Objects/classobject.c
  738. clang -c -Wno-unused-result -Wsign-compare -Wunreachable-code -DNDEBUG -g -fwrapv -O3 -Wall -I/usr/local/opt/openssl/include  -I/usr/local/opt/openssl/include  -std=c99 -Wextra -Wno-unused-result -Wno-unused-parameter -Wno-missing-field-initializers -Wstrict-prototypes -Werror=implicit-function-declaration   -I. -I./Include -I/usr/local/opt/readline/include -I/usr/local/opt/readline/include -I/usr/local/opt/openssl/include -I/usr/local/var/pyenv/versions/3.7.1/include  -I/usr/local/opt/readline/include -I/usr/local/opt/readline/include -I/usr/local/opt/openssl/include -I/usr/local/var/pyenv/versions/3.7.1/include   -DPy_BUILD_CORE -o Objects/codeobject.o Objects/codeobject.c
  739. clang -c -Wno-unused-result -Wsign-compare -Wunreachable-code -DNDEBUG -g -fwrapv -O3 -Wall -I/usr/local/opt/openssl/include  -I/usr/local/opt/openssl/include  -std=c99 -Wextra -Wno-unused-result -Wno-unused-parameter -Wno-missing-field-initializers -Wstrict-prototypes -Werror=implicit-function-declaration   -I. -I./Include -I/usr/local/opt/readline/include -I/usr/local/opt/readline/include -I/usr/local/opt/openssl/include -I/usr/local/var/pyenv/versions/3.7.1/include  -I/usr/local/opt/readline/include -I/usr/local/opt/readline/include -I/usr/local/opt/openssl/include -I/usr/local/var/pyenv/versions/3.7.1/include   -DPy_BUILD_CORE -o Objects/complexobject.o Objects/complexobject.c
  740. clang -c -Wno-unused-result -Wsign-compare -Wunreachable-code -DNDEBUG -g -fwrapv -O3 -Wall -I/usr/local/opt/openssl/include  -I/usr/local/opt/openssl/include  -std=c99 -Wextra -Wno-unused-result -Wno-unused-parameter -Wno-missing-field-initializers -Wstrict-prototypes -Werror=implicit-function-declaration   -I. -I./Include -I/usr/local/opt/readline/include -I/usr/local/opt/readline/include -I/usr/local/opt/openssl/include -I/usr/local/var/pyenv/versions/3.7.1/include  -I/usr/local/opt/readline/include -I/usr/local/opt/readline/include -I/usr/local/opt/openssl/include -I/usr/local/var/pyenv/versions/3.7.1/include   -DPy_BUILD_CORE -o Objects/descrobject.o Objects/descrobject.c
  741. clang -c -Wno-unused-result -Wsign-compare -Wunreachable-code -DNDEBUG -g -fwrapv -O3 -Wall -I/usr/local/opt/openssl/include  -I/usr/local/opt/openssl/include  -std=c99 -Wextra -Wno-unused-result -Wno-unused-parameter -Wno-missing-field-initializers -Wstrict-prototypes -Werror=implicit-function-declaration   -I. -I./Include -I/usr/local/opt/readline/include -I/usr/local/opt/readline/include -I/usr/local/opt/openssl/include -I/usr/local/var/pyenv/versions/3.7.1/include  -I/usr/local/opt/readline/include -I/usr/local/opt/readline/include -I/usr/local/opt/openssl/include -I/usr/local/var/pyenv/versions/3.7.1/include   -DPy_BUILD_CORE -o Objects/enumobject.o Objects/enumobject.c
  742. clang -c -Wno-unused-result -Wsign-compare -Wunreachable-code -DNDEBUG -g -fwrapv -O3 -Wall -I/usr/local/opt/openssl/include  -I/usr/local/opt/openssl/include  -std=c99 -Wextra -Wno-unused-result -Wno-unused-parameter -Wno-missing-field-initializers -Wstrict-prototypes -Werror=implicit-function-declaration   -I. -I./Include -I/usr/local/opt/readline/include -I/usr/local/opt/readline/include -I/usr/local/opt/openssl/include -I/usr/local/var/pyenv/versions/3.7.1/include  -I/usr/local/opt/readline/include -I/usr/local/opt/readline/include -I/usr/local/opt/openssl/include -I/usr/local/var/pyenv/versions/3.7.1/include   -DPy_BUILD_CORE -o Objects/exceptions.o Objects/exceptions.c
  743. clang -c -Wno-unused-result -Wsign-compare -Wunreachable-code -DNDEBUG -g -fwrapv -O3 -Wall -I/usr/local/opt/openssl/include  -I/usr/local/opt/openssl/include  -std=c99 -Wextra -Wno-unused-result -Wno-unused-parameter -Wno-missing-field-initializers -Wstrict-prototypes -Werror=implicit-function-declaration   -I. -I./Include -I/usr/local/opt/readline/include -I/usr/local/opt/readline/include -I/usr/local/opt/openssl/include -I/usr/local/var/pyenv/versions/3.7.1/include  -I/usr/local/opt/readline/include -I/usr/local/opt/readline/include -I/usr/local/opt/openssl/include -I/usr/local/var/pyenv/versions/3.7.1/include   -DPy_BUILD_CORE -o Objects/genobject.o Objects/genobject.c
  744. clang -c -Wno-unused-result -Wsign-compare -Wunreachable-code -DNDEBUG -g -fwrapv -O3 -Wall -I/usr/local/opt/openssl/include  -I/usr/local/opt/openssl/include  -std=c99 -Wextra -Wno-unused-result -Wno-unused-parameter -Wno-missing-field-initializers -Wstrict-prototypes -Werror=implicit-function-declaration   -I. -I./Include -I/usr/local/opt/readline/include -I/usr/local/opt/readline/include -I/usr/local/opt/openssl/include -I/usr/local/var/pyenv/versions/3.7.1/include  -I/usr/local/opt/readline/include -I/usr/local/opt/readline/include -I/usr/local/opt/openssl/include -I/usr/local/var/pyenv/versions/3.7.1/include   -DPy_BUILD_CORE -o Objects/fileobject.o Objects/fileobject.c
  745. clang -c -Wno-unused-result -Wsign-compare -Wunreachable-code -DNDEBUG -g -fwrapv -O3 -Wall -I/usr/local/opt/openssl/include  -I/usr/local/opt/openssl/include  -std=c99 -Wextra -Wno-unused-result -Wno-unused-parameter -Wno-missing-field-initializers -Wstrict-prototypes -Werror=implicit-function-declaration   -I. -I./Include -I/usr/local/opt/readline/include -I/usr/local/opt/readline/include -I/usr/local/opt/openssl/include -I/usr/local/var/pyenv/versions/3.7.1/include  -I/usr/local/opt/readline/include -I/usr/local/opt/readline/include -I/usr/local/opt/openssl/include -I/usr/local/var/pyenv/versions/3.7.1/include   -DPy_BUILD_CORE -o Objects/floatobject.o Objects/floatobject.c
  746. clang -c -Wno-unused-result -Wsign-compare -Wunreachable-code -DNDEBUG -g -fwrapv -O3 -Wall -I/usr/local/opt/openssl/include  -I/usr/local/opt/openssl/include  -std=c99 -Wextra -Wno-unused-result -Wno-unused-parameter -Wno-missing-field-initializers -Wstrict-prototypes -Werror=implicit-function-declaration   -I. -I./Include -I/usr/local/opt/readline/include -I/usr/local/opt/readline/include -I/usr/local/opt/openssl/include -I/usr/local/var/pyenv/versions/3.7.1/include  -I/usr/local/opt/readline/include -I/usr/local/opt/readline/include -I/usr/local/opt/openssl/include -I/usr/local/var/pyenv/versions/3.7.1/include   -DPy_BUILD_CORE -o Objects/frameobject.o Objects/frameobject.c
  747. clang -c -Wno-unused-result -Wsign-compare -Wunreachable-code -DNDEBUG -g -fwrapv -O3 -Wall -I/usr/local/opt/openssl/include  -I/usr/local/opt/openssl/include  -std=c99 -Wextra -Wno-unused-result -Wno-unused-parameter -Wno-missing-field-initializers -Wstrict-prototypes -Werror=implicit-function-declaration   -I. -I./Include -I/usr/local/opt/readline/include -I/usr/local/opt/readline/include -I/usr/local/opt/openssl/include -I/usr/local/var/pyenv/versions/3.7.1/include  -I/usr/local/opt/readline/include -I/usr/local/opt/readline/include -I/usr/local/opt/openssl/include -I/usr/local/var/pyenv/versions/3.7.1/include   -DPy_BUILD_CORE -o Objects/funcobject.o Objects/funcobject.c
  748. clang -c -Wno-unused-result -Wsign-compare -Wunreachable-code -DNDEBUG -g -fwrapv -O3 -Wall -I/usr/local/opt/openssl/include  -I/usr/local/opt/openssl/include  -std=c99 -Wextra -Wno-unused-result -Wno-unused-parameter -Wno-missing-field-initializers -Wstrict-prototypes -Werror=implicit-function-declaration   -I. -I./Include -I/usr/local/opt/readline/include -I/usr/local/opt/readline/include -I/usr/local/opt/openssl/include -I/usr/local/var/pyenv/versions/3.7.1/include  -I/usr/local/opt/readline/include -I/usr/local/opt/readline/include -I/usr/local/opt/openssl/include -I/usr/local/var/pyenv/versions/3.7.1/include   -DPy_BUILD_CORE -o Objects/iterobject.o Objects/iterobject.c
  749. clang -c -Wno-unused-result -Wsign-compare -Wunreachable-code -DNDEBUG -g -fwrapv -O3 -Wall -I/usr/local/opt/openssl/include  -I/usr/local/opt/openssl/include  -std=c99 -Wextra -Wno-unused-result -Wno-unused-parameter -Wno-missing-field-initializers -Wstrict-prototypes -Werror=implicit-function-declaration   -I. -I./Include -I/usr/local/opt/readline/include -I/usr/local/opt/readline/include -I/usr/local/opt/openssl/include -I/usr/local/var/pyenv/versions/3.7.1/include  -I/usr/local/opt/readline/include -I/usr/local/opt/readline/include -I/usr/local/opt/openssl/include -I/usr/local/var/pyenv/versions/3.7.1/include   -DPy_BUILD_CORE -o Objects/listobject.o Objects/listobject.c
  750. clang -c -Wno-unused-result -Wsign-compare -Wunreachable-code -DNDEBUG -g -fwrapv -O3 -Wall -I/usr/local/opt/openssl/include  -I/usr/local/opt/openssl/include  -std=c99 -Wextra -Wno-unused-result -Wno-unused-parameter -Wno-missing-field-initializers -Wstrict-prototypes -Werror=implicit-function-declaration   -I. -I./Include -I/usr/local/opt/readline/include -I/usr/local/opt/readline/include -I/usr/local/opt/openssl/include -I/usr/local/var/pyenv/versions/3.7.1/include  -I/usr/local/opt/readline/include -I/usr/local/opt/readline/include -I/usr/local/opt/openssl/include -I/usr/local/var/pyenv/versions/3.7.1/include   -DPy_BUILD_CORE -o Objects/longobject.o Objects/longobject.c
  751. clang -c -Wno-unused-result -Wsign-compare -Wunreachable-code -DNDEBUG -g -fwrapv -O3 -Wall -I/usr/local/opt/openssl/include  -I/usr/local/opt/openssl/include  -std=c99 -Wextra -Wno-unused-result -Wno-unused-parameter -Wno-missing-field-initializers -Wstrict-prototypes -Werror=implicit-function-declaration   -I. -I./Include -I/usr/local/opt/readline/include -I/usr/local/opt/readline/include -I/usr/local/opt/openssl/include -I/usr/local/var/pyenv/versions/3.7.1/include  -I/usr/local/opt/readline/include -I/usr/local/opt/readline/include -I/usr/local/opt/openssl/include -I/usr/local/var/pyenv/versions/3.7.1/include   -DPy_BUILD_CORE -o Objects/dictobject.o Objects/dictobject.c
  752. clang -c -Wno-unused-result -Wsign-compare -Wunreachable-code -DNDEBUG -g -fwrapv -O3 -Wall -I/usr/local/opt/openssl/include  -I/usr/local/opt/openssl/include  -std=c99 -Wextra -Wno-unused-result -Wno-unused-parameter -Wno-missing-field-initializers -Wstrict-prototypes -Werror=implicit-function-declaration   -I. -I./Include -I/usr/local/opt/readline/include -I/usr/local/opt/readline/include -I/usr/local/opt/openssl/include -I/usr/local/var/pyenv/versions/3.7.1/include  -I/usr/local/opt/readline/include -I/usr/local/opt/readline/include -I/usr/local/opt/openssl/include -I/usr/local/var/pyenv/versions/3.7.1/include   -DPy_BUILD_CORE -o Objects/odictobject.o Objects/odictobject.c
  753. clang -c -Wno-unused-result -Wsign-compare -Wunreachable-code -DNDEBUG -g -fwrapv -O3 -Wall -I/usr/local/opt/openssl/include  -I/usr/local/opt/openssl/include  -std=c99 -Wextra -Wno-unused-result -Wno-unused-parameter -Wno-missing-field-initializers -Wstrict-prototypes -Werror=implicit-function-declaration   -I. -I./Include -I/usr/local/opt/readline/include -I/usr/local/opt/readline/include -I/usr/local/opt/openssl/include -I/usr/local/var/pyenv/versions/3.7.1/include  -I/usr/local/opt/readline/include -I/usr/local/opt/readline/include -I/usr/local/opt/openssl/include -I/usr/local/var/pyenv/versions/3.7.1/include   -DPy_BUILD_CORE -o Objects/memoryobject.o Objects/memoryobject.c
  754. clang -c -Wno-unused-result -Wsign-compare -Wunreachable-code -DNDEBUG -g -fwrapv -O3 -Wall -I/usr/local/opt/openssl/include  -I/usr/local/opt/openssl/include  -std=c99 -Wextra -Wno-unused-result -Wno-unused-parameter -Wno-missing-field-initializers -Wstrict-prototypes -Werror=implicit-function-declaration   -I. -I./Include -I/usr/local/opt/readline/include -I/usr/local/opt/readline/include -I/usr/local/opt/openssl/include -I/usr/local/var/pyenv/versions/3.7.1/include  -I/usr/local/opt/readline/include -I/usr/local/opt/readline/include -I/usr/local/opt/openssl/include -I/usr/local/var/pyenv/versions/3.7.1/include   -DPy_BUILD_CORE -o Objects/methodobject.o Objects/methodobject.c
  755. clang -c -Wno-unused-result -Wsign-compare -Wunreachable-code -DNDEBUG -g -fwrapv -O3 -Wall -I/usr/local/opt/openssl/include  -I/usr/local/opt/openssl/include  -std=c99 -Wextra -Wno-unused-result -Wno-unused-parameter -Wno-missing-field-initializers -Wstrict-prototypes -Werror=implicit-function-declaration   -I. -I./Include -I/usr/local/opt/readline/include -I/usr/local/opt/readline/include -I/usr/local/opt/openssl/include -I/usr/local/var/pyenv/versions/3.7.1/include  -I/usr/local/opt/readline/include -I/usr/local/opt/readline/include -I/usr/local/opt/openssl/include -I/usr/local/var/pyenv/versions/3.7.1/include   -DPy_BUILD_CORE -o Objects/moduleobject.o Objects/moduleobject.c
  756. clang -c -Wno-unused-result -Wsign-compare -Wunreachable-code -DNDEBUG -g -fwrapv -O3 -Wall -I/usr/local/opt/openssl/include  -I/usr/local/opt/openssl/include  -std=c99 -Wextra -Wno-unused-result -Wno-unused-parameter -Wno-missing-field-initializers -Wstrict-prototypes -Werror=implicit-function-declaration   -I. -I./Include -I/usr/local/opt/readline/include -I/usr/local/opt/readline/include -I/usr/local/opt/openssl/include -I/usr/local/var/pyenv/versions/3.7.1/include  -I/usr/local/opt/readline/include -I/usr/local/opt/readline/include -I/usr/local/opt/openssl/include -I/usr/local/var/pyenv/versions/3.7.1/include   -DPy_BUILD_CORE -o Objects/namespaceobject.o Objects/namespaceobject.c
  757. clang -c -Wno-unused-result -Wsign-compare -Wunreachable-code -DNDEBUG -g -fwrapv -O3 -Wall -I/usr/local/opt/openssl/include  -I/usr/local/opt/openssl/include  -std=c99 -Wextra -Wno-unused-result -Wno-unused-parameter -Wno-missing-field-initializers -Wstrict-prototypes -Werror=implicit-function-declaration   -I. -I./Include -I/usr/local/opt/readline/include -I/usr/local/opt/readline/include -I/usr/local/opt/openssl/include -I/usr/local/var/pyenv/versions/3.7.1/include  -I/usr/local/opt/readline/include -I/usr/local/opt/readline/include -I/usr/local/opt/openssl/include -I/usr/local/var/pyenv/versions/3.7.1/include   -DPy_BUILD_CORE -o Objects/object.o Objects/object.c
  758. clang -c -Wno-unused-result -Wsign-compare -Wunreachable-code -DNDEBUG -g -fwrapv -O3 -Wall -I/usr/local/opt/openssl/include  -I/usr/local/opt/openssl/include  -std=c99 -Wextra -Wno-unused-result -Wno-unused-parameter -Wno-missing-field-initializers -Wstrict-prototypes -Werror=implicit-function-declaration   -I. -I./Include -I/usr/local/opt/readline/include -I/usr/local/opt/readline/include -I/usr/local/opt/openssl/include -I/usr/local/var/pyenv/versions/3.7.1/include  -I/usr/local/opt/readline/include -I/usr/local/opt/readline/include -I/usr/local/opt/openssl/include -I/usr/local/var/pyenv/versions/3.7.1/include   -DPy_BUILD_CORE -o Objects/obmalloc.o Objects/obmalloc.c
  759. clang -c -Wno-unused-result -Wsign-compare -Wunreachable-code -DNDEBUG -g -fwrapv -O3 -Wall -I/usr/local/opt/openssl/include  -I/usr/local/opt/openssl/include  -std=c99 -Wextra -Wno-unused-result -Wno-unused-parameter -Wno-missing-field-initializers -Wstrict-prototypes -Werror=implicit-function-declaration   -I. -I./Include -I/usr/local/opt/readline/include -I/usr/local/opt/readline/include -I/usr/local/opt/openssl/include -I/usr/local/var/pyenv/versions/3.7.1/include  -I/usr/local/opt/readline/include -I/usr/local/opt/readline/include -I/usr/local/opt/openssl/include -I/usr/local/var/pyenv/versions/3.7.1/include   -DPy_BUILD_CORE -o Objects/capsule.o Objects/capsule.c
  760. clang -c -Wno-unused-result -Wsign-compare -Wunreachable-code -DNDEBUG -g -fwrapv -O3 -Wall -I/usr/local/opt/openssl/include  -I/usr/local/opt/openssl/include  -std=c99 -Wextra -Wno-unused-result -Wno-unused-parameter -Wno-missing-field-initializers -Wstrict-prototypes -Werror=implicit-function-declaration   -I. -I./Include -I/usr/local/opt/readline/include -I/usr/local/opt/readline/include -I/usr/local/opt/openssl/include -I/usr/local/var/pyenv/versions/3.7.1/include  -I/usr/local/opt/readline/include -I/usr/local/opt/readline/include -I/usr/local/opt/openssl/include -I/usr/local/var/pyenv/versions/3.7.1/include   -DPy_BUILD_CORE -o Objects/rangeobject.o Objects/rangeobject.c
  761. clang -c -Wno-unused-result -Wsign-compare -Wunreachable-code -DNDEBUG -g -fwrapv -O3 -Wall -I/usr/local/opt/openssl/include  -I/usr/local/opt/openssl/include  -std=c99 -Wextra -Wno-unused-result -Wno-unused-parameter -Wno-missing-field-initializers -Wstrict-prototypes -Werror=implicit-function-declaration   -I. -I./Include -I/usr/local/opt/readline/include -I/usr/local/opt/readline/include -I/usr/local/opt/openssl/include -I/usr/local/var/pyenv/versions/3.7.1/include  -I/usr/local/opt/readline/include -I/usr/local/opt/readline/include -I/usr/local/opt/openssl/include -I/usr/local/var/pyenv/versions/3.7.1/include   -DPy_BUILD_CORE -o Objects/setobject.o Objects/setobject.c
  762. clang -c -Wno-unused-result -Wsign-compare -Wunreachable-code -DNDEBUG -g -fwrapv -O3 -Wall -I/usr/local/opt/openssl/include  -I/usr/local/opt/openssl/include  -std=c99 -Wextra -Wno-unused-result -Wno-unused-parameter -Wno-missing-field-initializers -Wstrict-prototypes -Werror=implicit-function-declaration   -I. -I./Include -I/usr/local/opt/readline/include -I/usr/local/opt/readline/include -I/usr/local/opt/openssl/include -I/usr/local/var/pyenv/versions/3.7.1/include  -I/usr/local/opt/readline/include -I/usr/local/opt/readline/include -I/usr/local/opt/openssl/include -I/usr/local/var/pyenv/versions/3.7.1/include   -DPy_BUILD_CORE -o Objects/sliceobject.o Objects/sliceobject.c
  763. clang -c -Wno-unused-result -Wsign-compare -Wunreachable-code -DNDEBUG -g -fwrapv -O3 -Wall -I/usr/local/opt/openssl/include  -I/usr/local/opt/openssl/include  -std=c99 -Wextra -Wno-unused-result -Wno-unused-parameter -Wno-missing-field-initializers -Wstrict-prototypes -Werror=implicit-function-declaration   -I. -I./Include -I/usr/local/opt/readline/include -I/usr/local/opt/readline/include -I/usr/local/opt/openssl/include -I/usr/local/var/pyenv/versions/3.7.1/include  -I/usr/local/opt/readline/include -I/usr/local/opt/readline/include -I/usr/local/opt/openssl/include -I/usr/local/var/pyenv/versions/3.7.1/include   -DPy_BUILD_CORE -o Objects/structseq.o Objects/structseq.c
  764. clang -c -Wno-unused-result -Wsign-compare -Wunreachable-code -DNDEBUG -g -fwrapv -O3 -Wall -I/usr/local/opt/openssl/include  -I/usr/local/opt/openssl/include  -std=c99 -Wextra -Wno-unused-result -Wno-unused-parameter -Wno-missing-field-initializers -Wstrict-prototypes -Werror=implicit-function-declaration   -I. -I./Include -I/usr/local/opt/readline/include -I/usr/local/opt/readline/include -I/usr/local/opt/openssl/include -I/usr/local/var/pyenv/versions/3.7.1/include  -I/usr/local/opt/readline/include -I/usr/local/opt/readline/include -I/usr/local/opt/openssl/include -I/usr/local/var/pyenv/versions/3.7.1/include   -DPy_BUILD_CORE -o Objects/tupleobject.o Objects/tupleobject.c
  765. clang -c -Wno-unused-result -Wsign-compare -Wunreachable-code -DNDEBUG -g -fwrapv -O3 -Wall -I/usr/local/opt/openssl/include  -I/usr/local/opt/openssl/include  -std=c99 -Wextra -Wno-unused-result -Wno-unused-parameter -Wno-missing-field-initializers -Wstrict-prototypes -Werror=implicit-function-declaration   -I. -I./Include -I/usr/local/opt/readline/include -I/usr/local/opt/readline/include -I/usr/local/opt/openssl/include -I/usr/local/var/pyenv/versions/3.7.1/include  -I/usr/local/opt/readline/include -I/usr/local/opt/readline/include -I/usr/local/opt/openssl/include -I/usr/local/var/pyenv/versions/3.7.1/include   -DPy_BUILD_CORE -o Objects/typeobject.o Objects/typeobject.c
  766. clang -c -Wno-unused-result -Wsign-compare -Wunreachable-code -DNDEBUG -g -fwrapv -O3 -Wall -I/usr/local/opt/openssl/include  -I/usr/local/opt/openssl/include  -std=c99 -Wextra -Wno-unused-result -Wno-unused-parameter -Wno-missing-field-initializers -Wstrict-prototypes -Werror=implicit-function-declaration   -I. -I./Include -I/usr/local/opt/readline/include -I/usr/local/opt/readline/include -I/usr/local/opt/openssl/include -I/usr/local/var/pyenv/versions/3.7.1/include  -I/usr/local/opt/readline/include -I/usr/local/opt/readline/include -I/usr/local/opt/openssl/include -I/usr/local/var/pyenv/versions/3.7.1/include   -DPy_BUILD_CORE -o Objects/unicodeobject.o Objects/unicodeobject.c
  767. clang -c -Wno-unused-result -Wsign-compare -Wunreachable-code -DNDEBUG -g -fwrapv -O3 -Wall -I/usr/local/opt/openssl/include  -I/usr/local/opt/openssl/include  -std=c99 -Wextra -Wno-unused-result -Wno-unused-parameter -Wno-missing-field-initializers -Wstrict-prototypes -Werror=implicit-function-declaration   -I. -I./Include -I/usr/local/opt/readline/include -I/usr/local/opt/readline/include -I/usr/local/opt/openssl/include -I/usr/local/var/pyenv/versions/3.7.1/include  -I/usr/local/opt/readline/include -I/usr/local/opt/readline/include -I/usr/local/opt/openssl/include -I/usr/local/var/pyenv/versions/3.7.1/include   -DPy_BUILD_CORE -o Objects/unicodectype.o Objects/unicodectype.c
  768. clang -c -Wno-unused-result -Wsign-compare -Wunreachable-code -DNDEBUG -g -fwrapv -O3 -Wall -I/usr/local/opt/openssl/include  -I/usr/local/opt/openssl/include  -std=c99 -Wextra -Wno-unused-result -Wno-unused-parameter -Wno-missing-field-initializers -Wstrict-prototypes -Werror=implicit-function-declaration   -I. -I./Include -I/usr/local/opt/readline/include -I/usr/local/opt/readline/include -I/usr/local/opt/openssl/include -I/usr/local/var/pyenv/versions/3.7.1/include  -I/usr/local/opt/readline/include -I/usr/local/opt/readline/include -I/usr/local/opt/openssl/include -I/usr/local/var/pyenv/versions/3.7.1/include   -DPy_BUILD_CORE -o Objects/weakrefobject.o Objects/weakrefobject.c
  769. clang -c -Wno-unused-result -Wsign-compare -Wunreachable-code -DNDEBUG -g -fwrapv -O3 -Wall -I/usr/local/opt/openssl/include  -I/usr/local/opt/openssl/include  -std=c99 -Wextra -Wno-unused-result -Wno-unused-parameter -Wno-missing-field-initializers -Wstrict-prototypes -Werror=implicit-function-declaration   -I. -I./Include -I/usr/local/opt/readline/include -I/usr/local/opt/readline/include -I/usr/local/opt/openssl/include -I/usr/local/var/pyenv/versions/3.7.1/include  -I/usr/local/opt/readline/include -I/usr/local/opt/readline/include -I/usr/local/opt/openssl/include -I/usr/local/var/pyenv/versions/3.7.1/include   -DPy_BUILD_CORE -o Python/_warnings.o Python/_warnings.c
  770. clang -c -Wno-unused-result -Wsign-compare -Wunreachable-code -DNDEBUG -g -fwrapv -O3 -Wall -I/usr/local/opt/openssl/include  -I/usr/local/opt/openssl/include  -std=c99 -Wextra -Wno-unused-result -Wno-unused-parameter -Wno-missing-field-initializers -Wstrict-prototypes -Werror=implicit-function-declaration   -I. -I./Include -I/usr/local/opt/readline/include -I/usr/local/opt/readline/include -I/usr/local/opt/openssl/include -I/usr/local/var/pyenv/versions/3.7.1/include  -I/usr/local/opt/readline/include -I/usr/local/opt/readline/include -I/usr/local/opt/openssl/include -I/usr/local/var/pyenv/versions/3.7.1/include   -DPy_BUILD_CORE -o Python/Python-ast.o Python/Python-ast.c
  771. clang -c -Wno-unused-result -Wsign-compare -Wunreachable-code -DNDEBUG -g -fwrapv -O3 -Wall -I/usr/local/opt/openssl/include  -I/usr/local/opt/openssl/include  -std=c99 -Wextra -Wno-unused-result -Wno-unused-parameter -Wno-missing-field-initializers -Wstrict-prototypes -Werror=implicit-function-declaration   -I. -I./Include -I/usr/local/opt/readline/include -I/usr/local/opt/readline/include -I/usr/local/opt/openssl/include -I/usr/local/var/pyenv/versions/3.7.1/include  -I/usr/local/opt/readline/include -I/usr/local/opt/readline/include -I/usr/local/opt/openssl/include -I/usr/local/var/pyenv/versions/3.7.1/include   -DPy_BUILD_CORE -o Python/asdl.o Python/asdl.c
  772. clang -c -Wno-unused-result -Wsign-compare -Wunreachable-code -DNDEBUG -g -fwrapv -O3 -Wall -I/usr/local/opt/openssl/include  -I/usr/local/opt/openssl/include  -std=c99 -Wextra -Wno-unused-result -Wno-unused-parameter -Wno-missing-field-initializers -Wstrict-prototypes -Werror=implicit-function-declaration   -I. -I./Include -I/usr/local/opt/readline/include -I/usr/local/opt/readline/include -I/usr/local/opt/openssl/include -I/usr/local/var/pyenv/versions/3.7.1/include  -I/usr/local/opt/readline/include -I/usr/local/opt/readline/include -I/usr/local/opt/openssl/include -I/usr/local/var/pyenv/versions/3.7.1/include   -DPy_BUILD_CORE -o Python/ast.o Python/ast.c
  773. clang -c -Wno-unused-result -Wsign-compare -Wunreachable-code -DNDEBUG -g -fwrapv -O3 -Wall -I/usr/local/opt/openssl/include  -I/usr/local/opt/openssl/include  -std=c99 -Wextra -Wno-unused-result -Wno-unused-parameter -Wno-missing-field-initializers -Wstrict-prototypes -Werror=implicit-function-declaration   -I. -I./Include -I/usr/local/opt/readline/include -I/usr/local/opt/readline/include -I/usr/local/opt/openssl/include -I/usr/local/var/pyenv/versions/3.7.1/include  -I/usr/local/opt/readline/include -I/usr/local/opt/readline/include -I/usr/local/opt/openssl/include -I/usr/local/var/pyenv/versions/3.7.1/include   -DPy_BUILD_CORE -o Python/ast_opt.o Python/ast_opt.c
  774. clang -c -Wno-unused-result -Wsign-compare -Wunreachable-code -DNDEBUG -g -fwrapv -O3 -Wall -I/usr/local/opt/openssl/include  -I/usr/local/opt/openssl/include  -std=c99 -Wextra -Wno-unused-result -Wno-unused-parameter -Wno-missing-field-initializers -Wstrict-prototypes -Werror=implicit-function-declaration   -I. -I./Include -I/usr/local/opt/readline/include -I/usr/local/opt/readline/include -I/usr/local/opt/openssl/include -I/usr/local/var/pyenv/versions/3.7.1/include  -I/usr/local/opt/readline/include -I/usr/local/opt/readline/include -I/usr/local/opt/openssl/include -I/usr/local/var/pyenv/versions/3.7.1/include   -DPy_BUILD_CORE -o Python/ast_unparse.o Python/ast_unparse.c
  775. clang -c -Wno-unused-result -Wsign-compare -Wunreachable-code -DNDEBUG -g -fwrapv -O3 -Wall -I/usr/local/opt/openssl/include  -I/usr/local/opt/openssl/include  -std=c99 -Wextra -Wno-unused-result -Wno-unused-parameter -Wno-missing-field-initializers -Wstrict-prototypes -Werror=implicit-function-declaration   -I. -I./Include -I/usr/local/opt/readline/include -I/usr/local/opt/readline/include -I/usr/local/opt/openssl/include -I/usr/local/var/pyenv/versions/3.7.1/include  -I/usr/local/opt/readline/include -I/usr/local/opt/readline/include -I/usr/local/opt/openssl/include -I/usr/local/var/pyenv/versions/3.7.1/include   -DPy_BUILD_CORE -o Python/bltinmodule.o Python/bltinmodule.c
  776. clang -c -Wno-unused-result -Wsign-compare -Wunreachable-code -DNDEBUG -g -fwrapv -O3 -Wall -I/usr/local/opt/openssl/include  -I/usr/local/opt/openssl/include  -std=c99 -Wextra -Wno-unused-result -Wno-unused-parameter -Wno-missing-field-initializers -Wstrict-prototypes -Werror=implicit-function-declaration   -I. -I./Include -I/usr/local/opt/readline/include -I/usr/local/opt/readline/include -I/usr/local/opt/openssl/include -I/usr/local/var/pyenv/versions/3.7.1/include  -I/usr/local/opt/readline/include -I/usr/local/opt/readline/include -I/usr/local/opt/openssl/include -I/usr/local/var/pyenv/versions/3.7.1/include   -DPy_BUILD_CORE -o Python/ceval.o Python/ceval.c
  777. clang -c -Wno-unused-result -Wsign-compare -Wunreachable-code -DNDEBUG -g -fwrapv -O3 -Wall -I/usr/local/opt/openssl/include  -I/usr/local/opt/openssl/include  -std=c99 -Wextra -Wno-unused-result -Wno-unused-parameter -Wno-missing-field-initializers -Wstrict-prototypes -Werror=implicit-function-declaration   -I. -I./Include -I/usr/local/opt/readline/include -I/usr/local/opt/readline/include -I/usr/local/opt/openssl/include -I/usr/local/var/pyenv/versions/3.7.1/include  -I/usr/local/opt/readline/include -I/usr/local/opt/readline/include -I/usr/local/opt/openssl/include -I/usr/local/var/pyenv/versions/3.7.1/include   -DPy_BUILD_CORE -o Python/compile.o Python/compile.c
  778. clang -c -Wno-unused-result -Wsign-compare -Wunreachable-code -DNDEBUG -g -fwrapv -O3 -Wall -I/usr/local/opt/openssl/include  -I/usr/local/opt/openssl/include  -std=c99 -Wextra -Wno-unused-result -Wno-unused-parameter -Wno-missing-field-initializers -Wstrict-prototypes -Werror=implicit-function-declaration   -I. -I./Include -I/usr/local/opt/readline/include -I/usr/local/opt/readline/include -I/usr/local/opt/openssl/include -I/usr/local/var/pyenv/versions/3.7.1/include  -I/usr/local/opt/readline/include -I/usr/local/opt/readline/include -I/usr/local/opt/openssl/include -I/usr/local/var/pyenv/versions/3.7.1/include   -DPy_BUILD_CORE -o Python/codecs.o Python/codecs.c
  779. clang -c -Wno-unused-result -Wsign-compare -Wunreachable-code -DNDEBUG -g -fwrapv -O3 -Wall -I/usr/local/opt/openssl/include  -I/usr/local/opt/openssl/include  -std=c99 -Wextra -Wno-unused-result -Wno-unused-parameter -Wno-missing-field-initializers -Wstrict-prototypes -Werror=implicit-function-declaration   -I. -I./Include -I/usr/local/opt/readline/include -I/usr/local/opt/readline/include -I/usr/local/opt/openssl/include -I/usr/local/var/pyenv/versions/3.7.1/include  -I/usr/local/opt/readline/include -I/usr/local/opt/readline/include -I/usr/local/opt/openssl/include -I/usr/local/var/pyenv/versions/3.7.1/include   -DPy_BUILD_CORE -o Python/dynamic_annotations.o Python/dynamic_annotations.c
  780. clang -c -Wno-unused-result -Wsign-compare -Wunreachable-code -DNDEBUG -g -fwrapv -O3 -Wall -I/usr/local/opt/openssl/include  -I/usr/local/opt/openssl/include  -std=c99 -Wextra -Wno-unused-result -Wno-unused-parameter -Wno-missing-field-initializers -Wstrict-prototypes -Werror=implicit-function-declaration   -I. -I./Include -I/usr/local/opt/readline/include -I/usr/local/opt/readline/include -I/usr/local/opt/openssl/include -I/usr/local/var/pyenv/versions/3.7.1/include  -I/usr/local/opt/readline/include -I/usr/local/opt/readline/include -I/usr/local/opt/openssl/include -I/usr/local/var/pyenv/versions/3.7.1/include   -DPy_BUILD_CORE -o Python/errors.o Python/errors.c
  781. clang -c -Wno-unused-result -Wsign-compare -Wunreachable-code -DNDEBUG -g -fwrapv -O3 -Wall -I/usr/local/opt/openssl/include  -I/usr/local/opt/openssl/include  -std=c99 -Wextra -Wno-unused-result -Wno-unused-parameter -Wno-missing-field-initializers -Wstrict-prototypes -Werror=implicit-function-declaration   -I. -I./Include -I/usr/local/opt/readline/include -I/usr/local/opt/readline/include -I/usr/local/opt/openssl/include -I/usr/local/var/pyenv/versions/3.7.1/include  -I/usr/local/opt/readline/include -I/usr/local/opt/readline/include -I/usr/local/opt/openssl/include -I/usr/local/var/pyenv/versions/3.7.1/include   -DPy_BUILD_CORE -o Python/frozenmain.o Python/frozenmain.c
  782. clang -c -Wno-unused-result -Wsign-compare -Wunreachable-code -DNDEBUG -g -fwrapv -O3 -Wall -I/usr/local/opt/openssl/include  -I/usr/local/opt/openssl/include  -std=c99 -Wextra -Wno-unused-result -Wno-unused-parameter -Wno-missing-field-initializers -Wstrict-prototypes -Werror=implicit-function-declaration   -I. -I./Include -I/usr/local/opt/readline/include -I/usr/local/opt/readline/include -I/usr/local/opt/openssl/include -I/usr/local/var/pyenv/versions/3.7.1/include  -I/usr/local/opt/readline/include -I/usr/local/opt/readline/include -I/usr/local/opt/openssl/include -I/usr/local/var/pyenv/versions/3.7.1/include   -DPy_BUILD_CORE -o Python/future.o Python/future.c
  783. clang -c -Wno-unused-result -Wsign-compare -Wunreachable-code -DNDEBUG -g -fwrapv -O3 -Wall -I/usr/local/opt/openssl/include  -I/usr/local/opt/openssl/include  -std=c99 -Wextra -Wno-unused-result -Wno-unused-parameter -Wno-missing-field-initializers -Wstrict-prototypes -Werror=implicit-function-declaration   -I. -I./Include -I/usr/local/opt/readline/include -I/usr/local/opt/readline/include -I/usr/local/opt/openssl/include -I/usr/local/var/pyenv/versions/3.7.1/include  -I/usr/local/opt/readline/include -I/usr/local/opt/readline/include -I/usr/local/opt/openssl/include -I/usr/local/var/pyenv/versions/3.7.1/include   -DPy_BUILD_CORE -o Python/getargs.o Python/getargs.c
  784. clang -c -Wno-unused-result -Wsign-compare -Wunreachable-code -DNDEBUG -g -fwrapv -O3 -Wall -I/usr/local/opt/openssl/include  -I/usr/local/opt/openssl/include  -std=c99 -Wextra -Wno-unused-result -Wno-unused-parameter -Wno-missing-field-initializers -Wstrict-prototypes -Werror=implicit-function-declaration   -I. -I./Include -I/usr/local/opt/readline/include -I/usr/local/opt/readline/include -I/usr/local/opt/openssl/include -I/usr/local/var/pyenv/versions/3.7.1/include  -I/usr/local/opt/readline/include -I/usr/local/opt/readline/include -I/usr/local/opt/openssl/include -I/usr/local/var/pyenv/versions/3.7.1/include   -DPy_BUILD_CORE -o Python/getcompiler.o Python/getcompiler.c
  785. clang -c -Wno-unused-result -Wsign-compare -Wunreachable-code -DNDEBUG -g -fwrapv -O3 -Wall -I/usr/local/opt/openssl/include  -I/usr/local/opt/openssl/include  -std=c99 -Wextra -Wno-unused-result -Wno-unused-parameter -Wno-missing-field-initializers -Wstrict-prototypes -Werror=implicit-function-declaration   -I. -I./Include -I/usr/local/opt/readline/include -I/usr/local/opt/readline/include -I/usr/local/opt/openssl/include -I/usr/local/var/pyenv/versions/3.7.1/include  -I/usr/local/opt/readline/include -I/usr/local/opt/readline/include -I/usr/local/opt/openssl/include -I/usr/local/var/pyenv/versions/3.7.1/include   -DPy_BUILD_CORE -o Python/getcopyright.o Python/getcopyright.c
  786. clang -c -Wno-unused-result -Wsign-compare -Wunreachable-code -DNDEBUG -g -fwrapv -O3 -Wall -I/usr/local/opt/openssl/include  -I/usr/local/opt/openssl/include  -std=c99 -Wextra -Wno-unused-result -Wno-unused-parameter -Wno-missing-field-initializers -Wstrict-prototypes -Werror=implicit-function-declaration   -I. -I./Include -I/usr/local/opt/readline/include -I/usr/local/opt/readline/include -I/usr/local/opt/openssl/include -I/usr/local/var/pyenv/versions/3.7.1/include  -I/usr/local/opt/readline/include -I/usr/local/opt/readline/include -I/usr/local/opt/openssl/include -I/usr/local/var/pyenv/versions/3.7.1/include   -DPy_BUILD_CORE -DPLATFORM='"darwin"' -o Python/getplatform.o ./Python/getplatform.c
  787. clang -c -Wno-unused-result -Wsign-compare -Wunreachable-code -DNDEBUG -g -fwrapv -O3 -Wall -I/usr/local/opt/openssl/include  -I/usr/local/opt/openssl/include  -std=c99 -Wextra -Wno-unused-result -Wno-unused-parameter -Wno-missing-field-initializers -Wstrict-prototypes -Werror=implicit-function-declaration   -I. -I./Include -I/usr/local/opt/readline/include -I/usr/local/opt/readline/include -I/usr/local/opt/openssl/include -I/usr/local/var/pyenv/versions/3.7.1/include  -I/usr/local/opt/readline/include -I/usr/local/opt/readline/include -I/usr/local/opt/openssl/include -I/usr/local/var/pyenv/versions/3.7.1/include   -DPy_BUILD_CORE -o Python/getversion.o Python/getversion.c
  788. clang -c -Wno-unused-result -Wsign-compare -Wunreachable-code -DNDEBUG -g -fwrapv -O3 -Wall -I/usr/local/opt/openssl/include  -I/usr/local/opt/openssl/include  -std=c99 -Wextra -Wno-unused-result -Wno-unused-parameter -Wno-missing-field-initializers -Wstrict-prototypes -Werror=implicit-function-declaration   -I. -I./Include -I/usr/local/opt/readline/include -I/usr/local/opt/readline/include -I/usr/local/opt/openssl/include -I/usr/local/var/pyenv/versions/3.7.1/include  -I/usr/local/opt/readline/include -I/usr/local/opt/readline/include -I/usr/local/opt/openssl/include -I/usr/local/var/pyenv/versions/3.7.1/include   -DPy_BUILD_CORE -o Python/graminit.o Python/graminit.c
  789. clang -c -Wno-unused-result -Wsign-compare -Wunreachable-code -DNDEBUG -g -fwrapv -O3 -Wall -I/usr/local/opt/openssl/include  -I/usr/local/opt/openssl/include  -std=c99 -Wextra -Wno-unused-result -Wno-unused-parameter -Wno-missing-field-initializers -Wstrict-prototypes -Werror=implicit-function-declaration   -I. -I./Include -I/usr/local/opt/readline/include -I/usr/local/opt/readline/include -I/usr/local/opt/openssl/include -I/usr/local/var/pyenv/versions/3.7.1/include  -I/usr/local/opt/readline/include -I/usr/local/opt/readline/include -I/usr/local/opt/openssl/include -I/usr/local/var/pyenv/versions/3.7.1/include   -DPy_BUILD_CORE -o Python/import.o Python/import.c
  790. clang -c -Wno-unused-result -Wsign-compare -Wunreachable-code -DNDEBUG -g -fwrapv -O3 -Wall -I/usr/local/opt/openssl/include  -I/usr/local/opt/openssl/include  -std=c99 -Wextra -Wno-unused-result -Wno-unused-parameter -Wno-missing-field-initializers -Wstrict-prototypes -Werror=implicit-function-declaration   -I. -I./Include -I/usr/local/opt/readline/include -I/usr/local/opt/readline/include -I/usr/local/opt/openssl/include -I/usr/local/var/pyenv/versions/3.7.1/include  -I/usr/local/opt/readline/include -I/usr/local/opt/readline/include -I/usr/local/opt/openssl/include -I/usr/local/var/pyenv/versions/3.7.1/include   -DPy_BUILD_CORE -I. -o Python/importdl.o ./Python/importdl.c
  791. clang -c -Wno-unused-result -Wsign-compare -Wunreachable-code -DNDEBUG -g -fwrapv -O3 -Wall -I/usr/local/opt/openssl/include  -I/usr/local/opt/openssl/include  -std=c99 -Wextra -Wno-unused-result -Wno-unused-parameter -Wno-missing-field-initializers -Wstrict-prototypes -Werror=implicit-function-declaration   -I. -I./Include -I/usr/local/opt/readline/include -I/usr/local/opt/readline/include -I/usr/local/opt/openssl/include -I/usr/local/var/pyenv/versions/3.7.1/include  -I/usr/local/opt/readline/include -I/usr/local/opt/readline/include -I/usr/local/opt/openssl/include -I/usr/local/var/pyenv/versions/3.7.1/include   -DPy_BUILD_CORE -o Python/marshal.o Python/marshal.c
  792. clang -c -Wno-unused-result -Wsign-compare -Wunreachable-code -DNDEBUG -g -fwrapv -O3 -Wall -I/usr/local/opt/openssl/include  -I/usr/local/opt/openssl/include  -std=c99 -Wextra -Wno-unused-result -Wno-unused-parameter -Wno-missing-field-initializers -Wstrict-prototypes -Werror=implicit-function-declaration   -I. -I./Include -I/usr/local/opt/readline/include -I/usr/local/opt/readline/include -I/usr/local/opt/openssl/include -I/usr/local/var/pyenv/versions/3.7.1/include  -I/usr/local/opt/readline/include -I/usr/local/opt/readline/include -I/usr/local/opt/openssl/include -I/usr/local/var/pyenv/versions/3.7.1/include   -DPy_BUILD_CORE -o Python/modsupport.o Python/modsupport.c
  793. clang -c -Wno-unused-result -Wsign-compare -Wunreachable-code -DNDEBUG -g -fwrapv -O3 -Wall -I/usr/local/opt/openssl/include  -I/usr/local/opt/openssl/include  -std=c99 -Wextra -Wno-unused-result -Wno-unused-parameter -Wno-missing-field-initializers -Wstrict-prototypes -Werror=implicit-function-declaration   -I. -I./Include -I/usr/local/opt/readline/include -I/usr/local/opt/readline/include -I/usr/local/opt/openssl/include -I/usr/local/var/pyenv/versions/3.7.1/include  -I/usr/local/opt/readline/include -I/usr/local/opt/readline/include -I/usr/local/opt/openssl/include -I/usr/local/var/pyenv/versions/3.7.1/include   -DPy_BUILD_CORE -o Python/mysnprintf.o Python/mysnprintf.c
  794. clang -c -Wno-unused-result -Wsign-compare -Wunreachable-code -DNDEBUG -g -fwrapv -O3 -Wall -I/usr/local/opt/openssl/include  -I/usr/local/opt/openssl/include  -std=c99 -Wextra -Wno-unused-result -Wno-unused-parameter -Wno-missing-field-initializers -Wstrict-prototypes -Werror=implicit-function-declaration   -I. -I./Include -I/usr/local/opt/readline/include -I/usr/local/opt/readline/include -I/usr/local/opt/openssl/include -I/usr/local/var/pyenv/versions/3.7.1/include  -I/usr/local/opt/readline/include -I/usr/local/opt/readline/include -I/usr/local/opt/openssl/include -I/usr/local/var/pyenv/versions/3.7.1/include   -DPy_BUILD_CORE -o Python/mystrtoul.o Python/mystrtoul.c
  795. clang -c -Wno-unused-result -Wsign-compare -Wunreachable-code -DNDEBUG -g -fwrapv -O3 -Wall -I/usr/local/opt/openssl/include  -I/usr/local/opt/openssl/include  -std=c99 -Wextra -Wno-unused-result -Wno-unused-parameter -Wno-missing-field-initializers -Wstrict-prototypes -Werror=implicit-function-declaration   -I. -I./Include -I/usr/local/opt/readline/include -I/usr/local/opt/readline/include -I/usr/local/opt/openssl/include -I/usr/local/var/pyenv/versions/3.7.1/include  -I/usr/local/opt/readline/include -I/usr/local/opt/readline/include -I/usr/local/opt/openssl/include -I/usr/local/var/pyenv/versions/3.7.1/include   -DPy_BUILD_CORE -o Python/pathconfig.o Python/pathconfig.c
  796. clang -c -Wno-unused-result -Wsign-compare -Wunreachable-code -DNDEBUG -g -fwrapv -O3 -Wall -I/usr/local/opt/openssl/include  -I/usr/local/opt/openssl/include  -std=c99 -Wextra -Wno-unused-result -Wno-unused-parameter -Wno-missing-field-initializers -Wstrict-prototypes -Werror=implicit-function-declaration   -I. -I./Include -I/usr/local/opt/readline/include -I/usr/local/opt/readline/include -I/usr/local/opt/openssl/include -I/usr/local/var/pyenv/versions/3.7.1/include  -I/usr/local/opt/readline/include -I/usr/local/opt/readline/include -I/usr/local/opt/openssl/include -I/usr/local/var/pyenv/versions/3.7.1/include   -DPy_BUILD_CORE -o Python/peephole.o Python/peephole.c
  797. clang -c -Wno-unused-result -Wsign-compare -Wunreachable-code -DNDEBUG -g -fwrapv -O3 -Wall -I/usr/local/opt/openssl/include  -I/usr/local/opt/openssl/include  -std=c99 -Wextra -Wno-unused-result -Wno-unused-parameter -Wno-missing-field-initializers -Wstrict-prototypes -Werror=implicit-function-declaration   -I. -I./Include -I/usr/local/opt/readline/include -I/usr/local/opt/readline/include -I/usr/local/opt/openssl/include -I/usr/local/var/pyenv/versions/3.7.1/include  -I/usr/local/opt/readline/include -I/usr/local/opt/readline/include -I/usr/local/opt/openssl/include -I/usr/local/var/pyenv/versions/3.7.1/include   -DPy_BUILD_CORE -o Python/pyarena.o Python/pyarena.c
  798. clang -c -Wno-unused-result -Wsign-compare -Wunreachable-code -DNDEBUG -g -fwrapv -O3 -Wall -I/usr/local/opt/openssl/include  -I/usr/local/opt/openssl/include  -std=c99 -Wextra -Wno-unused-result -Wno-unused-parameter -Wno-missing-field-initializers -Wstrict-prototypes -Werror=implicit-function-declaration   -I. -I./Include -I/usr/local/opt/readline/include -I/usr/local/opt/readline/include -I/usr/local/opt/openssl/include -I/usr/local/var/pyenv/versions/3.7.1/include  -I/usr/local/opt/readline/include -I/usr/local/opt/readline/include -I/usr/local/opt/openssl/include -I/usr/local/var/pyenv/versions/3.7.1/include   -DPy_BUILD_CORE -o Python/pyctype.o Python/pyctype.c
  799. clang -c -Wno-unused-result -Wsign-compare -Wunreachable-code -DNDEBUG -g -fwrapv -O3 -Wall -I/usr/local/opt/openssl/include  -I/usr/local/opt/openssl/include  -std=c99 -Wextra -Wno-unused-result -Wno-unused-parameter -Wno-missing-field-initializers -Wstrict-prototypes -Werror=implicit-function-declaration   -I. -I./Include -I/usr/local/opt/readline/include -I/usr/local/opt/readline/include -I/usr/local/opt/openssl/include -I/usr/local/var/pyenv/versions/3.7.1/include  -I/usr/local/opt/readline/include -I/usr/local/opt/readline/include -I/usr/local/opt/openssl/include -I/usr/local/var/pyenv/versions/3.7.1/include   -DPy_BUILD_CORE -o Python/pyfpe.o Python/pyfpe.c
  800. clang -c -Wno-unused-result -Wsign-compare -Wunreachable-code -DNDEBUG -g -fwrapv -O3 -Wall -I/usr/local/opt/openssl/include  -I/usr/local/opt/openssl/include  -std=c99 -Wextra -Wno-unused-result -Wno-unused-parameter -Wno-missing-field-initializers -Wstrict-prototypes -Werror=implicit-function-declaration   -I. -I./Include -I/usr/local/opt/readline/include -I/usr/local/opt/readline/include -I/usr/local/opt/openssl/include -I/usr/local/var/pyenv/versions/3.7.1/include  -I/usr/local/opt/readline/include -I/usr/local/opt/readline/include -I/usr/local/opt/openssl/include -I/usr/local/var/pyenv/versions/3.7.1/include   -DPy_BUILD_CORE -o Python/pyhash.o Python/pyhash.c
  801. clang -c -Wno-unused-result -Wsign-compare -Wunreachable-code -DNDEBUG -g -fwrapv -O3 -Wall -I/usr/local/opt/openssl/include  -I/usr/local/opt/openssl/include  -std=c99 -Wextra -Wno-unused-result -Wno-unused-parameter -Wno-missing-field-initializers -Wstrict-prototypes -Werror=implicit-function-declaration   -I. -I./Include -I/usr/local/opt/readline/include -I/usr/local/opt/readline/include -I/usr/local/opt/openssl/include -I/usr/local/var/pyenv/versions/3.7.1/include  -I/usr/local/opt/readline/include -I/usr/local/opt/readline/include -I/usr/local/opt/openssl/include -I/usr/local/var/pyenv/versions/3.7.1/include   -DPy_BUILD_CORE -o Python/pylifecycle.o Python/pylifecycle.c
  802. clang -c -Wno-unused-result -Wsign-compare -Wunreachable-code -DNDEBUG -g -fwrapv -O3 -Wall -I/usr/local/opt/openssl/include  -I/usr/local/opt/openssl/include  -std=c99 -Wextra -Wno-unused-result -Wno-unused-parameter -Wno-missing-field-initializers -Wstrict-prototypes -Werror=implicit-function-declaration   -I. -I./Include -I/usr/local/opt/readline/include -I/usr/local/opt/readline/include -I/usr/local/opt/openssl/include -I/usr/local/var/pyenv/versions/3.7.1/include  -I/usr/local/opt/readline/include -I/usr/local/opt/readline/include -I/usr/local/opt/openssl/include -I/usr/local/var/pyenv/versions/3.7.1/include   -DPy_BUILD_CORE -o Python/pymath.o Python/pymath.c
  803. clang -c -Wno-unused-result -Wsign-compare -Wunreachable-code -DNDEBUG -g -fwrapv -O3 -Wall -I/usr/local/opt/openssl/include  -I/usr/local/opt/openssl/include  -std=c99 -Wextra -Wno-unused-result -Wno-unused-parameter -Wno-missing-field-initializers -Wstrict-prototypes -Werror=implicit-function-declaration   -I. -I./Include -I/usr/local/opt/readline/include -I/usr/local/opt/readline/include -I/usr/local/opt/openssl/include -I/usr/local/var/pyenv/versions/3.7.1/include  -I/usr/local/opt/readline/include -I/usr/local/opt/readline/include -I/usr/local/opt/openssl/include -I/usr/local/var/pyenv/versions/3.7.1/include   -DPy_BUILD_CORE -o Python/pystate.o Python/pystate.c
  804. clang -c -Wno-unused-result -Wsign-compare -Wunreachable-code -DNDEBUG -g -fwrapv -O3 -Wall -I/usr/local/opt/openssl/include  -I/usr/local/opt/openssl/include  -std=c99 -Wextra -Wno-unused-result -Wno-unused-parameter -Wno-missing-field-initializers -Wstrict-prototypes -Werror=implicit-function-declaration   -I. -I./Include -I/usr/local/opt/readline/include -I/usr/local/opt/readline/include -I/usr/local/opt/openssl/include -I/usr/local/var/pyenv/versions/3.7.1/include  -I/usr/local/opt/readline/include -I/usr/local/opt/readline/include -I/usr/local/opt/openssl/include -I/usr/local/var/pyenv/versions/3.7.1/include   -DPy_BUILD_CORE -o Python/context.o Python/context.c
  805. clang -c -Wno-unused-result -Wsign-compare -Wunreachable-code -DNDEBUG -g -fwrapv -O3 -Wall -I/usr/local/opt/openssl/include  -I/usr/local/opt/openssl/include  -std=c99 -Wextra -Wno-unused-result -Wno-unused-parameter -Wno-missing-field-initializers -Wstrict-prototypes -Werror=implicit-function-declaration   -I. -I./Include -I/usr/local/opt/readline/include -I/usr/local/opt/readline/include -I/usr/local/opt/openssl/include -I/usr/local/var/pyenv/versions/3.7.1/include  -I/usr/local/opt/readline/include -I/usr/local/opt/readline/include -I/usr/local/opt/openssl/include -I/usr/local/var/pyenv/versions/3.7.1/include   -DPy_BUILD_CORE -o Python/hamt.o Python/hamt.c
  806. clang -c -Wno-unused-result -Wsign-compare -Wunreachable-code -DNDEBUG -g -fwrapv -O3 -Wall -I/usr/local/opt/openssl/include  -I/usr/local/opt/openssl/include  -std=c99 -Wextra -Wno-unused-result -Wno-unused-parameter -Wno-missing-field-initializers -Wstrict-prototypes -Werror=implicit-function-declaration   -I. -I./Include -I/usr/local/opt/readline/include -I/usr/local/opt/readline/include -I/usr/local/opt/openssl/include -I/usr/local/var/pyenv/versions/3.7.1/include  -I/usr/local/opt/readline/include -I/usr/local/opt/readline/include -I/usr/local/opt/openssl/include -I/usr/local/var/pyenv/versions/3.7.1/include   -DPy_BUILD_CORE -o Python/pythonrun.o Python/pythonrun.c
  807. clang -c -Wno-unused-result -Wsign-compare -Wunreachable-code -DNDEBUG -g -fwrapv -O3 -Wall -I/usr/local/opt/openssl/include  -I/usr/local/opt/openssl/include  -std=c99 -Wextra -Wno-unused-result -Wno-unused-parameter -Wno-missing-field-initializers -Wstrict-prototypes -Werror=implicit-function-declaration   -I. -I./Include -I/usr/local/opt/readline/include -I/usr/local/opt/readline/include -I/usr/local/opt/openssl/include -I/usr/local/var/pyenv/versions/3.7.1/include  -I/usr/local/opt/readline/include -I/usr/local/opt/readline/include -I/usr/local/opt/openssl/include -I/usr/local/var/pyenv/versions/3.7.1/include   -DPy_BUILD_CORE -o Python/pytime.o Python/pytime.c
  808. clang -c -Wno-unused-result -Wsign-compare -Wunreachable-code -DNDEBUG -g -fwrapv -O3 -Wall -I/usr/local/opt/openssl/include  -I/usr/local/opt/openssl/include  -std=c99 -Wextra -Wno-unused-result -Wno-unused-parameter -Wno-missing-field-initializers -Wstrict-prototypes -Werror=implicit-function-declaration   -I. -I./Include -I/usr/local/opt/readline/include -I/usr/local/opt/readline/include -I/usr/local/opt/openssl/include -I/usr/local/var/pyenv/versions/3.7.1/include  -I/usr/local/opt/readline/include -I/usr/local/opt/readline/include -I/usr/local/opt/openssl/include -I/usr/local/var/pyenv/versions/3.7.1/include   -DPy_BUILD_CORE -o Python/bootstrap_hash.o Python/bootstrap_hash.c
  809. clang -c -Wno-unused-result -Wsign-compare -Wunreachable-code -DNDEBUG -g -fwrapv -O3 -Wall -I/usr/local/opt/openssl/include  -I/usr/local/opt/openssl/include  -std=c99 -Wextra -Wno-unused-result -Wno-unused-parameter -Wno-missing-field-initializers -Wstrict-prototypes -Werror=implicit-function-declaration   -I. -I./Include -I/usr/local/opt/readline/include -I/usr/local/opt/readline/include -I/usr/local/opt/openssl/include -I/usr/local/var/pyenv/versions/3.7.1/include  -I/usr/local/opt/readline/include -I/usr/local/opt/readline/include -I/usr/local/opt/openssl/include -I/usr/local/var/pyenv/versions/3.7.1/include   -DPy_BUILD_CORE -o Python/structmember.o Python/structmember.c
  810. clang -c -Wno-unused-result -Wsign-compare -Wunreachable-code -DNDEBUG -g -fwrapv -O3 -Wall -I/usr/local/opt/openssl/include  -I/usr/local/opt/openssl/include  -std=c99 -Wextra -Wno-unused-result -Wno-unused-parameter -Wno-missing-field-initializers -Wstrict-prototypes -Werror=implicit-function-declaration   -I. -I./Include -I/usr/local/opt/readline/include -I/usr/local/opt/readline/include -I/usr/local/opt/openssl/include -I/usr/local/var/pyenv/versions/3.7.1/include  -I/usr/local/opt/readline/include -I/usr/local/opt/readline/include -I/usr/local/opt/openssl/include -I/usr/local/var/pyenv/versions/3.7.1/include   -DPy_BUILD_CORE -o Python/symtable.o Python/symtable.c
  811. clang -c -Wno-unused-result -Wsign-compare -Wunreachable-code -DNDEBUG -g -fwrapv -O3 -Wall -I/usr/local/opt/openssl/include  -I/usr/local/opt/openssl/include  -std=c99 -Wextra -Wno-unused-result -Wno-unused-parameter -Wno-missing-field-initializers -Wstrict-prototypes -Werror=implicit-function-declaration   -I. -I./Include -I/usr/local/opt/readline/include -I/usr/local/opt/readline/include -I/usr/local/opt/openssl/include -I/usr/local/var/pyenv/versions/3.7.1/include  -I/usr/local/opt/readline/include -I/usr/local/opt/readline/include -I/usr/local/opt/openssl/include -I/usr/local/var/pyenv/versions/3.7.1/include   -DPy_BUILD_CORE \
  812.     -DABIFLAGS='"m"' \
  813.     -DMULTIARCH=\"darwin\" \
  814.     -o Python/sysmodule.o ./Python/sysmodule.c
  815. clang -c -Wno-unused-result -Wsign-compare -Wunreachable-code -DNDEBUG -g -fwrapv -O3 -Wall -I/usr/local/opt/openssl/include  -I/usr/local/opt/openssl/include  -std=c99 -Wextra -Wno-unused-result -Wno-unused-parameter -Wno-missing-field-initializers -Wstrict-prototypes -Werror=implicit-function-declaration   -I. -I./Include -I/usr/local/opt/readline/include -I/usr/local/opt/readline/include -I/usr/local/opt/openssl/include -I/usr/local/var/pyenv/versions/3.7.1/include  -I/usr/local/opt/readline/include -I/usr/local/opt/readline/include -I/usr/local/opt/openssl/include -I/usr/local/var/pyenv/versions/3.7.1/include   -DPy_BUILD_CORE -o Python/thread.o Python/thread.c
  816. clang -c -Wno-unused-result -Wsign-compare -Wunreachable-code -DNDEBUG -g -fwrapv -O3 -Wall -I/usr/local/opt/openssl/include  -I/usr/local/opt/openssl/include  -std=c99 -Wextra -Wno-unused-result -Wno-unused-parameter -Wno-missing-field-initializers -Wstrict-prototypes -Werror=implicit-function-declaration   -I. -I./Include -I/usr/local/opt/readline/include -I/usr/local/opt/readline/include -I/usr/local/opt/openssl/include -I/usr/local/var/pyenv/versions/3.7.1/include  -I/usr/local/opt/readline/include -I/usr/local/opt/readline/include -I/usr/local/opt/openssl/include -I/usr/local/var/pyenv/versions/3.7.1/include   -DPy_BUILD_CORE -o Python/traceback.o Python/traceback.c
  817. clang -c -Wno-unused-result -Wsign-compare -Wunreachable-code -DNDEBUG -g -fwrapv -O3 -Wall -I/usr/local/opt/openssl/include  -I/usr/local/opt/openssl/include  -std=c99 -Wextra -Wno-unused-result -Wno-unused-parameter -Wno-missing-field-initializers -Wstrict-prototypes -Werror=implicit-function-declaration   -I. -I./Include -I/usr/local/opt/readline/include -I/usr/local/opt/readline/include -I/usr/local/opt/openssl/include -I/usr/local/var/pyenv/versions/3.7.1/include  -I/usr/local/opt/readline/include -I/usr/local/opt/readline/include -I/usr/local/opt/openssl/include -I/usr/local/var/pyenv/versions/3.7.1/include   -DPy_BUILD_CORE -o Python/getopt.o Python/getopt.c
  818. clang -c -Wno-unused-result -Wsign-compare -Wunreachable-code -DNDEBUG -g -fwrapv -O3 -Wall -I/usr/local/opt/openssl/include  -I/usr/local/opt/openssl/include  -std=c99 -Wextra -Wno-unused-result -Wno-unused-parameter -Wno-missing-field-initializers -Wstrict-prototypes -Werror=implicit-function-declaration   -I. -I./Include -I/usr/local/opt/readline/include -I/usr/local/opt/readline/include -I/usr/local/opt/openssl/include -I/usr/local/var/pyenv/versions/3.7.1/include  -I/usr/local/opt/readline/include -I/usr/local/opt/readline/include -I/usr/local/opt/openssl/include -I/usr/local/var/pyenv/versions/3.7.1/include   -DPy_BUILD_CORE -o Python/pystrcmp.o Python/pystrcmp.c
  819. clang -c -Wno-unused-result -Wsign-compare -Wunreachable-code -DNDEBUG -g -fwrapv -O3 -Wall -I/usr/local/opt/openssl/include  -I/usr/local/opt/openssl/include  -std=c99 -Wextra -Wno-unused-result -Wno-unused-parameter -Wno-missing-field-initializers -Wstrict-prototypes -Werror=implicit-function-declaration   -I. -I./Include -I/usr/local/opt/readline/include -I/usr/local/opt/readline/include -I/usr/local/opt/openssl/include -I/usr/local/var/pyenv/versions/3.7.1/include  -I/usr/local/opt/readline/include -I/usr/local/opt/readline/include -I/usr/local/opt/openssl/include -I/usr/local/var/pyenv/versions/3.7.1/include   -DPy_BUILD_CORE -o Python/pystrtod.o Python/pystrtod.c
  820. clang -c -Wno-unused-result -Wsign-compare -Wunreachable-code -DNDEBUG -g -fwrapv -O3 -Wall -I/usr/local/opt/openssl/include  -I/usr/local/opt/openssl/include  -std=c99 -Wextra -Wno-unused-result -Wno-unused-parameter -Wno-missing-field-initializers -Wstrict-prototypes -Werror=implicit-function-declaration   -I. -I./Include -I/usr/local/opt/readline/include -I/usr/local/opt/readline/include -I/usr/local/opt/openssl/include -I/usr/local/var/pyenv/versions/3.7.1/include  -I/usr/local/opt/readline/include -I/usr/local/opt/readline/include -I/usr/local/opt/openssl/include -I/usr/local/var/pyenv/versions/3.7.1/include   -DPy_BUILD_CORE -o Python/pystrhex.o Python/pystrhex.c
  821. clang -c -Wno-unused-result -Wsign-compare -Wunreachable-code -DNDEBUG -g -fwrapv -O3 -Wall -I/usr/local/opt/openssl/include  -I/usr/local/opt/openssl/include  -std=c99 -Wextra -Wno-unused-result -Wno-unused-parameter -Wno-missing-field-initializers -Wstrict-prototypes -Werror=implicit-function-declaration   -I. -I./Include -I/usr/local/opt/readline/include -I/usr/local/opt/readline/include -I/usr/local/opt/openssl/include -I/usr/local/var/pyenv/versions/3.7.1/include  -I/usr/local/opt/readline/include -I/usr/local/opt/readline/include -I/usr/local/opt/openssl/include -I/usr/local/var/pyenv/versions/3.7.1/include   -DPy_BUILD_CORE -fno-strict-aliasing -o Python/dtoa.o Python/dtoa.c
  822. clang -c -Wno-unused-result -Wsign-compare -Wunreachable-code -DNDEBUG -g -fwrapv -O3 -Wall -I/usr/local/opt/openssl/include  -I/usr/local/opt/openssl/include  -std=c99 -Wextra -Wno-unused-result -Wno-unused-parameter -Wno-missing-field-initializers -Wstrict-prototypes -Werror=implicit-function-declaration   -I. -I./Include -I/usr/local/opt/readline/include -I/usr/local/opt/readline/include -I/usr/local/opt/openssl/include -I/usr/local/var/pyenv/versions/3.7.1/include  -I/usr/local/opt/readline/include -I/usr/local/opt/readline/include -I/usr/local/opt/openssl/include -I/usr/local/var/pyenv/versions/3.7.1/include   -DPy_BUILD_CORE -o Python/formatter_unicode.o Python/formatter_unicode.c
  823. clang -c -Wno-unused-result -Wsign-compare -Wunreachable-code -DNDEBUG -g -fwrapv -O3 -Wall -I/usr/local/opt/openssl/include  -I/usr/local/opt/openssl/include  -std=c99 -Wextra -Wno-unused-result -Wno-unused-parameter -Wno-missing-field-initializers -Wstrict-prototypes -Werror=implicit-function-declaration   -I. -I./Include -I/usr/local/opt/readline/include -I/usr/local/opt/readline/include -I/usr/local/opt/openssl/include -I/usr/local/var/pyenv/versions/3.7.1/include  -I/usr/local/opt/readline/include -I/usr/local/opt/readline/include -I/usr/local/opt/openssl/include -I/usr/local/var/pyenv/versions/3.7.1/include   -DPy_BUILD_CORE -o Python/fileutils.o Python/fileutils.c
  824. clang -c -Wno-unused-result -Wsign-compare -Wunreachable-code -DNDEBUG -g -fwrapv -O3 -Wall -I/usr/local/opt/openssl/include  -I/usr/local/opt/openssl/include  -std=c99 -Wextra -Wno-unused-result -Wno-unused-parameter -Wno-missing-field-initializers -Wstrict-prototypes -Werror=implicit-function-declaration   -I. -I./Include -I/usr/local/opt/readline/include -I/usr/local/opt/readline/include -I/usr/local/opt/openssl/include -I/usr/local/var/pyenv/versions/3.7.1/include  -I/usr/local/opt/readline/include -I/usr/local/opt/readline/include -I/usr/local/opt/openssl/include -I/usr/local/var/pyenv/versions/3.7.1/include   -DPy_BUILD_CORE \
  825.     -DSOABI='"cpython-37m-darwin"' \
  826.     -o Python/dynload_shlib.o ./Python/dynload_shlib.c
  827. clang -c -Wno-unused-result -Wsign-compare -Wunreachable-code -DNDEBUG -g -fwrapv -O3 -Wall -I/usr/local/opt/openssl/include  -I/usr/local/opt/openssl/include  -std=c99 -Wextra -Wno-unused-result -Wno-unused-parameter -Wno-missing-field-initializers -Wstrict-prototypes -Werror=implicit-function-declaration   -I. -I./Include -I/usr/local/opt/readline/include -I/usr/local/opt/readline/include -I/usr/local/opt/openssl/include -I/usr/local/var/pyenv/versions/3.7.1/include  -I/usr/local/opt/readline/include -I/usr/local/opt/readline/include -I/usr/local/opt/openssl/include -I/usr/local/var/pyenv/versions/3.7.1/include   -DPy_BUILD_CORE -o Modules/config.o Modules/config.c
  828. clang -c -Wno-unused-result -Wsign-compare -Wunreachable-code -DNDEBUG -g -fwrapv -O3 -Wall -I/usr/local/opt/openssl/include  -I/usr/local/opt/openssl/include  -std=c99 -Wextra -Wno-unused-result -Wno-unused-parameter -Wno-missing-field-initializers -Wstrict-prototypes -Werror=implicit-function-declaration   -I. -I./Include -I/usr/local/opt/readline/include -I/usr/local/opt/readline/include -I/usr/local/opt/openssl/include -I/usr/local/var/pyenv/versions/3.7.1/include  -I/usr/local/opt/readline/include -I/usr/local/opt/readline/include -I/usr/local/opt/openssl/include -I/usr/local/var/pyenv/versions/3.7.1/include   -DPy_BUILD_CORE -DPYTHONPATH='""' \
  829.     -DPREFIX='"/usr/local/var/pyenv/versions/3.7.1"' \
  830.     -DEXEC_PREFIX='"/usr/local/var/pyenv/versions/3.7.1"' \
  831.     -DVERSION='"3.7"' \
  832.     -DVPATH='""' \
  833.     -o Modules/getpath.o ./Modules/getpath.c
  834. clang -c -Wno-unused-result -Wsign-compare -Wunreachable-code -DNDEBUG -g -fwrapv -O3 -Wall -I/usr/local/opt/openssl/include  -I/usr/local/opt/openssl/include  -std=c99 -Wextra -Wno-unused-result -Wno-unused-parameter -Wno-missing-field-initializers -Wstrict-prototypes -Werror=implicit-function-declaration   -I. -I./Include -I/usr/local/opt/readline/include -I/usr/local/opt/readline/include -I/usr/local/opt/openssl/include -I/usr/local/var/pyenv/versions/3.7.1/include  -I/usr/local/opt/readline/include -I/usr/local/opt/readline/include -I/usr/local/opt/openssl/include -I/usr/local/var/pyenv/versions/3.7.1/include   -DPy_BUILD_CORE -o Modules/main.o Modules/main.c
  835. clang -c -Wno-unused-result -Wsign-compare -Wunreachable-code -DNDEBUG -g -fwrapv -O3 -Wall -I/usr/local/opt/openssl/include  -I/usr/local/opt/openssl/include  -std=c99 -Wextra -Wno-unused-result -Wno-unused-parameter -Wno-missing-field-initializers -Wstrict-prototypes -Werror=implicit-function-declaration   -I. -I./Include -I/usr/local/opt/readline/include -I/usr/local/opt/readline/include -I/usr/local/opt/openssl/include -I/usr/local/var/pyenv/versions/3.7.1/include  -I/usr/local/opt/readline/include -I/usr/local/opt/readline/include -I/usr/local/opt/openssl/include -I/usr/local/var/pyenv/versions/3.7.1/include   -DPy_BUILD_CORE -o Modules/gcmodule.o Modules/gcmodule.c
  836. clang -Wno-unused-result -Wsign-compare -Wunreachable-code -DNDEBUG -g -fwrapv -O3 -Wall -I/usr/local/opt/openssl/include  -I/usr/local/opt/openssl/include  -std=c99 -Wextra -Wno-unused-result -Wno-unused-parameter -Wno-missing-field-initializers -Wstrict-prototypes -Werror=implicit-function-declaration   -I. -I./Include -I/usr/local/opt/readline/include -I/usr/local/opt/readline/include -I/usr/local/opt/openssl/include -I/usr/local/var/pyenv/versions/3.7.1/include  -I/usr/local/opt/readline/include -I/usr/local/opt/readline/include -I/usr/local/opt/openssl/include -I/usr/local/var/pyenv/versions/3.7.1/include    -DPy_BUILD_CORE -c ./Modules/posixmodule.c -o Modules/posixmodule.o
  837. clang -Wno-unused-result -Wsign-compare -Wunreachable-code -DNDEBUG -g -fwrapv -O3 -Wall -I/usr/local/opt/openssl/include  -I/usr/local/opt/openssl/include  -std=c99 -Wextra -Wno-unused-result -Wno-unused-parameter -Wno-missing-field-initializers -Wstrict-prototypes -Werror=implicit-function-declaration   -I. -I./Include -I/usr/local/opt/readline/include -I/usr/local/opt/readline/include -I/usr/local/opt/openssl/include -I/usr/local/var/pyenv/versions/3.7.1/include  -I/usr/local/opt/readline/include -I/usr/local/opt/readline/include -I/usr/local/opt/openssl/include -I/usr/local/var/pyenv/versions/3.7.1/include    -c ./Modules/errnomodule.c -o Modules/errnomodule.o
  838. clang -Wno-unused-result -Wsign-compare -Wunreachable-code -DNDEBUG -g -fwrapv -O3 -Wall -I/usr/local/opt/openssl/include  -I/usr/local/opt/openssl/include  -std=c99 -Wextra -Wno-unused-result -Wno-unused-parameter -Wno-missing-field-initializers -Wstrict-prototypes -Werror=implicit-function-declaration   -I. -I./Include -I/usr/local/opt/readline/include -I/usr/local/opt/readline/include -I/usr/local/opt/openssl/include -I/usr/local/var/pyenv/versions/3.7.1/include  -I/usr/local/opt/readline/include -I/usr/local/opt/readline/include -I/usr/local/opt/openssl/include -I/usr/local/var/pyenv/versions/3.7.1/include    -c ./Modules/pwdmodule.c -o Modules/pwdmodule.o
  839. clang -Wno-unused-result -Wsign-compare -Wunreachable-code -DNDEBUG -g -fwrapv -O3 -Wall -I/usr/local/opt/openssl/include  -I/usr/local/opt/openssl/include  -std=c99 -Wextra -Wno-unused-result -Wno-unused-parameter -Wno-missing-field-initializers -Wstrict-prototypes -Werror=implicit-function-declaration   -I. -I./Include -I/usr/local/opt/readline/include -I/usr/local/opt/readline/include -I/usr/local/opt/openssl/include -I/usr/local/var/pyenv/versions/3.7.1/include  -I/usr/local/opt/readline/include -I/usr/local/opt/readline/include -I/usr/local/opt/openssl/include -I/usr/local/var/pyenv/versions/3.7.1/include    -c ./Modules/_sre.c -o Modules/_sre.o
  840. clang -Wno-unused-result -Wsign-compare -Wunreachable-code -DNDEBUG -g -fwrapv -O3 -Wall -I/usr/local/opt/openssl/include  -I/usr/local/opt/openssl/include  -std=c99 -Wextra -Wno-unused-result -Wno-unused-parameter -Wno-missing-field-initializers -Wstrict-prototypes -Werror=implicit-function-declaration   -I. -I./Include -I/usr/local/opt/readline/include -I/usr/local/opt/readline/include -I/usr/local/opt/openssl/include -I/usr/local/var/pyenv/versions/3.7.1/include  -I/usr/local/opt/readline/include -I/usr/local/opt/readline/include -I/usr/local/opt/openssl/include -I/usr/local/var/pyenv/versions/3.7.1/include    -c ./Modules/_codecsmodule.c -o Modules/_codecsmodule.o
  841. clang -Wno-unused-result -Wsign-compare -Wunreachable-code -DNDEBUG -g -fwrapv -O3 -Wall -I/usr/local/opt/openssl/include  -I/usr/local/opt/openssl/include  -std=c99 -Wextra -Wno-unused-result -Wno-unused-parameter -Wno-missing-field-initializers -Wstrict-prototypes -Werror=implicit-function-declaration   -I. -I./Include -I/usr/local/opt/readline/include -I/usr/local/opt/readline/include -I/usr/local/opt/openssl/include -I/usr/local/var/pyenv/versions/3.7.1/include  -I/usr/local/opt/readline/include -I/usr/local/opt/readline/include -I/usr/local/opt/openssl/include -I/usr/local/var/pyenv/versions/3.7.1/include    -c ./Modules/_weakref.c -o Modules/_weakref.o
  842. clang -Wno-unused-result -Wsign-compare -Wunreachable-code -DNDEBUG -g -fwrapv -O3 -Wall -I/usr/local/opt/openssl/include  -I/usr/local/opt/openssl/include  -std=c99 -Wextra -Wno-unused-result -Wno-unused-parameter -Wno-missing-field-initializers -Wstrict-prototypes -Werror=implicit-function-declaration   -I. -I./Include -I/usr/local/opt/readline/include -I/usr/local/opt/readline/include -I/usr/local/opt/openssl/include -I/usr/local/var/pyenv/versions/3.7.1/include  -I/usr/local/opt/readline/include -I/usr/local/opt/readline/include -I/usr/local/opt/openssl/include -I/usr/local/var/pyenv/versions/3.7.1/include    -DPy_BUILD_CORE -c ./Modules/_functoolsmodule.c -o Modules/_functoolsmodule.o
  843. clang -Wno-unused-result -Wsign-compare -Wunreachable-code -DNDEBUG -g -fwrapv -O3 -Wall -I/usr/local/opt/openssl/include  -I/usr/local/opt/openssl/include  -std=c99 -Wextra -Wno-unused-result -Wno-unused-parameter -Wno-missing-field-initializers -Wstrict-prototypes -Werror=implicit-function-declaration   -I. -I./Include -I/usr/local/opt/readline/include -I/usr/local/opt/readline/include -I/usr/local/opt/openssl/include -I/usr/local/var/pyenv/versions/3.7.1/include  -I/usr/local/opt/readline/include -I/usr/local/opt/readline/include -I/usr/local/opt/openssl/include -I/usr/local/var/pyenv/versions/3.7.1/include    -c ./Modules/_operator.c -o Modules/_operator.o
  844. clang -Wno-unused-result -Wsign-compare -Wunreachable-code -DNDEBUG -g -fwrapv -O3 -Wall -I/usr/local/opt/openssl/include  -I/usr/local/opt/openssl/include  -std=c99 -Wextra -Wno-unused-result -Wno-unused-parameter -Wno-missing-field-initializers -Wstrict-prototypes -Werror=implicit-function-declaration   -I. -I./Include -I/usr/local/opt/readline/include -I/usr/local/opt/readline/include -I/usr/local/opt/openssl/include -I/usr/local/var/pyenv/versions/3.7.1/include  -I/usr/local/opt/readline/include -I/usr/local/opt/readline/include -I/usr/local/opt/openssl/include -I/usr/local/var/pyenv/versions/3.7.1/include    -c ./Modules/_collectionsmodule.c -o Modules/_collectionsmodule.o
  845. clang -Wno-unused-result -Wsign-compare -Wunreachable-code -DNDEBUG -g -fwrapv -O3 -Wall -I/usr/local/opt/openssl/include  -I/usr/local/opt/openssl/include  -std=c99 -Wextra -Wno-unused-result -Wno-unused-parameter -Wno-missing-field-initializers -Wstrict-prototypes -Werror=implicit-function-declaration   -I. -I./Include -I/usr/local/opt/readline/include -I/usr/local/opt/readline/include -I/usr/local/opt/openssl/include -I/usr/local/var/pyenv/versions/3.7.1/include  -I/usr/local/opt/readline/include -I/usr/local/opt/readline/include -I/usr/local/opt/openssl/include -I/usr/local/var/pyenv/versions/3.7.1/include    -c ./Modules/_abc.c -o Modules/_abc.o
  846. clang -Wno-unused-result -Wsign-compare -Wunreachable-code -DNDEBUG -g -fwrapv -O3 -Wall -I/usr/local/opt/openssl/include  -I/usr/local/opt/openssl/include  -std=c99 -Wextra -Wno-unused-result -Wno-unused-parameter -Wno-missing-field-initializers -Wstrict-prototypes -Werror=implicit-function-declaration   -I. -I./Include -I/usr/local/opt/readline/include -I/usr/local/opt/readline/include -I/usr/local/opt/openssl/include -I/usr/local/var/pyenv/versions/3.7.1/include  -I/usr/local/opt/readline/include -I/usr/local/opt/readline/include -I/usr/local/opt/openssl/include -I/usr/local/var/pyenv/versions/3.7.1/include    -c ./Modules/itertoolsmodule.c -o Modules/itertoolsmodule.o
  847. clang -Wno-unused-result -Wsign-compare -Wunreachable-code -DNDEBUG -g -fwrapv -O3 -Wall -I/usr/local/opt/openssl/include  -I/usr/local/opt/openssl/include  -std=c99 -Wextra -Wno-unused-result -Wno-unused-parameter -Wno-missing-field-initializers -Wstrict-prototypes -Werror=implicit-function-declaration   -I. -I./Include -I/usr/local/opt/readline/include -I/usr/local/opt/readline/include -I/usr/local/opt/openssl/include -I/usr/local/var/pyenv/versions/3.7.1/include  -I/usr/local/opt/readline/include -I/usr/local/opt/readline/include -I/usr/local/opt/openssl/include -I/usr/local/var/pyenv/versions/3.7.1/include    -c ./Modules/atexitmodule.c -o Modules/atexitmodule.o
  848. clang -Wno-unused-result -Wsign-compare -Wunreachable-code -DNDEBUG -g -fwrapv -O3 -Wall -I/usr/local/opt/openssl/include  -I/usr/local/opt/openssl/include  -std=c99 -Wextra -Wno-unused-result -Wno-unused-parameter -Wno-missing-field-initializers -Wstrict-prototypes -Werror=implicit-function-declaration   -I. -I./Include -I/usr/local/opt/readline/include -I/usr/local/opt/readline/include -I/usr/local/opt/openssl/include -I/usr/local/var/pyenv/versions/3.7.1/include  -I/usr/local/opt/readline/include -I/usr/local/opt/readline/include -I/usr/local/opt/openssl/include -I/usr/local/var/pyenv/versions/3.7.1/include    -DPy_BUILD_CORE -c ./Modules/signalmodule.c -o Modules/signalmodule.o
  849. clang -Wno-unused-result -Wsign-compare -Wunreachable-code -DNDEBUG -g -fwrapv -O3 -Wall -I/usr/local/opt/openssl/include  -I/usr/local/opt/openssl/include  -std=c99 -Wextra -Wno-unused-result -Wno-unused-parameter -Wno-missing-field-initializers -Wstrict-prototypes -Werror=implicit-function-declaration   -I. -I./Include -I/usr/local/opt/readline/include -I/usr/local/opt/readline/include -I/usr/local/opt/openssl/include -I/usr/local/var/pyenv/versions/3.7.1/include  -I/usr/local/opt/readline/include -I/usr/local/opt/readline/include -I/usr/local/opt/openssl/include -I/usr/local/var/pyenv/versions/3.7.1/include    -c ./Modules/_stat.c -o Modules/_stat.o
  850. clang -Wno-unused-result -Wsign-compare -Wunreachable-code -DNDEBUG -g -fwrapv -O3 -Wall -I/usr/local/opt/openssl/include  -I/usr/local/opt/openssl/include  -std=c99 -Wextra -Wno-unused-result -Wno-unused-parameter -Wno-missing-field-initializers -Wstrict-prototypes -Werror=implicit-function-declaration   -I. -I./Include -I/usr/local/opt/readline/include -I/usr/local/opt/readline/include -I/usr/local/opt/openssl/include -I/usr/local/var/pyenv/versions/3.7.1/include  -I/usr/local/opt/readline/include -I/usr/local/opt/readline/include -I/usr/local/opt/openssl/include -I/usr/local/var/pyenv/versions/3.7.1/include    -DPy_BUILD_CORE -c ./Modules/timemodule.c -o Modules/timemodule.o
  851. clang -Wno-unused-result -Wsign-compare -Wunreachable-code -DNDEBUG -g -fwrapv -O3 -Wall -I/usr/local/opt/openssl/include  -I/usr/local/opt/openssl/include  -std=c99 -Wextra -Wno-unused-result -Wno-unused-parameter -Wno-missing-field-initializers -Wstrict-prototypes -Werror=implicit-function-declaration   -I. -I./Include -I/usr/local/opt/readline/include -I/usr/local/opt/readline/include -I/usr/local/opt/openssl/include -I/usr/local/var/pyenv/versions/3.7.1/include  -I/usr/local/opt/readline/include -I/usr/local/opt/readline/include -I/usr/local/opt/openssl/include -I/usr/local/var/pyenv/versions/3.7.1/include    -DPy_BUILD_CORE -c ./Modules/_threadmodule.c -o Modules/_threadmodule.o
  852. clang -Wno-unused-result -Wsign-compare -Wunreachable-code -DNDEBUG -g -fwrapv -O3 -Wall -I/usr/local/opt/openssl/include  -I/usr/local/opt/openssl/include  -std=c99 -Wextra -Wno-unused-result -Wno-unused-parameter -Wno-missing-field-initializers -Wstrict-prototypes -Werror=implicit-function-declaration   -I. -I./Include -I/usr/local/opt/readline/include -I/usr/local/opt/readline/include -I/usr/local/opt/openssl/include -I/usr/local/var/pyenv/versions/3.7.1/include  -I/usr/local/opt/readline/include -I/usr/local/opt/readline/include -I/usr/local/opt/openssl/include -I/usr/local/var/pyenv/versions/3.7.1/include    -c ./Modules/_localemodule.c -o Modules/_localemodule.o
  853. clang -Wno-unused-result -Wsign-compare -Wunreachable-code -DNDEBUG -g -fwrapv -O3 -Wall -I/usr/local/opt/openssl/include  -I/usr/local/opt/openssl/include  -std=c99 -Wextra -Wno-unused-result -Wno-unused-parameter -Wno-missing-field-initializers -Wstrict-prototypes -Werror=implicit-function-declaration   -I. -I./Include -I/usr/local/opt/readline/include -I/usr/local/opt/readline/include -I/usr/local/opt/openssl/include -I/usr/local/var/pyenv/versions/3.7.1/include  -I/usr/local/opt/readline/include -I/usr/local/opt/readline/include -I/usr/local/opt/openssl/include -I/usr/local/var/pyenv/versions/3.7.1/include    -DPy_BUILD_CORE -I./Modules/_io -c ./Modules/_io/_iomodule.c -o Modules/_iomodule.o
  854. clang -Wno-unused-result -Wsign-compare -Wunreachable-code -DNDEBUG -g -fwrapv -O3 -Wall -I/usr/local/opt/openssl/include  -I/usr/local/opt/openssl/include  -std=c99 -Wextra -Wno-unused-result -Wno-unused-parameter -Wno-missing-field-initializers -Wstrict-prototypes -Werror=implicit-function-declaration   -I. -I./Include -I/usr/local/opt/readline/include -I/usr/local/opt/readline/include -I/usr/local/opt/openssl/include -I/usr/local/var/pyenv/versions/3.7.1/include  -I/usr/local/opt/readline/include -I/usr/local/opt/readline/include -I/usr/local/opt/openssl/include -I/usr/local/var/pyenv/versions/3.7.1/include    -DPy_BUILD_CORE -I./Modules/_io -c ./Modules/_io/iobase.c -o Modules/iobase.o
  855. clang -Wno-unused-result -Wsign-compare -Wunreachable-code -DNDEBUG -g -fwrapv -O3 -Wall -I/usr/local/opt/openssl/include  -I/usr/local/opt/openssl/include  -std=c99 -Wextra -Wno-unused-result -Wno-unused-parameter -Wno-missing-field-initializers -Wstrict-prototypes -Werror=implicit-function-declaration   -I. -I./Include -I/usr/local/opt/readline/include -I/usr/local/opt/readline/include -I/usr/local/opt/openssl/include -I/usr/local/var/pyenv/versions/3.7.1/include  -I/usr/local/opt/readline/include -I/usr/local/opt/readline/include -I/usr/local/opt/openssl/include -I/usr/local/var/pyenv/versions/3.7.1/include    -DPy_BUILD_CORE -I./Modules/_io -c ./Modules/_io/fileio.c -o Modules/fileio.o
  856. clang -Wno-unused-result -Wsign-compare -Wunreachable-code -DNDEBUG -g -fwrapv -O3 -Wall -I/usr/local/opt/openssl/include  -I/usr/local/opt/openssl/include  -std=c99 -Wextra -Wno-unused-result -Wno-unused-parameter -Wno-missing-field-initializers -Wstrict-prototypes -Werror=implicit-function-declaration   -I. -I./Include -I/usr/local/opt/readline/include -I/usr/local/opt/readline/include -I/usr/local/opt/openssl/include -I/usr/local/var/pyenv/versions/3.7.1/include  -I/usr/local/opt/readline/include -I/usr/local/opt/readline/include -I/usr/local/opt/openssl/include -I/usr/local/var/pyenv/versions/3.7.1/include    -DPy_BUILD_CORE -I./Modules/_io -c ./Modules/_io/bytesio.c -o Modules/bytesio.o
  857. clang -Wno-unused-result -Wsign-compare -Wunreachable-code -DNDEBUG -g -fwrapv -O3 -Wall -I/usr/local/opt/openssl/include  -I/usr/local/opt/openssl/include  -std=c99 -Wextra -Wno-unused-result -Wno-unused-parameter -Wno-missing-field-initializers -Wstrict-prototypes -Werror=implicit-function-declaration   -I. -I./Include -I/usr/local/opt/readline/include -I/usr/local/opt/readline/include -I/usr/local/opt/openssl/include -I/usr/local/var/pyenv/versions/3.7.1/include  -I/usr/local/opt/readline/include -I/usr/local/opt/readline/include -I/usr/local/opt/openssl/include -I/usr/local/var/pyenv/versions/3.7.1/include    -DPy_BUILD_CORE -I./Modules/_io -c ./Modules/_io/bufferedio.c -o Modules/bufferedio.o
  858. clang -Wno-unused-result -Wsign-compare -Wunreachable-code -DNDEBUG -g -fwrapv -O3 -Wall -I/usr/local/opt/openssl/include  -I/usr/local/opt/openssl/include  -std=c99 -Wextra -Wno-unused-result -Wno-unused-parameter -Wno-missing-field-initializers -Wstrict-prototypes -Werror=implicit-function-declaration   -I. -I./Include -I/usr/local/opt/readline/include -I/usr/local/opt/readline/include -I/usr/local/opt/openssl/include -I/usr/local/var/pyenv/versions/3.7.1/include  -I/usr/local/opt/readline/include -I/usr/local/opt/readline/include -I/usr/local/opt/openssl/include -I/usr/local/var/pyenv/versions/3.7.1/include    -DPy_BUILD_CORE -I./Modules/_io -c ./Modules/_io/textio.c -o Modules/textio.o
  859. clang -Wno-unused-result -Wsign-compare -Wunreachable-code -DNDEBUG -g -fwrapv -O3 -Wall -I/usr/local/opt/openssl/include  -I/usr/local/opt/openssl/include  -std=c99 -Wextra -Wno-unused-result -Wno-unused-parameter -Wno-missing-field-initializers -Wstrict-prototypes -Werror=implicit-function-declaration   -I. -I./Include -I/usr/local/opt/readline/include -I/usr/local/opt/readline/include -I/usr/local/opt/openssl/include -I/usr/local/var/pyenv/versions/3.7.1/include  -I/usr/local/opt/readline/include -I/usr/local/opt/readline/include -I/usr/local/opt/openssl/include -I/usr/local/var/pyenv/versions/3.7.1/include    -DPy_BUILD_CORE -I./Modules/_io -c ./Modules/_io/stringio.c -o Modules/stringio.o
  860. clang -Wno-unused-result -Wsign-compare -Wunreachable-code -DNDEBUG -g -fwrapv -O3 -Wall -I/usr/local/opt/openssl/include  -I/usr/local/opt/openssl/include  -std=c99 -Wextra -Wno-unused-result -Wno-unused-parameter -Wno-missing-field-initializers -Wstrict-prototypes -Werror=implicit-function-declaration   -I. -I./Include -I/usr/local/opt/readline/include -I/usr/local/opt/readline/include -I/usr/local/opt/openssl/include -I/usr/local/var/pyenv/versions/3.7.1/include  -I/usr/local/opt/readline/include -I/usr/local/opt/readline/include -I/usr/local/opt/openssl/include -I/usr/local/var/pyenv/versions/3.7.1/include    -DPy_BUILD_CORE -c ./Modules/zipimport.c -o Modules/zipimport.o
  861. clang -Wno-unused-result -Wsign-compare -Wunreachable-code -DNDEBUG -g -fwrapv -O3 -Wall -I/usr/local/opt/openssl/include  -I/usr/local/opt/openssl/include  -std=c99 -Wextra -Wno-unused-result -Wno-unused-parameter -Wno-missing-field-initializers -Wstrict-prototypes -Werror=implicit-function-declaration   -I. -I./Include -I/usr/local/opt/readline/include -I/usr/local/opt/readline/include -I/usr/local/opt/openssl/include -I/usr/local/var/pyenv/versions/3.7.1/include  -I/usr/local/opt/readline/include -I/usr/local/opt/readline/include -I/usr/local/opt/openssl/include -I/usr/local/var/pyenv/versions/3.7.1/include    -c ./Modules/faulthandler.c -o Modules/faulthandler.o
  862. clang -Wno-unused-result -Wsign-compare -Wunreachable-code -DNDEBUG -g -fwrapv -O3 -Wall -I/usr/local/opt/openssl/include  -I/usr/local/opt/openssl/include  -std=c99 -Wextra -Wno-unused-result -Wno-unused-parameter -Wno-missing-field-initializers -Wstrict-prototypes -Werror=implicit-function-declaration   -I. -I./Include -I/usr/local/opt/readline/include -I/usr/local/opt/readline/include -I/usr/local/opt/openssl/include -I/usr/local/var/pyenv/versions/3.7.1/include  -I/usr/local/opt/readline/include -I/usr/local/opt/readline/include -I/usr/local/opt/openssl/include -I/usr/local/var/pyenv/versions/3.7.1/include    -c ./Modules/_tracemalloc.c -o Modules/_tracemalloc.o
  863. clang -Wno-unused-result -Wsign-compare -Wunreachable-code -DNDEBUG -g -fwrapv -O3 -Wall -I/usr/local/opt/openssl/include  -I/usr/local/opt/openssl/include  -std=c99 -Wextra -Wno-unused-result -Wno-unused-parameter -Wno-missing-field-initializers -Wstrict-prototypes -Werror=implicit-function-declaration   -I. -I./Include -I/usr/local/opt/readline/include -I/usr/local/opt/readline/include -I/usr/local/opt/openssl/include -I/usr/local/var/pyenv/versions/3.7.1/include  -I/usr/local/opt/readline/include -I/usr/local/opt/readline/include -I/usr/local/opt/openssl/include -I/usr/local/var/pyenv/versions/3.7.1/include    -c ./Modules/hashtable.c -o Modules/hashtable.o
  864. clang -Wno-unused-result -Wsign-compare -Wunreachable-code -DNDEBUG -g -fwrapv -O3 -Wall -I/usr/local/opt/openssl/include  -I/usr/local/opt/openssl/include  -std=c99 -Wextra -Wno-unused-result -Wno-unused-parameter -Wno-missing-field-initializers -Wstrict-prototypes -Werror=implicit-function-declaration   -I. -I./Include -I/usr/local/opt/readline/include -I/usr/local/opt/readline/include -I/usr/local/opt/openssl/include -I/usr/local/var/pyenv/versions/3.7.1/include  -I/usr/local/opt/readline/include -I/usr/local/opt/readline/include -I/usr/local/opt/openssl/include -I/usr/local/var/pyenv/versions/3.7.1/include    -c ./Modules/symtablemodule.c -o Modules/symtablemodule.o
  865. clang -Wno-unused-result -Wsign-compare -Wunreachable-code -DNDEBUG -g -fwrapv -O3 -Wall -I/usr/local/opt/openssl/include  -I/usr/local/opt/openssl/include  -std=c99 -Wextra -Wno-unused-result -Wno-unused-parameter -Wno-missing-field-initializers -Wstrict-prototypes -Werror=implicit-function-declaration   -I. -I./Include -I/usr/local/opt/readline/include -I/usr/local/opt/readline/include -I/usr/local/opt/openssl/include -I/usr/local/var/pyenv/versions/3.7.1/include  -I/usr/local/opt/readline/include -I/usr/local/opt/readline/include -I/usr/local/opt/openssl/include -I/usr/local/var/pyenv/versions/3.7.1/include    -c ./Modules/xxsubtype.c -o Modules/xxsubtype.o
  866. clang -c -Wno-unused-result -Wsign-compare -Wunreachable-code -DNDEBUG -g -fwrapv -O3 -Wall -I/usr/local/opt/openssl/include  -I/usr/local/opt/openssl/include  -std=c99 -Wextra -Wno-unused-result -Wno-unused-parameter -Wno-missing-field-initializers -Wstrict-prototypes -Werror=implicit-function-declaration   -I. -I./Include -I/usr/local/opt/readline/include -I/usr/local/opt/readline/include -I/usr/local/opt/openssl/include -I/usr/local/var/pyenv/versions/3.7.1/include  -I/usr/local/opt/readline/include -I/usr/local/opt/readline/include -I/usr/local/opt/openssl/include -I/usr/local/var/pyenv/versions/3.7.1/include   -DPy_BUILD_CORE -o Python/frozen.o Python/frozen.c
  867. clang -c  -Wno-unused-result -Wsign-compare -Wunreachable-code -DNDEBUG -g -fwrapv -O3 -Wall -I/usr/local/opt/openssl/include  -I/usr/local/opt/openssl/include  -std=c99 -Wextra -Wno-unused-result -Wno-unused-parameter -Wno-missing-field-initializers -Wstrict-prototypes -Werror=implicit-function-declaration   -I. -I./Include -I/usr/local/opt/readline/include -I/usr/local/opt/readline/include -I/usr/local/opt/openssl/include -I/usr/local/var/pyenv/versions/3.7.1/include  -I/usr/local/opt/readline/include -I/usr/local/opt/readline/include -I/usr/local/opt/openssl/include -I/usr/local/var/pyenv/versions/3.7.1/include   -DPy_BUILD_CORE -o Modules/_math.o Modules/_math.c
  868. /usr/local/opt/coreutils/libexec/gnubin/install -c -m 644 ./Tools/gdb/libpython.py python.exe-gdb.py
  869. clang -c -Wno-unused-result -Wsign-compare -Wunreachable-code -DNDEBUG -g -fwrapv -O3 -Wall -I/usr/local/opt/openssl/include  -I/usr/local/opt/openssl/include  -std=c99 -Wextra -Wno-unused-result -Wno-unused-parameter -Wno-missing-field-initializers -Wstrict-prototypes -Werror=implicit-function-declaration   -I. -I./Include -I/usr/local/opt/readline/include -I/usr/local/opt/readline/include -I/usr/local/opt/openssl/include -I/usr/local/var/pyenv/versions/3.7.1/include  -I/usr/local/opt/readline/include -I/usr/local/opt/readline/include -I/usr/local/opt/openssl/include -I/usr/local/var/pyenv/versions/3.7.1/include   -DPy_BUILD_CORE -o Programs/_testembed.o ./Programs/_testembed.c
  870. sed -e "s,@EXENAME@,/usr/local/var/pyenv/versions/3.7.1/bin/python3.7m," < ./Misc/python-config.in >python-config.py
  871. LC_ALL=C sed -e 's,\$(\([A-Za-z0-9_]*\)),\$\{\1\},g' < Misc/python-config.sh >python-config
  872. clang -c -Wno-unused-result -Wsign-compare -Wunreachable-code -DNDEBUG -g -fwrapv -O3 -Wall -I/usr/local/opt/openssl/include  -I/usr/local/opt/openssl/include  -std=c99 -Wextra -Wno-unused-result -Wno-unused-parameter -Wno-missing-field-initializers -Wstrict-prototypes -Werror=implicit-function-declaration   -I. -I./Include -I/usr/local/opt/readline/include -I/usr/local/opt/readline/include -I/usr/local/opt/openssl/include -I/usr/local/var/pyenv/versions/3.7.1/include  -I/usr/local/opt/readline/include -I/usr/local/opt/readline/include -I/usr/local/opt/openssl/include -I/usr/local/var/pyenv/versions/3.7.1/include   -DPy_BUILD_CORE \
  873.       -DGITVERSION="\"`LC_ALL=C `\"" \
  874.       -DGITTAG="\"`LC_ALL=C `\"" \
  875.       -DGITBRANCH="\"`LC_ALL=C `\"" \
  876.       -o Modules/getbuildinfo.o ./Modules/getbuildinfo.c
  877. rm -f libpython3.7m.a
  878. ar rcs libpython3.7m.a Modules/getbuildinfo.o Parser/acceler.o Parser/grammar1.o Parser/listnode.o Parser/node.o Parser/parser.o Parser/bitset.o Parser/metagrammar.o Parser/firstsets.o Parser/grammar.o Parser/pgen.o Parser/myreadline.o Parser/parsetok.o Parser/tokenizer.o Objects/abstract.o Objects/accu.o Objects/boolobject.o Objects/bytes_methods.o Objects/bytearrayobject.o Objects/bytesobject.o Objects/call.o Objects/cellobject.o Objects/classobject.o Objects/codeobject.o Objects/complexobject.o Objects/descrobject.o Objects/enumobject.o Objects/exceptions.o Objects/genobject.o Objects/fileobject.o Objects/floatobject.o Objects/frameobject.o Objects/funcobject.o Objects/iterobject.o Objects/listobject.o Objects/longobject.o Objects/dictobject.o Objects/odictobject.o Objects/memoryobject.o Objects/methodobject.o Objects/moduleobject.o Objects/namespaceobject.o Objects/object.o Objects/obmalloc.o Objects/capsule.o Objects/rangeobject.o Objects/setobject.o Objects/sliceobject.o Objects/structseq.o Objects/tupleobject.o Objects/typeobject.o Objects/unicodeobject.o Objects/unicodectype.o Objects/weakrefobject.o Python/_warnings.o Python/Python-ast.o Python/asdl.o Python/ast.o Python/ast_opt.o Python/ast_unparse.o Python/bltinmodule.o Python/ceval.o Python/compile.o Python/codecs.o Python/dynamic_annotations.o Python/errors.o Python/frozenmain.o Python/future.o Python/getargs.o Python/getcompiler.o Python/getcopyright.o Python/getplatform.o Python/getversion.o Python/graminit.o Python/import.o Python/importdl.o Python/marshal.o Python/modsupport.o Python/mysnprintf.o Python/mystrtoul.o Python/pathconfig.o Python/peephole.o Python/pyarena.o Python/pyctype.o Python/pyfpe.o Python/pyhash.o Python/pylifecycle.o Python/pymath.o Python/pystate.o Python/context.o Python/hamt.o Python/pythonrun.o Python/pytime.o Python/bootstrap_hash.o Python/structmember.o Python/symtable.o Python/sysmodule.o Python/thread.o Python/traceback.o Python/getopt.o Python/pystrcmp.o Python/pystrtod.o Python/pystrhex.o Python/dtoa.o Python/formatter_unicode.o Python/fileutils.o Python/dynload_shlib.o    Modules/config.o Modules/getpath.o Modules/main.o Modules/gcmodule.o Modules/posixmodule.o  Modules/errnomodule.o  Modules/pwdmodule.o  Modules/_sre.o  Modules/_codecsmodule.o  Modules/_weakref.o  Modules/_functoolsmodule.o  Modules/_operator.o  Modules/_collectionsmodule.o  Modules/_abc.o  Modules/itertoolsmodule.o  Modules/atexitmodule.o  Modules/signalmodule.o  Modules/_stat.o  Modules/timemodule.o  Modules/_threadmodule.o  Modules/_localemodule.o  Modules/_iomodule.o Modules/iobase.o Modules/fileio.o Modules/bytesio.o Modules/bufferedio.o Modules/textio.o Modules/stringio.o  Modules/zipimport.o  Modules/faulthandler.o  Modules/_tracemalloc.o Modules/hashtable.o  Modules/symtablemodule.o  Modules/xxsubtype.o Python/frozen.o
  879. ar: Modules/getbuildinfo.o: unknown load command 0x32
  880. ar: Modules/getbuildinfo.o: unknown load command 0x32
  881. ar: Modules/getbuildinfo.o: unknown load command 0x32
  882. ar: Parser/acceler.o: unknown load command 0x32
  883. ar: Parser/acceler.o: unknown load command 0x32
  884. ar: Parser/acceler.o: unknown load command 0x32
  885. ar: Parser/grammar1.o: unknown load command 0x32
  886. ar: Parser/grammar1.o: unknown load command 0x32
  887. ar: Parser/grammar1.o: unknown load command 0x32
  888. ar: Parser/listnode.o: unknown load command 0x32
  889. ar: Parser/listnode.o: unknown load command 0x32
  890. ar: Parser/listnode.o: unknown load command 0x32
  891. ar: Parser/node.o: unknown load command 0x32
  892. ar: Parser/node.o: unknown load command 0x32
  893. ar: Parser/node.o: unknown load command 0x32
  894. ar: Parser/parser.o: unknown load command 0x32
  895. ar: Parser/parser.o: unknown load command 0x32
  896. ar: Parser/parser.o: unknown load command 0x32
  897. ar: Parser/bitset.o: unknown load command 0x32
  898. ar: Parser/bitset.o: unknown load command 0x32
  899. ar: Parser/bitset.o: unknown load command 0x32
  900. ar: Parser/metagrammar.o: unknown load command 0x32
  901. ar: Parser/metagrammar.o: unknown load command 0x32
  902. ar: Parser/metagrammar.o: unknown load command 0x32
  903. ar: Parser/firstsets.o: unknown load command 0x32
  904. ar: Parser/firstsets.o: unknown load command 0x32
  905. ar: Parser/firstsets.o: unknown load command 0x32
  906. ar: Parser/grammar.o: unknown load command 0x32
  907. ar: Parser/grammar.o: unknown load command 0x32
  908. ar: Parser/grammar.o: unknown load command 0x32
  909. ar: Parser/pgen.o: unknown load command 0x32
  910. ar: Parser/pgen.o: unknown load command 0x32
  911. ar: Parser/pgen.o: unknown load command 0x32
  912. ar: Parser/myreadline.o: unknown load command 0x32
  913. ar: Parser/myreadline.o: unknown load command 0x32
  914. ar: Parser/myreadline.o: unknown load command 0x32
  915. ar: Parser/parsetok.o: unknown load command 0x32
  916. ar: Parser/parsetok.o: unknown load command 0x32
  917. ar: Parser/parsetok.o: unknown load command 0x32
  918. ar: Parser/tokenizer.o: unknown load command 0x32
  919. ar: Parser/tokenizer.o: unknown load command 0x32
  920. ar: Parser/tokenizer.o: unknown load command 0x32
  921. ar: Objects/abstract.o: unknown load command 0x32
  922. ar: Objects/abstract.o: unknown load command 0x32
  923. ar: Objects/abstract.o: unknown load command 0x32
  924. ar: Objects/accu.o: unknown load command 0x32
  925. ar: Objects/accu.o: unknown load command 0x32
  926. ar: Objects/accu.o: unknown load command 0x32
  927. ar: Objects/boolobject.o: unknown load command 0x32
  928. ar: Objects/boolobject.o: unknown load command 0x32
  929. ar: Objects/boolobject.o: unknown load command 0x32
  930. ar: Objects/bytes_methods.o: unknown load command 0x32
  931. ar: Objects/bytes_methods.o: unknown load command 0x32
  932. ar: Objects/bytes_methods.o: unknown load command 0x32
  933. ar: Objects/bytearrayobject.o: unknown load command 0x32
  934. ar: Objects/bytearrayobject.o: unknown load command 0x32
  935. ar: Objects/bytearrayobject.o: unknown load command 0x32
  936. ar: Objects/bytesobject.o: unknown load command 0x32
  937. ar: Objects/bytesobject.o: unknown load command 0x32
  938. ar: Objects/bytesobject.o: unknown load command 0x32
  939. ar: Objects/call.o: unknown load command 0x32
  940. ar: Objects/call.o: unknown load command 0x32
  941. ar: Objects/call.o: unknown load command 0x32
  942. ar: Objects/cellobject.o: unknown load command 0x32
  943. ar: Objects/cellobject.o: unknown load command 0x32
  944. ar: Objects/cellobject.o: unknown load command 0x32
  945. ar: Objects/classobject.o: unknown load command 0x32
  946. ar: Objects/classobject.o: unknown load command 0x32
  947. ar: Objects/classobject.o: unknown load command 0x32
  948. ar: Objects/codeobject.o: unknown load command 0x32
  949. ar: Objects/codeobject.o: unknown load command 0x32
  950. ar: Objects/codeobject.o: unknown load command 0x32
  951. ar: Objects/complexobject.o: unknown load command 0x32
  952. ar: Objects/complexobject.o: unknown load command 0x32
  953. ar: Objects/complexobject.o: unknown load command 0x32
  954. ar: Objects/descrobject.o: unknown load command 0x32
  955. ar: Objects/descrobject.o: unknown load command 0x32
  956. ar: Objects/descrobject.o: unknown load command 0x32
  957. ar: Objects/enumobject.o: unknown load command 0x32
  958. ar: Objects/enumobject.o: unknown load command 0x32
  959. ar: Objects/enumobject.o: unknown load command 0x32
  960. ar: Objects/exceptions.o: unknown load command 0x32
  961. ar: Objects/exceptions.o: unknown load command 0x32
  962. ar: Objects/exceptions.o: unknown load command 0x32
  963. ar: Objects/genobject.o: unknown load command 0x32
  964. ar: Objects/genobject.o: unknown load command 0x32
  965. ar: Objects/genobject.o: unknown load command 0x32
  966. ar: Objects/fileobject.o: unknown load command 0x32
  967. ar: Objects/fileobject.o: unknown load command 0x32
  968. ar: Objects/fileobject.o: unknown load command 0x32
  969. ar: Objects/floatobject.o: unknown load command 0x32
  970. ar: Objects/floatobject.o: unknown load command 0x32
  971. ar: Objects/floatobject.o: unknown load command 0x32
  972. ar: Objects/frameobject.o: unknown load command 0x32
  973. ar: Objects/frameobject.o: unknown load command 0x32
  974. ar: Objects/frameobject.o: unknown load command 0x32
  975. ar: Objects/funcobject.o: unknown load command 0x32
  976. ar: Objects/funcobject.o: unknown load command 0x32
  977. ar: Objects/funcobject.o: unknown load command 0x32
  978. ar: Objects/iterobject.o: unknown load command 0x32
  979. ar: Objects/iterobject.o: unknown load command 0x32
  980. ar: Objects/iterobject.o: unknown load command 0x32
  981. ar: Objects/listobject.o: unknown load command 0x32
  982. ar: Objects/listobject.o: unknown load command 0x32
  983. ar: Objects/listobject.o: unknown load command 0x32
  984. ar: Objects/longobject.o: unknown load command 0x32
  985. ar: Objects/longobject.o: unknown load command 0x32
  986. ar: Objects/longobject.o: unknown load command 0x32
  987. ar: Objects/dictobject.o: unknown load command 0x32
  988. ar: Objects/dictobject.o: unknown load command 0x32
  989. ar: Objects/dictobject.o: unknown load command 0x32
  990. ar: Objects/odictobject.o: unknown load command 0x32
  991. ar: Objects/odictobject.o: unknown load command 0x32
  992. ar: Objects/odictobject.o: unknown load command 0x32
  993. ar: Objects/memoryobject.o: unknown load command 0x32
  994. ar: Objects/memoryobject.o: unknown load command 0x32
  995. ar: Objects/memoryobject.o: unknown load command 0x32
  996. ar: Objects/methodobject.o: unknown load command 0x32
  997. ar: Objects/methodobject.o: unknown load command 0x32
  998. ar: Objects/methodobject.o: unknown load command 0x32
  999. ar: Objects/moduleobject.o: unknown load command 0x32
  1000. ar: Objects/moduleobject.o: unknown load command 0x32
  1001. ar: Objects/moduleobject.o: unknown load command 0x32
  1002. ar: Objects/namespaceobject.o: unknown load command 0x32
  1003. ar: Objects/namespaceobject.o: unknown load command 0x32
  1004. ar: Objects/namespaceobject.o: unknown load command 0x32
  1005. ar: Objects/object.o: unknown load command 0x32
  1006. ar: Objects/object.o: unknown load command 0x32
  1007. ar: Objects/object.o: unknown load command 0x32
  1008. ar: Objects/obmalloc.o: unknown load command 0x32
  1009. ar: Objects/obmalloc.o: unknown load command 0x32
  1010. ar: Objects/obmalloc.o: unknown load command 0x32
  1011. ar: Objects/capsule.o: unknown load command 0x32
  1012. ar: Objects/capsule.o: unknown load command 0x32
  1013. ar: Objects/capsule.o: unknown load command 0x32
  1014. ar: Objects/rangeobject.o: unknown load command 0x32
  1015. ar: Objects/rangeobject.o: unknown load command 0x32
  1016. ar: Objects/rangeobject.o: unknown load command 0x32
  1017. ar: Objects/setobject.o: unknown load command 0x32
  1018. ar: Objects/setobject.o: unknown load command 0x32
  1019. ar: Objects/setobject.o: unknown load command 0x32
  1020. ar: Objects/sliceobject.o: unknown load command 0x32
  1021. ar: Objects/sliceobject.o: unknown load command 0x32
  1022. ar: Objects/sliceobject.o: unknown load command 0x32
  1023. ar: Objects/structseq.o: unknown load command 0x32
  1024. ar: Objects/structseq.o: unknown load command 0x32
  1025. ar: Objects/structseq.o: unknown load command 0x32
  1026. ar: Objects/tupleobject.o: unknown load command 0x32
  1027. ar: Objects/tupleobject.o: unknown load command 0x32
  1028. ar: Objects/tupleobject.o: unknown load command 0x32
  1029. ar: Objects/typeobject.o: unknown load command 0x32
  1030. ar: Objects/typeobject.o: unknown load command 0x32
  1031. ar: Objects/typeobject.o: unknown load command 0x32
  1032. ar: Objects/unicodeobject.o: unknown load command 0x32
  1033. ar: Objects/unicodeobject.o: unknown load command 0x32
  1034. ar: Objects/unicodeobject.o: unknown load command 0x32
  1035. ar: Objects/unicodectype.o: unknown load command 0x32
  1036. ar: Objects/unicodectype.o: unknown load command 0x32
  1037. ar: Objects/unicodectype.o: unknown load command 0x32
  1038. ar: Objects/weakrefobject.o: unknown load command 0x32
  1039. ar: Objects/weakrefobject.o: unknown load command 0x32
  1040. ar: Objects/weakrefobject.o: unknown load command 0x32
  1041. ar: Python/_warnings.o: unknown load command 0x32
  1042. ar: Python/_warnings.o: unknown load command 0x32
  1043. ar: Python/_warnings.o: unknown load command 0x32
  1044. ar: Python/Python-ast.o: unknown load command 0x32
  1045. ar: Python/Python-ast.o: unknown load command 0x32
  1046. ar: Python/Python-ast.o: unknown load command 0x32
  1047. ar: Python/asdl.o: unknown load command 0x32
  1048. ar: Python/asdl.o: unknown load command 0x32
  1049. ar: Python/asdl.o: unknown load command 0x32
  1050. ar: Python/ast.o: unknown load command 0x32
  1051. ar: Python/ast.o: unknown load command 0x32
  1052. ar: Python/ast.o: unknown load command 0x32
  1053. ar: Python/ast_opt.o: unknown load command 0x32
  1054. ar: Python/ast_opt.o: unknown load command 0x32
  1055. ar: Python/ast_opt.o: unknown load command 0x32
  1056. ar: Python/ast_unparse.o: unknown load command 0x32
  1057. ar: Python/ast_unparse.o: unknown load command 0x32
  1058. ar: Python/ast_unparse.o: unknown load command 0x32
  1059. ar: Python/bltinmodule.o: unknown load command 0x32
  1060. ar: Python/bltinmodule.o: unknown load command 0x32
  1061. ar: Python/bltinmodule.o: unknown load command 0x32
  1062. ar: Python/ceval.o: unknown load command 0x32
  1063. ar: Python/ceval.o: unknown load command 0x32
  1064. ar: Python/ceval.o: unknown load command 0x32
  1065. ar: Python/compile.o: unknown load command 0x32
  1066. ar: Python/compile.o: unknown load command 0x32
  1067. ar: Python/compile.o: unknown load command 0x32
  1068. ar: Python/codecs.o: unknown load command 0x32
  1069. ar: Python/codecs.o: unknown load command 0x32
  1070. ar: Python/codecs.o: unknown load command 0x32
  1071. ar: Python/dynamic_annotations.o: unknown load command 0x32
  1072. ar: Python/dynamic_annotations.o: unknown load command 0x32
  1073. ar: Python/dynamic_annotations.o: unknown load command 0x32
  1074. ar: Python/errors.o: unknown load command 0x32
  1075. ar: Python/errors.o: unknown load command 0x32
  1076. ar: Python/errors.o: unknown load command 0x32
  1077. ar: Python/frozenmain.o: unknown load command 0x32
  1078. ar: Python/frozenmain.o: unknown load command 0x32
  1079. ar: Python/frozenmain.o: unknown load command 0x32
  1080. ar: Python/future.o: unknown load command 0x32
  1081. ar: Python/future.o: unknown load command 0x32
  1082. ar: Python/future.o: unknown load command 0x32
  1083. ar: Python/getargs.o: unknown load command 0x32
  1084. ar: Python/getargs.o: unknown load command 0x32
  1085. ar: Python/getargs.o: unknown load command 0x32
  1086. ar: Python/getcompiler.o: unknown load command 0x32
  1087. ar: Python/getcompiler.o: unknown load command 0x32
  1088. ar: Python/getcompiler.o: unknown load command 0x32
  1089. ar: Python/getcopyright.o: unknown load command 0x32
  1090. ar: Python/getcopyright.o: unknown load command 0x32
  1091. ar: Python/getcopyright.o: unknown load command 0x32
  1092. ar: Python/getplatform.o: unknown load command 0x32
  1093. ar: Python/getplatform.o: unknown load command 0x32
  1094. ar: Python/getplatform.o: unknown load command 0x32
  1095. ar: Python/getversion.o: unknown load command 0x32
  1096. ar: Python/getversion.o: unknown load command 0x32
  1097. ar: Python/getversion.o: unknown load command 0x32
  1098. ar: Python/graminit.o: unknown load command 0x32
  1099. ar: Python/graminit.o: unknown load command 0x32
  1100. ar: Python/graminit.o: unknown load command 0x32
  1101. ar: Python/import.o: unknown load command 0x32
  1102. ar: Python/import.o: unknown load command 0x32
  1103. ar: Python/import.o: unknown load command 0x32
  1104. ar: Python/importdl.o: unknown load command 0x32
  1105. ar: Python/importdl.o: unknown load command 0x32
  1106. ar: Python/importdl.o: unknown load command 0x32
  1107. ar: Python/marshal.o: unknown load command 0x32
  1108. ar: Python/marshal.o: unknown load command 0x32
  1109. ar: Python/marshal.o: unknown load command 0x32
  1110. ar: Python/modsupport.o: unknown load command 0x32
  1111. ar: Python/modsupport.o: unknown load command 0x32
  1112. ar: Python/modsupport.o: unknown load command 0x32
  1113. ar: Python/mysnprintf.o: unknown load command 0x32
  1114. ar: Python/mysnprintf.o: unknown load command 0x32
  1115. ar: Python/mysnprintf.o: unknown load command 0x32
  1116. ar: Python/mystrtoul.o: unknown load command 0x32
  1117. ar: Python/mystrtoul.o: unknown load command 0x32
  1118. ar: Python/mystrtoul.o: unknown load command 0x32
  1119. ar: Python/pathconfig.o: unknown load command 0x32
  1120. ar: Python/pathconfig.o: unknown load command 0x32
  1121. ar: Python/pathconfig.o: unknown load command 0x32
  1122. ar: Python/peephole.o: unknown load command 0x32
  1123. ar: Python/peephole.o: unknown load command 0x32
  1124. ar: Python/peephole.o: unknown load command 0x32
  1125. ar: Python/pyarena.o: unknown load command 0x32
  1126. ar: Python/pyarena.o: unknown load command 0x32
  1127. ar: Python/pyarena.o: unknown load command 0x32
  1128. ar: Python/pyctype.o: unknown load command 0x32
  1129. ar: Python/pyctype.o: unknown load command 0x32
  1130. ar: Python/pyctype.o: unknown load command 0x32
  1131. ar: Python/pyfpe.o: unknown load command 0x32
  1132. ar: Python/pyfpe.o: unknown load command 0x32
  1133. ar: Python/pyfpe.o: unknown load command 0x32
  1134. ar: Python/pyhash.o: unknown load command 0x32
  1135. ar: Python/pyhash.o: unknown load command 0x32
  1136. ar: Python/pyhash.o: unknown load command 0x32
  1137. ar: Python/pylifecycle.o: unknown load command 0x32
  1138. ar: Python/pylifecycle.o: unknown load command 0x32
  1139. ar: Python/pylifecycle.o: unknown load command 0x32
  1140. ar: Python/pymath.o: unknown load command 0x32
  1141. ar: Python/pymath.o: unknown load command 0x32
  1142. ar: Python/pymath.o: unknown load command 0x32
  1143. ar: Python/pystate.o: unknown load command 0x32
  1144. ar: Python/pystate.o: unknown load command 0x32
  1145. ar: Python/pystate.o: unknown load command 0x32
  1146. ar: Python/context.o: unknown load command 0x32
  1147. ar: Python/context.o: unknown load command 0x32
  1148. ar: Python/context.o: unknown load command 0x32
  1149. ar: Python/hamt.o: unknown load command 0x32
  1150. ar: Python/hamt.o: unknown load command 0x32
  1151. ar: Python/hamt.o: unknown load command 0x32
  1152. ar: Python/pythonrun.o: unknown load command 0x32
  1153. ar: Python/pythonrun.o: unknown load command 0x32
  1154. ar: Python/pythonrun.o: unknown load command 0x32
  1155. ar: Python/pytime.o: unknown load command 0x32
  1156. ar: Python/pytime.o: unknown load command 0x32
  1157. ar: Python/pytime.o: unknown load command 0x32
  1158. ar: Python/bootstrap_hash.o: unknown load command 0x32
  1159. ar: Python/bootstrap_hash.o: unknown load command 0x32
  1160. ar: Python/bootstrap_hash.o: unknown load command 0x32
  1161. ar: Python/structmember.o: unknown load command 0x32
  1162. ar: Python/structmember.o: unknown load command 0x32
  1163. ar: Python/structmember.o: unknown load command 0x32
  1164. ar: Python/symtable.o: unknown load command 0x32
  1165. ar: Python/symtable.o: unknown load command 0x32
  1166. ar: Python/symtable.o: unknown load command 0x32
  1167. ar: Python/sysmodule.o: unknown load command 0x32
  1168. ar: Python/sysmodule.o: unknown load command 0x32
  1169. ar: Python/sysmodule.o: unknown load command 0x32
  1170. ar: Python/thread.o: unknown load command 0x32
  1171. ar: Python/thread.o: unknown load command 0x32
  1172. ar: Python/thread.o: unknown load command 0x32
  1173. ar: Python/traceback.o: unknown load command 0x32
  1174. ar: Python/traceback.o: unknown load command 0x32
  1175. ar: Python/traceback.o: unknown load command 0x32
  1176. ar: Python/getopt.o: unknown load command 0x32
  1177. ar: Python/getopt.o: unknown load command 0x32
  1178. ar: Python/getopt.o: unknown load command 0x32
  1179. ar: Python/pystrcmp.o: unknown load command 0x32
  1180. ar: Python/pystrcmp.o: unknown load command 0x32
  1181. ar: Python/pystrcmp.o: unknown load command 0x32
  1182. ar: Python/pystrtod.o: unknown load command 0x32
  1183. ar: Python/pystrtod.o: unknown load command 0x32
  1184. ar: Python/pystrtod.o: unknown load command 0x32
  1185. ar: Python/pystrhex.o: unknown load command 0x32
  1186. ar: Python/pystrhex.o: unknown load command 0x32
  1187. ar: Python/pystrhex.o: unknown load command 0x32
  1188. ar: Python/dtoa.o: unknown load command 0x32
  1189. ar: Python/dtoa.o: unknown load command 0x32
  1190. ar: Python/dtoa.o: unknown load command 0x32
  1191. ar: Python/formatter_unicode.o: unknown load command 0x32
  1192. ar: Python/formatter_unicode.o: unknown load command 0x32
  1193. ar: Python/formatter_unicode.o: unknown load command 0x32
  1194. ar: Python/fileutils.o: unknown load command 0x32
  1195. ar: Python/fileutils.o: unknown load command 0x32
  1196. ar: Python/fileutils.o: unknown load command 0x32
  1197. ar: Python/dynload_shlib.o: unknown load command 0x32
  1198. ar: Python/dynload_shlib.o: unknown load command 0x32
  1199. ar: Python/dynload_shlib.o: unknown load command 0x32
  1200. ar: Modules/config.o: unknown load command 0x32
  1201. ar: Modules/config.o: unknown load command 0x32
  1202. ar: Modules/config.o: unknown load command 0x32
  1203. ar: Modules/getpath.o: unknown load command 0x32
  1204. ar: Modules/getpath.o: unknown load command 0x32
  1205. ar: Modules/getpath.o: unknown load command 0x32
  1206. ar: Modules/main.o: unknown load command 0x32
  1207. ar: Modules/main.o: unknown load command 0x32
  1208. ar: Modules/main.o: unknown load command 0x32
  1209. ar: Modules/gcmodule.o: unknown load command 0x32
  1210. ar: Modules/gcmodule.o: unknown load command 0x32
  1211. ar: Modules/gcmodule.o: unknown load command 0x32
  1212. ar: Modules/posixmodule.o: unknown load command 0x32
  1213. ar: Modules/posixmodule.o: unknown load command 0x32
  1214. ar: Modules/posixmodule.o: unknown load command 0x32
  1215. ar: Modules/errnomodule.o: unknown load command 0x32
  1216. ar: Modules/errnomodule.o: unknown load command 0x32
  1217. ar: Modules/errnomodule.o: unknown load command 0x32
  1218. ar: Modules/pwdmodule.o: unknown load command 0x32
  1219. ar: Modules/pwdmodule.o: unknown load command 0x32
  1220. ar: Modules/pwdmodule.o: unknown load command 0x32
  1221. ar: Modules/_sre.o: unknown load command 0x32
  1222. ar: Modules/_sre.o: unknown load command 0x32
  1223. ar: Modules/_sre.o: unknown load command 0x32
  1224. ar: Modules/_codecsmodule.o: unknown load command 0x32
  1225. ar: Modules/_codecsmodule.o: unknown load command 0x32
  1226. ar: Modules/_codecsmodule.o: unknown load command 0x32
  1227. ar: Modules/_weakref.o: unknown load command 0x32
  1228. ar: Modules/_weakref.o: unknown load command 0x32
  1229. ar: Modules/_weakref.o: unknown load command 0x32
  1230. ar: Modules/_functoolsmodule.o: unknown load command 0x32
  1231. ar: Modules/_functoolsmodule.o: unknown load command 0x32
  1232. ar: Modules/_functoolsmodule.o: unknown load command 0x32
  1233. ar: Modules/_operator.o: unknown load command 0x32
  1234. ar: Modules/_operator.o: unknown load command 0x32
  1235. ar: Modules/_operator.o: unknown load command 0x32
  1236. ar: Modules/_collectionsmodule.o: unknown load command 0x32
  1237. ar: Modules/_collectionsmodule.o: unknown load command 0x32
  1238. ar: Modules/_collectionsmodule.o: unknown load command 0x32
  1239. ar: Modules/_abc.o: unknown load command 0x32
  1240. ar: Modules/_abc.o: unknown load command 0x32
  1241. ar: Modules/_abc.o: unknown load command 0x32
  1242. ar: Modules/itertoolsmodule.o: unknown load command 0x32
  1243. ar: Modules/itertoolsmodule.o: unknown load command 0x32
  1244. ar: Modules/itertoolsmodule.o: unknown load command 0x32
  1245. ar: Modules/atexitmodule.o: unknown load command 0x32
  1246. ar: Modules/atexitmodule.o: unknown load command 0x32
  1247. ar: Modules/atexitmodule.o: unknown load command 0x32
  1248. ar: Modules/signalmodule.o: unknown load command 0x32
  1249. ar: Modules/signalmodule.o: unknown load command 0x32
  1250. ar: Modules/signalmodule.o: unknown load command 0x32
  1251. ar: Modules/_stat.o: unknown load command 0x32
  1252. ar: Modules/_stat.o: unknown load command 0x32
  1253. ar: Modules/_stat.o: unknown load command 0x32
  1254. ar: Modules/timemodule.o: unknown load command 0x32
  1255. ar: Modules/timemodule.o: unknown load command 0x32
  1256. ar: Modules/timemodule.o: unknown load command 0x32
  1257. ar: Modules/_threadmodule.o: unknown load command 0x32
  1258. ar: Modules/_threadmodule.o: unknown load command 0x32
  1259. ar: Modules/_threadmodule.o: unknown load command 0x32
  1260. ar: Modules/_localemodule.o: unknown load command 0x32
  1261. ar: Modules/_localemodule.o: unknown load command 0x32
  1262. ar: Modules/_localemodule.o: unknown load command 0x32
  1263. ar: Modules/_iomodule.o: unknown load command 0x32
  1264. ar: Modules/_iomodule.o: unknown load command 0x32
  1265. ar: Modules/_iomodule.o: unknown load command 0x32
  1266. ar: Modules/iobase.o: unknown load command 0x32
  1267. ar: Modules/iobase.o: unknown load command 0x32
  1268. ar: Modules/iobase.o: unknown load command 0x32
  1269. ar: Modules/fileio.o: unknown load command 0x32
  1270. ar: Modules/fileio.o: unknown load command 0x32
  1271. ar: Modules/fileio.o: unknown load command 0x32
  1272. ar: Modules/bytesio.o: unknown load command 0x32
  1273. ar: Modules/bytesio.o: unknown load command 0x32
  1274. ar: Modules/bytesio.o: unknown load command 0x32
  1275. ar: Modules/bufferedio.o: unknown load command 0x32
  1276. ar: Modules/bufferedio.o: unknown load command 0x32
  1277. ar: Modules/bufferedio.o: unknown load command 0x32
  1278. ar: Modules/textio.o: unknown load command 0x32
  1279. ar: Modules/textio.o: unknown load command 0x32
  1280. ar: Modules/textio.o: unknown load command 0x32
  1281. ar: Modules/stringio.o: unknown load command 0x32
  1282. ar: Modules/stringio.o: unknown load command 0x32
  1283. ar: Modules/stringio.o: unknown load command 0x32
  1284. ar: Modules/zipimport.o: unknown load command 0x32
  1285. ar: Modules/zipimport.o: unknown load command 0x32
  1286. ar: Modules/zipimport.o: unknown load command 0x32
  1287. ar: Modules/faulthandler.o: unknown load command 0x32
  1288. ar: Modules/faulthandler.o: unknown load command 0x32
  1289. ar: Modules/faulthandler.o: unknown load command 0x32
  1290. ar: Modules/_tracemalloc.o: unknown load command 0x32
  1291. ar: Modules/_tracemalloc.o: unknown load command 0x32
  1292. ar: Modules/_tracemalloc.o: unknown load command 0x32
  1293. ar: Modules/hashtable.o: unknown load command 0x32
  1294. ar: Modules/hashtable.o: unknown load command 0x32
  1295. ar: Modules/hashtable.o: unknown load command 0x32
  1296. ar: Modules/symtablemodule.o: unknown load command 0x32
  1297. ar: Modules/symtablemodule.o: unknown load command 0x32
  1298. ar: Modules/symtablemodule.o: unknown load command 0x32
  1299. ar: Modules/xxsubtype.o: unknown load command 0x32
  1300. ar: Modules/xxsubtype.o: unknown load command 0x32
  1301. ar: Modules/xxsubtype.o: unknown load command 0x32
  1302. ar: Python/frozen.o: unknown load command 0x32
  1303. ar: Python/frozen.o: unknown load command 0x32
  1304. ar: Python/frozen.o: unknown load command 0x32
  1305. clang -L/usr/local/opt/readline/lib -L/usr/local/opt/readline/lib -L/usr/local/opt/openssl/lib -L/usr/local/var/pyenv/versions/3.7.1/lib -L/usr/local/opt/openssl/lib -L/usr/local/opt/readline/lib -L/usr/local/opt/readline/lib -L/usr/local/opt/openssl/lib -L/usr/local/var/pyenv/versions/3.7.1/lib -L/usr/local/opt/openssl/lib -Wl,-stack_size,1000000  -framework CoreFoundation -o python.exe Programs/python.o libpython3.7m.a -ldl  -framework CoreFoundation    
  1306. clang -L/usr/local/opt/readline/lib -L/usr/local/opt/readline/lib -L/usr/local/opt/openssl/lib -L/usr/local/var/pyenv/versions/3.7.1/lib -L/usr/local/opt/openssl/lib -L/usr/local/opt/readline/lib -L/usr/local/opt/readline/lib -L/usr/local/opt/openssl/lib -L/usr/local/var/pyenv/versions/3.7.1/lib -L/usr/local/opt/openssl/lib -Wl,-stack_size,1000000  -framework CoreFoundation -o Programs/_testembed Programs/_testembed.o libpython3.7m.a -ldl  -framework CoreFoundation    
  1307. ld: warning: ignoring file libpython3.7m.a, file was built for archive which is not the architecture being linked (x86_64): libpython3.7m.ald: warning: ignoring file libpython3.7m.a, file was built for archive which is not the architecture being linked (x86_64): libpython3.7m.a
  1308.  
  1309. Undefined symbols for architecture x86_64:
  1310.   "__Py_UnixMain", referenced from:
  1311.       _main in python.o
  1312. ld: symbol(s) not found for architecture x86_64
  1313. Undefined symbols for architecture x86_64:
  1314.   "_PyEval_InitThreads", referenced from:
  1315.       _test_repeated_init_and_subinterpreters in _testembed.o
  1316.   "_PyEval_ReleaseThread", referenced from:
  1317.       _test_repeated_init_and_subinterpreters in _testembed.o
  1318.   "_PyEval_RestoreThread", referenced from:
  1319.       _test_repeated_init_and_subinterpreters in _testembed.o
  1320.       _test_bpo20891 in _testembed.o
  1321.   "_PyEval_SaveThread", referenced from:
  1322.       _test_bpo20891 in _testembed.o
  1323.   "_PyGILState_Check", referenced from:
  1324.       _bpo20891_thread in _testembed.o
  1325.   "_PyGILState_Ensure", referenced from:
  1326.       _test_repeated_init_and_subinterpreters in _testembed.o
  1327.       _bpo20891_thread in _testembed.o
  1328.   "_PyGILState_Release", referenced from:
  1329.       _test_repeated_init_and_subinterpreters in _testembed.o
  1330.       _bpo20891_thread in _testembed.o
  1331.   "_PyInterpreterState_GetID", referenced from:
  1332.       _test_repeated_init_and_subinterpreters in _testembed.o
  1333.   "_PyMem_RawFree", referenced from:
  1334.       _test_pre_initialization_api in _testembed.o
  1335.   "_PyRun_SimpleStringFlags", referenced from:
  1336.       _test_forced_io_encoding in _testembed.o
  1337.       _test_repeated_init_and_subinterpreters in _testembed.o
  1338.       _test_pre_initialization_api in _testembed.o
  1339.       _test_pre_initialization_sys_options in _testembed.o
  1340.   "_PySys_AddWarnOption", referenced from:
  1341.       _test_pre_initialization_sys_options in _testembed.o
  1342.   "_PySys_AddXOption", referenced from:
  1343.       _test_pre_initialization_sys_options in _testembed.o
  1344.   "_PySys_ResetWarnOptions", referenced from:
  1345.       _test_pre_initialization_sys_options in _testembed.o
  1346.   "_PyThreadState_Get", referenced from:
  1347.       _test_repeated_init_and_subinterpreters in _testembed.o
  1348.       _dump_config in _testembed.o
  1349.   "_PyThreadState_Swap", referenced from:
  1350.       _test_repeated_init_and_subinterpreters in _testembed.o
  1351.   "_PyThread_acquire_lock", referenced from:
  1352.       _test_bpo20891 in _testembed.o
  1353.   "_PyThread_allocate_lock", referenced from:
  1354.       _test_bpo20891 in _testembed.o
  1355.   "_PyThread_exit_thread", referenced from:
  1356.       _bpo20891_thread in _testembed.o
  1357.   "_PyThread_free_lock", referenced from:
  1358.       _test_bpo20891 in _testembed.o
  1359.   "_PyThread_release_lock", referenced from:
  1360.       _bpo20891_thread in _testembed.o
  1361.   "_PyThread_start_new_thread", referenced from:
  1362.       _test_bpo20891 in _testembed.o
  1363.   "_Py_BytesWarningFlag", referenced from:
  1364.       _test_init_global_config in _testembed.o
  1365.       _dump_config in _testembed.o
  1366.   "_Py_DebugFlag", referenced from:
  1367.       _dump_config in _testembed.o
  1368.   "_Py_DecodeLocale", referenced from:
  1369.       _test_pre_initialization_api in _testembed.o
  1370.   "_Py_DontWriteBytecodeFlag", referenced from:
  1371.       _test_init_global_config in _testembed.o
  1372.       _dump_config in _testembed.o
  1373.   "_Py_EndInterpreter", referenced from:
  1374.       _test_repeated_init_and_subinterpreters in _testembed.o
  1375.   "_Py_Finalize", referenced from:
  1376.       _test_forced_io_encoding in _testembed.o
  1377.       _test_repeated_init_and_subinterpreters in _testembed.o
  1378.       _test_pre_initialization_api in _testembed.o
  1379.       _test_pre_initialization_sys_options in _testembed.o
  1380.       _test_initialize_twice in _testembed.o
  1381.       _test_initialize_pymain in _testembed.o
  1382.       _test_init_default_config in _testembed.o
  1383.       ...
  1384.   "_Py_FrozenFlag", referenced from:
  1385.       _test_init_global_config in _testembed.o
  1386.       _dump_config in _testembed.o
  1387.   "_Py_GetProgramName", referenced from:
  1388.       _dump_config in _testembed.o
  1389.   "_Py_IgnoreEnvironmentFlag", referenced from:
  1390.       _test_init_env in _testembed.o
  1391.       _dump_config in _testembed.o
  1392.   "_Py_Initialize", referenced from:
  1393.       _test_forced_io_encoding in _testembed.o
  1394.       _test_repeated_init_and_subinterpreters in _testembed.o
  1395.       _test_pre_initialization_api in _testembed.o
  1396.       _test_pre_initialization_sys_options in _testembed.o
  1397.       _test_bpo20891 in _testembed.o
  1398.       _test_initialize_twice in _testembed.o
  1399.       _test_initialize_pymain in _testembed.o
  1400.       ...
  1401.   "_Py_InspectFlag", referenced from:
  1402.       _test_init_global_config in _testembed.o
  1403.       _dump_config in _testembed.o
  1404.   "_Py_InteractiveFlag", referenced from:
  1405.       _test_init_global_config in _testembed.o
  1406.       _dump_config in _testembed.o
  1407.   "_Py_IsolatedFlag", referenced from:
  1408.       _test_init_isolated in _testembed.o
  1409.       _dump_config in _testembed.o
  1410.   "_Py_Main", referenced from:
  1411.       _test_initialize_pymain in _testembed.o
  1412.   "_Py_NewInterpreter", referenced from:
  1413.       _test_repeated_init_and_subinterpreters in _testembed.o
  1414.   "_Py_NoSiteFlag", referenced from:
  1415.       _test_init_global_config in _testembed.o
  1416.       _dump_config in _testembed.o
  1417.   "_Py_NoUserSiteDirectory", referenced from:
  1418.       _test_init_global_config in _testembed.o
  1419.       _dump_config in _testembed.o
  1420.   "_Py_OptimizeFlag", referenced from:
  1421.       _test_init_global_config in _testembed.o
  1422.       _dump_config in _testembed.o
  1423.   "_Py_QuietFlag", referenced from:
  1424.       _test_init_global_config in _testembed.o
  1425.       _dump_config in _testembed.o
  1426.   "_Py_SetProgramName", referenced from:
  1427.       _test_forced_io_encoding in _testembed.o
  1428.       _test_repeated_init_and_subinterpreters in _testembed.o
  1429.       _test_pre_initialization_api in _testembed.o
  1430.       _test_pre_initialization_sys_options in _testembed.o
  1431.       _test_bpo20891 in _testembed.o
  1432.       _test_initialize_twice in _testembed.o
  1433.       _test_initialize_pymain in _testembed.o
  1434.       ...
  1435.   "_Py_SetStandardStreamEncoding", referenced from:
  1436.       _test_forced_io_encoding in _testembed.o
  1437.   "_Py_UTF8Mode", referenced from:
  1438.       _test_init_global_config in _testembed.o
  1439.       _test_init_from_config in _testembed.o
  1440.   "_Py_UnbufferedStdioFlag", referenced from:
  1441.       _test_init_global_config in _testembed.o
  1442.       _dump_config in _testembed.o
  1443.   "_Py_VerboseFlag", referenced from:
  1444.       _test_init_global_config in _testembed.o
  1445.       _dump_config in _testembed.o
  1446.   "__Py_FatalInitError", referenced from:
  1447.       _test_init_from_config in _testembed.o
  1448.       _test_init_dev_mode in _testembed.o
  1449.       _test_init_isolated in _testembed.o
  1450.   "__Py_InitializeFromConfig", referenced from:
  1451.       _test_init_from_config in _testembed.o
  1452.       _test_init_dev_mode in _testembed.o
  1453.       _test_init_isolated in _testembed.o
  1454. ld: symbol(s) not found for architecture x86_64
  1455. clang: error: linker command failed with exit code 1 (use -v to see invocation)
  1456. clang: error: linker command failed with exit code 1 (use -v to see invocation)
  1457. make: *** [Makefile:582: python.exe] Error 1
  1458. make: *** Waiting for unfinished jobs....
  1459. make: *** [Makefile:723: Programs/_testembed] Error 1
RAW Paste Data
We use cookies for various purposes including analytics. By continuing to use Pastebin, you agree to our use of cookies as described in the Cookies Policy. OK, I Understand
 
Top