SHARE
TWEET

Untitled

a guest Jan 14th, 2015 13 Never
Not a member of Pastebin yet? Sign Up, it unlocks many cool features!
  1. mkdir: cannot create directory ‘/home/dev-gso/zorba/src/zorba-3.0/build’: File exists
  2.   ->(B Configuring...(B
  3. -- Looking for LibXml2
  4. -- Found LIBXML2 library -- /usr/lib64/libxml2.so
  5. --
  6. -- Looking for ICU
  7. -- Found ICU library -- /usr/lib64/libicuuc.so
  8. -- ICU Version: 54.1.0
  9. -- Found ICU internationalization library -- /usr/lib64/libicui18n.so
  10. -- Found ICU data library -- /usr/lib64/libicudata.so
  11. -- Found ICU library -- /usr/lib64/libicuuc.so
  12. --
  13. -- Looking for Xerces-C
  14. --
  15. -- Executable: PHP5_EXECUTABLE-NOTFOUND
  16. -- Library: PHP5_LIBRARY-NOTFOUND
  17. -- *NIX Environment Configuration...
  18. -- ZORBA_NATIVE_STORE:                   ON
  19. -- ZORBA_STORE_DIR:                     /home/dev-gso/zorba/src/zorba-3.0/src/store/naive
  20. -- ZORBA_STORE_NAME:                    simplestore
  21. -- ZORBA_BATCHING_TYPE:                  0
  22. -- ZORBA_FLOAT_POINT_PRECISION:          18
  23. -- ZORBA_WITH_CODE_COVERAGE:             OFF
  24. -- ZORBA_WITH_CODE_PROFILE:              OFF
  25. -- ZORBA_FOR_ONE_THREAD_ONLY:            ON
  26. -- ZORBA_WITH_FILE_ACCESS [ON/OFF]:      ON
  27. -- ZORBA_WITH_DEBUGGER [ON/OFF]:         ON
  28. -- ZORBA_TEST_TIMEOUT_VALUE:             60
  29. -- ZORBA_VERIFY_PEER_SSL_CERTIFICATE:    OFF
  30. -- ZORBA_WIN_DLL:                        ON
  31. -- ZORBA_EXE:                            /home/dev-gso/zorba/src/zorba-3.0/build/bin/zorba
  32. -- ZORBA_DEBUG_PARSER:                   OFF
  33. -- ZORBA_DEBUG_STRING:                   OFF
  34. -- ZORBA_NO_ICU:                         OFF
  35. -- ZORBA_NO_FULL_TEXT:                   OFF
  36. -- ZORBA_NO_XMLSCHEMA:                   OFF
  37. -- ZORBA_WITH_BIG_INTEGER:               OFF
  38. -- ZORBA_WITH_THESAURUS:                 ON
  39. -- ZORBA_SUPPRESS_SWIG [ON/OFF]:         OFF
  40. -- ZORBA_XQUERYX:                        OFF
  41. -- ZORBA_TEST_XQUERYX:                   OFF
  42. -- CMAKE_BINARY_DIR:                     /home/dev-gso/zorba/src/zorba-3.0/build
  43. -- CMAKE_SOURCE_DIR:                     /home/dev-gso/zorba/src/zorba-3.0
  44. -- CMAKE_SYSTEM:                         Linux-3.17.6-1-ARCH
  45. -- CMAKE_SYSTEM_NAME:                    Linux
  46. -- CMAKE_SYSTEM_VERSION:                 3.17.6-1-ARCH
  47. -- CMAKE_SYSTEM_PROCESSOR:               x86_64
  48. -- UNIX:                                 1
  49. -- WIN32:                                
  50. -- APPLE:                                
  51. -- MINGW:                                
  52. -- CYGWIN:                              
  53. -- BORLAND:                              
  54. -- MSVC:                                
  55. -- MSVC_IDE:                            
  56. -- MSVC60:                              
  57. -- MSVC70:                              
  58. -- MSVC71:                              
  59. -- MSVC80:                              
  60. -- CMAKE_COMPILER_2005:                  
  61. -- CMAKE_C_FLAGS:                        -march=x86-64 -mtune=generic -O2 -pipe -fstack-protector-strong --param=ssp-buffer-size=4
  62. -- CMAKE_CXX_FLAGS:                      -march=x86-64 -mtune=generic -O2 -pipe -fstack-protector-strong --param=ssp-buffer-size=4 -std=gnu++11 -Wno-c++0x-compat
  63. -- CMAKE_BUILD_TYPE:                     Release
  64. -- CMAKE_INSTALL_PREFIX:                 /usr
  65. -- BUILD_SHARED_LIBS:                    
  66. -- CMAKE_C_COMPILER:                     /usr/bin/cc
  67. -- CMAKE_CXX_COMPILER:                   /usr/bin/c++
  68. -- CMAKE_COMPILER_IS_GNUCC:              1
  69. -- CMAKE_COMPILER_IS_GNUCXX:             1
  70. -- CMAKE_AR:                             /usr/bin/ar
  71. -- CMAKE_RANLIB:                         /usr/bin/ranlib
  72. -- CMAKE_BUILD_TOOL = /usr/bin/make
  73. -- Detected GNU compiler version 4.9.2 (major version 4)
  74. -- GNU Compiler version greater than 4.0.1
  75. -- Found Xerces 3.1.1 -- /usr/include/usr/lib64/libxerces-c.so
  76. -- Zorba version number: 3.0.0
  77. -- configured /home/dev-gso/zorba/src/zorba-3.0/scripts/create-doc-tar.sh.in -> /home/dev-gso/zorba/src/zorba-3.0/build/scripts/create-doc-tar.sh
  78. -- [WARNING] Zorba Command Line Utility at "/home/dev-gso/zorba/src/zorba-3.0/build/bin/zorba does not work properly and cannot generate the NOTICE.txt file. (Output from Zorba test command:
  79. -- LIBEDIT_INCLUDE-NOTFOUND
  80. -- LIBEDIT_LIBRARY-NOTFOUND
  81. -- Could NOT find Libedit (missing:  LIBEDIT_INCLUDE LIBEDIT_LIBRARY)
  82. -- configured /home/dev-gso/zorba/src/zorba-3.0/bin/debugger/config.h.cmake --> /home/dev-gso/zorba/src/zorba-3.0/build/bin/debugger/config.h
  83. -- ZORBA_TEST_PLAN_SERIALIZATION:                OFF
  84. -- ZORBA_TEST_PLAN_SERIALIZATION_EXECUTION_ONLY: OFF
  85. -- ZORBA_TEST_PLAN_SERIALIZATION_COMPILE_ONLY:   OFF
  86. -- Adjusting FILESYSTEM
  87. -- only release version found
  88. -- Boost component library found FILESYSTEM
  89. -- Found Boost v1_57: /usr/include
  90. --       Boost lib path: /usr/lib64
  91. -- Adjusting SYSTEM
  92. -- only release version found
  93. -- Boost component library found SYSTEM
  94. -- Adding API tests for CTest
  95. -- Adding iterator plan tests
  96. -- Adding tests for CTest
  97. -- Looking for cURL
  98. -- Adding another 1000 Tests
  99. -- Adding another 1000 Tests
  100. -- Adding another 1000 Tests
  101. -- Add library ext2.xq
  102. -- Add library ext.xq
  103. -- Add library link.xq
  104. -- Adding unit tests for CTest
  105. -- Adding update tests for CTest
  106. -- Adding SAX2 tests for CTest
  107. -- Looking for cURL
  108. -- Found cURL library -- /usr/lib64/libcurl.so
  109. -- Add library http-client.xq
  110. -- Add library file.xq
  111. -- Add library zorba-query.xq
  112. -- End modules
  113. -- Could NOT find Doxygen (missing:  DOXYGEN_EXECUTABLE)
  114. -- Adding test for the C++ API's documentation: doc/cxx/examples/simple.cpp
  115. -- Adding test for the C++ API's documentation: doc/cxx/examples/sax2.cpp
  116. -- Adding test for the C++ API's documentation: doc/cxx/examples/errors.cpp
  117. -- Adding test for the C++ API's documentation: doc/cxx/examples/context.cpp
  118. -- Adding test for the C++ API's documentation: doc/cxx/examples/serialization.cpp
  119. -- Adding test for the C++ API's documentation: doc/cxx/examples/chaining.cpp
  120. -- Adding test for the C++ API's documentation: doc/cxx/examples/external_functions.cpp
  121. -- Adding test for the C++ API's documentation: doc/cxx/examples/datamanager.cpp
  122. -- Adding test for the C++ API's documentation: doc/cxx/examples/uri_resolvers.cpp
  123. -- Adding test for the C++ API's documentation: doc/cxx/examples/execution_plans.cpp
  124. -- Adding test for the C++ API's documentation: doc/cxx/examples/item_handler.cpp
  125. -- Adding test for the C++ API's documentation: doc/cxx/examples/callback.cpp
  126. -- Adding test for the C++ API's documentation: doc/cxx/examples/binary.cpp
  127. -- Adding test for the C++ API's documentation: doc/cxx/examples/module_import_check.cpp
  128. -- Adding test for the C++ API's documentation: doc/cxx/examples/jsoniq.cpp
  129. -- configured /home/dev-gso/zorba/src/zorba-3.0/doc/cxx/examples/Makefile.cmake /home/dev-gso/zorba/src/zorba-3.0/build/doc/cxx/examples/Makefile.zorba
  130. -- Adding test for the C API's documentation: doc/c/examples/csimple.c
  131. -- Adding test for the C API's documentation: doc/c/examples/ccontext.c
  132. -- Adding test for the C API's documentation: doc/c/examples/cerror.c
  133. -- Adding test for the C API's documentation: doc/c/examples/cparsing.c
  134. -- Adding test for the C API's documentation: doc/c/examples/cexternal_functions.c
  135. -- Adding test for the C API's documentation: doc/c/examples/cserialization.c
  136. -- Adding test for the C API's documentation: doc/c/examples/csequences.c
  137. -- Seting path for java tests /home/dev-gso/zorba/src/zorba-3.0/build/swig/java
  138. -- Adding Python test
  139. -- RUBY_EXECUTABLE: /usr/bin/ruby
  140. -- configured /home/dev-gso/zorba/src/zorba-3.0/include/zorba/config.h.cmake -->/home/dev-gso/zorba/src/zorba-3.0/build/include/zorba/config.h
  141. -- Bison: 3.0 >  2.4
  142. -- Bison: 3.0 == 3.0
  143. -- Flex: 2.5.39 >  2.5.35
  144. -- configured /home/dev-gso/zorba/src/zorba-3.0/src/compiler/parser/copyparser.sh.cmake -->/home/dev-gso/zorba/src/zorba-3.0/build/copyparser.sh
  145. -- configured /home/dev-gso/zorba/src/zorba-3.0/src/context/root_static_context_init.cpp.in =>
  146.                /home/dev-gso/zorba/src/zorba-3.0/build/src/context/root_static_context_init.cpp
  147. -- PRECOMPILED HEADERS: OFF
  148. -- processing store dir /home/dev-gso/zorba/src/zorba-3.0/src/store/naive with name simplestore
  149. -- SWIG: Generating Python API
  150. -- SWIG: PHP5 binding not generated because library and include file are not installed.
  151. -- SWIG: Java binding not generated because JNI was not found.
  152. -- SWIG: Generating XQJ API
  153. -- Copying tck batch...
  154. -- Ruby module being built non-Universal
  155. -- SWIG: Generating Ruby API
  156. -- Creating check_core_uris and check_uris targets
  157. -- ADD_XQDOC_TARGETS
  158. --   added target xqdoc
  159. --   added test test/xqdoc/make_xqdoc
  160. -- ADD_XQDOC_TARGETS END
  161. -- Configuring done
  162. -- Generating done
  163. -- Build files have been written to: /home/dev-gso/zorba/src/zorba-3.0/build
  164.   ->(B Compiling...(B
  165. [  0%] Built target gen_diag_modules
  166. [  1%] Built target JavaTest
  167. [  1%] Built target JavaTest2
  168. [  1%] Copying /home/dev-gso/zorba/src/zorba-3.0/build/test/rbkt/modules/java/zorba-classpath.txt to URI path
  169. [ 20%] Built target check_core_uris
  170. [ 20%] Built target check_uris
  171. [ 20%] Generating compiler/parser/xquery_parser.y
  172. [ 20%] Generating compiler/parser/xquery_parser.cpp, compiler/parser/xquery_parser.hpp, compiler/parser/location.hh, compiler/parser/position.hh, compiler/parser/stack.hh
  173. [ 20%] Generating compiler/parser/jsoniq_parser.y
  174. [ 20%] Generating compiler/parser/jsoniq_parser.cpp, compiler/parser/jsoniq_parser.hpp, compiler/parser/location.hh, compiler/parser/position.hh, compiler/parser/stack.hh
  175. Scanning dependencies of target zorba_simplestore
  176. [ 20%] Building CXX object src/CMakeFiles/zorba_simplestore.dir/api/zorba.cpp.o
  177. [ 20%] Building CXX object src/CMakeFiles/zorba_simplestore.dir/api/zorbaimpl.cpp.o
  178. [ 20%] Building CXX object src/CMakeFiles/zorba_simplestore.dir/api/xqueryimpl.cpp.o
  179. [ 20%] Building CXX object src/CMakeFiles/zorba_simplestore.dir/api/sax2impl.cpp.o
  180. [ 20%] Building CXX object src/CMakeFiles/zorba_simplestore.dir/api/staticcontextimpl.cpp.o
  181. [ 20%] Building CXX object src/CMakeFiles/zorba_simplestore.dir/api/dynamiccontextimpl.cpp.o
  182. [ 20%] Building CXX object src/CMakeFiles/zorba_simplestore.dir/api/zorba_string.cpp.o
  183. [ 20%] Building CXX object src/CMakeFiles/zorba_simplestore.dir/api/itemfactoryimpl.cpp.o
  184. [ 20%] Building CXX object src/CMakeFiles/zorba_simplestore.dir/api/item.cpp.o
  185. [ 20%] Building CXX object src/CMakeFiles/zorba_simplestore.dir/api/sequencetype.cpp.o
  186. [ 20%] Building CXX object src/CMakeFiles/zorba_simplestore.dir/api/unmarshaller.cpp.o
  187. [ 20%] Building CXX object src/CMakeFiles/zorba_simplestore.dir/api/xmldatamanagerimpl.cpp.o
  188. [ 20%] Building CXX object src/CMakeFiles/zorba_simplestore.dir/api/documentmanagerimpl.cpp.o
  189. [ 20%] Building CXX object src/CMakeFiles/zorba_simplestore.dir/api/collectionmanagerimpl.cpp.o
  190. [ 20%] Building CXX object src/CMakeFiles/zorba_simplestore.dir/api/staticcollectionmanagerimpl.cpp.o
  191. [ 20%] Building CXX object src/CMakeFiles/zorba_simplestore.dir/api/collectionimpl.cpp.o
  192. [ 20%] Building CXX object src/CMakeFiles/zorba_simplestore.dir/api/options.cpp.o
  193. [ 21%] Building CXX object src/CMakeFiles/zorba_simplestore.dir/api/functionimpl.cpp.o
  194. [ 21%] Building CXX object src/CMakeFiles/zorba_simplestore.dir/api/item_iter_singleton.cpp.o
  195. [ 21%] Building CXX object src/CMakeFiles/zorba_simplestore.dir/api/item_iter_vector.cpp.o
  196. [ 21%] Building CXX object src/CMakeFiles/zorba_simplestore.dir/api/item_iter_store.cpp.o
  197. [ 21%] Building CXX object src/CMakeFiles/zorba_simplestore.dir/api/item_iter_query_result.cpp.o
  198. [ 21%] Building CXX object src/CMakeFiles/zorba_simplestore.dir/api/item_seq_invoke.cpp.o
  199. [ 21%] Building CXX object src/CMakeFiles/zorba_simplestore.dir/api/serializerimpl.cpp.o
  200. [ 21%] Building CXX object src/CMakeFiles/zorba_simplestore.dir/api/uriimpl.cpp.o
  201. [ 21%] Building CXX object src/CMakeFiles/zorba_simplestore.dir/api/uri_resolver_wrappers.cpp.o
  202. [ 21%] Building CXX object src/CMakeFiles/zorba_simplestore.dir/api/annotationimpl.cpp.o
  203. [ 21%] Building CXX object src/CMakeFiles/zorba_simplestore.dir/api/module_info_impl.cpp.o
  204. [ 21%] Building CXX object src/CMakeFiles/zorba_simplestore.dir/api/stemmer_wrappers.cpp.o
  205. [ 21%] Building CXX object src/CMakeFiles/zorba_simplestore.dir/api/thesaurus_wrappers.cpp.o
  206. [ 21%] Building CXX object src/CMakeFiles/zorba_simplestore.dir/api/serialization/serializer.cpp.o
  207. [ 21%] Building CXX object src/CMakeFiles/zorba_simplestore.dir/capi/cimplementation.cpp.o
  208. [ 21%] Building CXX object src/CMakeFiles/zorba_simplestore.dir/capi/csequence.cpp.o
  209. [ 21%] Building CXX object src/CMakeFiles/zorba_simplestore.dir/capi/user_item_sequence.cpp.o
  210. [ 21%] Building CXX object src/CMakeFiles/zorba_simplestore.dir/capi/zorbac.cpp.o
  211. [ 21%] Building CXX object src/CMakeFiles/zorba_simplestore.dir/compiler/parser/symbol_table.cpp.o
  212. [ 21%] Building CXX object src/CMakeFiles/zorba_simplestore.dir/compiler/parser/xquery_driver.cpp.o
  213. [ 21%] Building CXX object src/CMakeFiles/zorba_simplestore.dir/compiler/parser/parser_helpers.cpp.o
  214. [ 21%] Building CXX object src/CMakeFiles/zorba_simplestore.dir/compiler/parser/zorba_parser_error.cpp.o
  215. [ 21%] Building CXX object src/CMakeFiles/zorba_simplestore.dir/compiler/parsetree/parsenode_print_xml_visitor.cpp.o
  216. [ 21%] Building CXX object src/CMakeFiles/zorba_simplestore.dir/compiler/parsetree/parsenode_print_xqdoc_visitor.cpp.o
  217. /home/dev-gso/zorba/src/zorba-3.0/src/compiler/parsetree/parsenode_print_xqdoc_visitor.cpp: In constructor ‘zorba::ParseNodePrintXQDocVisitor::ParseNodePrintXQDocVisitor(zorba::store::Item_t&, const string&, uint32_t)’:
  218. /home/dev-gso/zorba/src/zorba-3.0/src/compiler/parsetree/parsenode_print_xqdoc_visitor.cpp:92:24: warning: ‘zorba::ParseNodePrintXQDocVisitor::theWaitForIndexSourceLiteral’ will be initialized after [-Wreorder]
  219.    bool                 theWaitForIndexSourceLiteral;
  220.                         ^
  221. /home/dev-gso/zorba/src/zorba-3.0/src/compiler/parsetree/parsenode_print_xqdoc_visitor.cpp:86:24: warning:   ‘bool zorba::ParseNodePrintXQDocVisitor::theLanguageKind’ [-Wreorder]
  222.    bool                 theLanguageKind;
  223.                         ^
  224. /home/dev-gso/zorba/src/zorba-3.0/src/compiler/parsetree/parsenode_print_xqdoc_visitor.cpp:508:1: warning:   when initialized here [-Wreorder]
  225.  ParseNodePrintXQDocVisitor(store::Item_t& aResult,
  226.  ^
  227. [ 21%] Building CXX object src/CMakeFiles/zorba_simplestore.dir/compiler/parsetree/parsenode_print_xquery_visitor.cpp.o
  228. /home/dev-gso/zorba/src/zorba-3.0/src/compiler/parsetree/parsenode_print_xquery_visitor.cpp: In member function ‘virtual void* zorba::ParseNodePrintXQueryVisitor::begin_visit(const zorba::ValueComp&)’:
  229. /home/dev-gso/zorba/src/zorba-3.0/src/compiler/parsetree/parsenode_print_xquery_visitor.cpp:1015:13: warning: enumeration value ‘op_val_not’ not handled in switch [-Wswitch]
  230.        switch(n.get_type())
  231.              ^
  232. [ 21%] Building CXX object src/CMakeFiles/zorba_simplestore.dir/compiler/parsetree/parsenodes.cpp.o
  233. [ 21%] Building CXX object src/CMakeFiles/zorba_simplestore.dir/compiler/translator/prolog_graph.cpp.o
  234. [ 21%] Building CXX object src/CMakeFiles/zorba_simplestore.dir/compiler/translator/translator.cpp.o
  235. [ 21%] Building CXX object src/CMakeFiles/zorba_simplestore.dir/compiler/translator/module_version.cpp.o
  236. [ 22%] Building CXX object src/CMakeFiles/zorba_simplestore.dir/compiler/codegen/plan_visitor.cpp.o
  237. [ 22%] Building CXX object src/CMakeFiles/zorba_simplestore.dir/compiler/expression/expr_base.cpp.o
  238. [ 22%] Building CXX object src/CMakeFiles/zorba_simplestore.dir/compiler/expression/expr_clone.cpp.o
  239. [ 22%] Building CXX object src/CMakeFiles/zorba_simplestore.dir/compiler/expression/expr_iter.cpp.o
  240. [ 22%] Building CXX object src/CMakeFiles/zorba_simplestore.dir/compiler/expression/expr_type.cpp.o
  241. [ 22%] Building CXX object src/CMakeFiles/zorba_simplestore.dir/compiler/expression/expr.cpp.o
  242. [ 22%] Building CXX object src/CMakeFiles/zorba_simplestore.dir/compiler/expression/expr_put.cpp.o
  243. [ 22%] Building CXX object src/CMakeFiles/zorba_simplestore.dir/compiler/expression/expr_utils.cpp.o
  244. [ 22%] Building CXX object src/CMakeFiles/zorba_simplestore.dir/compiler/expression/json_exprs.cpp.o
  245. [ 22%] Building CXX object src/CMakeFiles/zorba_simplestore.dir/compiler/expression/var_expr.cpp.o
  246. [ 22%] Building CXX object src/CMakeFiles/zorba_simplestore.dir/compiler/expression/path_expr.cpp.o
  247. [ 23%] Building CXX object src/CMakeFiles/zorba_simplestore.dir/compiler/expression/flwor_expr.cpp.o
  248. [ 23%] Building CXX object src/CMakeFiles/zorba_simplestore.dir/compiler/expression/fo_expr.cpp.o
  249. [ 23%] Building CXX object src/CMakeFiles/zorba_simplestore.dir/compiler/expression/script_exprs.cpp.o
  250. [ 23%] Building CXX object src/CMakeFiles/zorba_simplestore.dir/compiler/expression/update_exprs.cpp.o
  251. [ 23%] Building CXX object src/CMakeFiles/zorba_simplestore.dir/compiler/expression/function_item_expr.cpp.o
  252. [ 23%] Building CXX object src/CMakeFiles/zorba_simplestore.dir/compiler/expression/pragma.cpp.o
  253. [ 23%] Building CXX object src/CMakeFiles/zorba_simplestore.dir/compiler/expression/expr_manager.cpp.o
  254. [ 23%] Building CXX object src/CMakeFiles/zorba_simplestore.dir/compiler/expression/ft_expr.cpp.o
  255. [ 23%] Building CXX object src/CMakeFiles/zorba_simplestore.dir/compiler/expression/ftnode.cpp.o
  256. [ 23%] Building CXX object src/CMakeFiles/zorba_simplestore.dir/compiler/expression/ftnode_visitor.cpp.o
  257. [ 24%] Building CXX object src/CMakeFiles/zorba_simplestore.dir/compiler/rewriter/framework/rule_driver.cpp.o
  258. [ 24%] Building CXX object src/CMakeFiles/zorba_simplestore.dir/compiler/rewriter/framework/rewriter_context.cpp.o
  259. [ 24%] Building CXX object src/CMakeFiles/zorba_simplestore.dir/compiler/rewriter/framework/sequential_rewriter.cpp.o
  260. [ 24%] Building CXX object src/CMakeFiles/zorba_simplestore.dir/compiler/rewriter/framework/default_optimizer.cpp.o
  261. [ 24%] Building CXX object src/CMakeFiles/zorba_simplestore.dir/compiler/rewriter/rules/rule_base.cpp.o
  262. [ 24%] Building CXX object src/CMakeFiles/zorba_simplestore.dir/compiler/rewriter/rules/nodeid_rules.cpp.o
  263. [ 24%] Building CXX object src/CMakeFiles/zorba_simplestore.dir/compiler/rewriter/rules/debug_rules.cpp.o
  264. [ 24%] Building CXX object src/CMakeFiles/zorba_simplestore.dir/compiler/rewriter/rules/type_rules.cpp.o
  265. [ 24%] Building CXX object src/CMakeFiles/zorba_simplestore.dir/compiler/rewriter/rules/flwor_rules.cpp.o
  266. [ 24%] Building CXX object src/CMakeFiles/zorba_simplestore.dir/compiler/rewriter/rules/fold_rules.cpp.o
  267. [ 24%] Building CXX object src/CMakeFiles/zorba_simplestore.dir/compiler/rewriter/rules/path_rules.cpp.o
  268. [ 25%] Building CXX object src/CMakeFiles/zorba_simplestore.dir/compiler/rewriter/rules/hoist_rules.cpp.o
  269. [ 25%] Building CXX object src/CMakeFiles/zorba_simplestore.dir/compiler/rewriter/rules/index_join_rule.cpp.o
  270. /home/dev-gso/zorba/src/zorba-3.0/src/compiler/rewriter/rules/index_join_rule.cpp: In member function ‘bool zorba::IndexJoinRule::findIndexPos(zorba::PredicateInfo&, zorba::csize)’:
  271. /home/dev-gso/zorba/src/zorba-3.0/src/compiler/rewriter/rules/index_join_rule.cpp:896:35: warning: ‘boundStackPos’ may be used uninitialized in this function [-Wmaybe-uninitialized]
  272.            predInfo.theStackPos = i;
  273.                                    ^
  274. [ 25%] Building CXX object src/CMakeFiles/zorba_simplestore.dir/compiler/rewriter/rules/index_matching_rule.cpp.o
  275. [ 25%] Building CXX object src/CMakeFiles/zorba_simplestore.dir/compiler/rewriter/tools/expr_tools.cpp.o
  276. [ 25%] Building CXX object src/CMakeFiles/zorba_simplestore.dir/compiler/rewriter/tools/dataflow_annotations.cpp.o
  277. [ 25%] Building CXX object src/CMakeFiles/zorba_simplestore.dir/compiler/rewriter/tools/udf_graph.cpp.o
  278. [ 25%] Building CXX object src/CMakeFiles/zorba_simplestore.dir/compiler/xqddf/collection_decl.cpp.o
  279. [ 25%] Building CXX object src/CMakeFiles/zorba_simplestore.dir/compiler/xqddf/value_index.cpp.o
  280. [ 25%] Building CXX object src/CMakeFiles/zorba_simplestore.dir/compiler/xqddf/value_ic.cpp.o
  281. [ 25%] Building CXX object src/CMakeFiles/zorba_simplestore.dir/compiler/api/compiler_api.cpp.o
  282. [ 25%] Building CXX object src/CMakeFiles/zorba_simplestore.dir/compiler/api/compiler_api_impl.cpp.o
  283. [ 26%] Building CXX object src/CMakeFiles/zorba_simplestore.dir/compiler/api/compilercb.cpp.o
  284. [ 26%] Building CXX object src/CMakeFiles/zorba_simplestore.dir/compiler/xqueryx/xqueryx_to_xquery.cpp.o
  285. [ 26%] Building CXX object src/CMakeFiles/zorba_simplestore.dir/compiler/parser/xquery_parser.cpp.o
  286. /home/dev-gso/zorba/src/zorba-3.0/build/src/compiler/parser/xquery_parser.y: In member function ‘virtual int zorba::xquery_parser::parse()’:
  287. /home/dev-gso/zorba/src/zorba-3.0/build/src/compiler/parser/xquery_parser.y:4321:20: warning: unused variable ‘q’ [-Wunused-variable]
  288.              QName* q = gat->get_qname();
  289.                     ^
  290. [ 26%] Building CXX object src/CMakeFiles/zorba_simplestore.dir/compiler/parser/jsoniq_parser.cpp.o
  291. /home/dev-gso/zorba/src/zorba-3.0/build/src/compiler/parser/jsoniq_parser.y: In function ‘bool {anonymous}::convert_postfix_to_target_and_selector(zorba::exprnode*, zorba::rchandle<zorba::exprnode>*, zorba::rchandle<zorba::exprnode>*, std::string*, bool)’:
  292. /home/dev-gso/zorba/src/zorba-3.0/build/src/compiler/parser/jsoniq_parser.y:913:25: warning: comparison between signed and unsigned integer expressions [-Wsign-compare]
  293.        for (int i = 0; i < lSize - 1; ++i)
  294.                          ^
  295. [ 26%] Building CXX object src/CMakeFiles/zorba_simplestore.dir/compiler/parser/xquery_scanner.cpp.o
  296. [ 26%] Building CXX object src/CMakeFiles/zorba_simplestore.dir/compiler/parser/jsoniq_scanner.cpp.o
  297. [ 26%] Building CXX object src/CMakeFiles/zorba_simplestore.dir/system/globalenv.cpp.o
  298. [ 26%] Building CXX object src/CMakeFiles/zorba_simplestore.dir/context/decimal_format.cpp.o
  299. [ 26%] Building CXX object src/CMakeFiles/zorba_simplestore.dir/context/dynamic_context.cpp.o
  300. [ 27%] Building CXX object src/CMakeFiles/zorba_simplestore.dir/context/static_context.cpp.o
  301. [ 27%] Building CXX object src/CMakeFiles/zorba_simplestore.dir/context/namespace_context.cpp.o
  302. [ 27%] Building CXX object src/CMakeFiles/zorba_simplestore.dir/context/root_static_context.cpp.o
  303. [ 27%] Building CXX object src/CMakeFiles/zorba_simplestore.dir/context/dynamic_loader.cpp.o
  304. [ 27%] Building CXX object src/CMakeFiles/zorba_simplestore.dir/context/sctx_map_iterator.cpp.o
  305. [ 27%] Building CXX object src/CMakeFiles/zorba_simplestore.dir/context/uri_resolver.cpp.o
  306. [ 27%] Building CXX object src/CMakeFiles/zorba_simplestore.dir/context/default_url_resolvers.cpp.o
  307. [ 27%] Building CXX object src/CMakeFiles/zorba_simplestore.dir/context/default_uri_mappers.cpp.o
  308. [ 27%] Building CXX object src/CMakeFiles/zorba_simplestore.dir/context/root_static_context_init.cpp.o
  309. [ 28%] Building CXX object src/CMakeFiles/zorba_simplestore.dir/diagnostics/dict.cpp.o
  310. [ 28%] Building CXX object src/CMakeFiles/zorba_simplestore.dir/diagnostics/assert.cpp.o
  311. [ 28%] Building CXX object src/CMakeFiles/zorba_simplestore.dir/diagnostics/xquery_diagnostics.cpp.o
  312. [ 28%] Building CXX object src/CMakeFiles/zorba_simplestore.dir/diagnostics/xquery_exception.cpp.o
  313. [ 28%] Building CXX object src/CMakeFiles/zorba_simplestore.dir/diagnostics/xquery_stack_trace.cpp.o
  314. [ 29%] Building CXX object src/CMakeFiles/zorba_simplestore.dir/diagnostics/user_error.cpp.o
  315. [ 29%] Building CXX object src/CMakeFiles/zorba_simplestore.dir/diagnostics/user_exception.cpp.o
  316. [ 29%] Building CXX object src/CMakeFiles/zorba_simplestore.dir/functions/func_accessors.cpp.o
  317. [ 29%] Building CXX object src/CMakeFiles/zorba_simplestore.dir/functions/func_any_uri.cpp.o
  318. [ 29%] Building CXX object src/CMakeFiles/zorba_simplestore.dir/functions/func_base64.cpp.o
  319. [ 29%] Building CXX object src/CMakeFiles/zorba_simplestore.dir/functions/func_booleans.cpp.o
  320. [ 29%] Building CXX object src/CMakeFiles/zorba_simplestore.dir/functions/func_collections.cpp.o
  321. [ 29%] Building CXX object src/CMakeFiles/zorba_simplestore.dir/functions/func_context.cpp.o
  322. [ 29%] Building CXX object src/CMakeFiles/zorba_simplestore.dir/functions/func_csv.cpp.o
  323. [ 29%] Building CXX object src/CMakeFiles/zorba_simplestore.dir/functions/func_datetime.cpp.o
  324. [ 29%] Building CXX object src/CMakeFiles/zorba_simplestore.dir/functions/func_debug_iterator.cpp.o
  325. [ 30%] Building CXX object src/CMakeFiles/zorba_simplestore.dir/functions/func_durations_dates_times.cpp.o
  326. [ 30%] Building CXX object src/CMakeFiles/zorba_simplestore.dir/functions/func_errors_and_diagnostics.cpp.o
  327. [ 30%] Building CXX object src/CMakeFiles/zorba_simplestore.dir/functions/func_other_diagnostics.cpp.o
  328. [ 30%] Building CXX object src/CMakeFiles/zorba_simplestore.dir/functions/func_fetch.cpp.o
  329. [ 30%] Building CXX object src/CMakeFiles/zorba_simplestore.dir/functions/func_fnput.cpp.o
  330. [ 30%] Building CXX object src/CMakeFiles/zorba_simplestore.dir/functions/func_ft_module.cpp.o
  331. [ 30%] Building CXX object src/CMakeFiles/zorba_simplestore.dir/functions/func_fn_hof_functions.cpp.o
  332. [ 30%] Building CXX object src/CMakeFiles/zorba_simplestore.dir/functions/func_ic_ddl.cpp.o
  333. [ 30%] Building CXX object src/CMakeFiles/zorba_simplestore.dir/functions/func_index_func.cpp.o
  334. [ 30%] Building CXX object src/CMakeFiles/zorba_simplestore.dir/functions/func_item.cpp.o
  335. [ 30%] Building CXX object src/CMakeFiles/zorba_simplestore.dir/functions/func_json.cpp.o
  336. [ 31%] Building CXX object src/CMakeFiles/zorba_simplestore.dir/functions/func_jsoniq_functions.cpp.o
  337. [ 31%] Building CXX object src/CMakeFiles/zorba_simplestore.dir/functions/func_maths.cpp.o
  338. [ 31%] Building CXX object src/CMakeFiles/zorba_simplestore.dir/functions/func_node_position.cpp.o
  339. [ 31%] Building CXX object src/CMakeFiles/zorba_simplestore.dir/functions/func_nodes.cpp.o
  340. [ 31%] Building CXX object src/CMakeFiles/zorba_simplestore.dir/functions/func_numerics.cpp.o
  341. [ 31%] Building CXX object src/CMakeFiles/zorba_simplestore.dir/functions/func_parse_fragment.cpp.o
  342. [ 31%] Building CXX object src/CMakeFiles/zorba_simplestore.dir/functions/func_parsing_and_serializing.cpp.o
  343. [ 31%] Building CXX object src/CMakeFiles/zorba_simplestore.dir/functions/func_qnames.cpp.o
  344. [ 31%] Building CXX object src/CMakeFiles/zorba_simplestore.dir/functions/func_random.cpp.o
  345. [ 31%] Building CXX object src/CMakeFiles/zorba_simplestore.dir/functions/func_reference.cpp.o
  346. [ 31%] Building CXX object src/CMakeFiles/zorba_simplestore.dir/functions/func_schema.cpp.o
  347. [ 32%] Building CXX object src/CMakeFiles/zorba_simplestore.dir/functions/func_sctx.cpp.o
  348. [ 32%] Building CXX object src/CMakeFiles/zorba_simplestore.dir/functions/func_seq.cpp.o
  349. [ 32%] Building CXX object src/CMakeFiles/zorba_simplestore.dir/functions/func_sequences.cpp.o
  350. [ 32%] Building CXX object src/CMakeFiles/zorba_simplestore.dir/functions/func_documents.cpp.o
  351. [ 32%] Building CXX object src/CMakeFiles/zorba_simplestore.dir/functions/func_maps.cpp.o
  352. [ 32%] Building CXX object src/CMakeFiles/zorba_simplestore.dir/functions/func_strings.cpp.o
  353. [ 32%] Building CXX object src/CMakeFiles/zorba_simplestore.dir/functions/func_uris.cpp.o
  354. [ 32%] Building CXX object src/CMakeFiles/zorba_simplestore.dir/functions/func_xqdoc.cpp.o
  355. [ 32%] Building CXX object src/CMakeFiles/zorba_simplestore.dir/functions/function.cpp.o
  356. [ 32%] Building CXX object src/CMakeFiles/zorba_simplestore.dir/functions/udf.cpp.o
  357. [ 32%] Building CXX object src/CMakeFiles/zorba_simplestore.dir/functions/external_function.cpp.o
  358. [ 33%] Building CXX object src/CMakeFiles/zorba_simplestore.dir/functions/library.cpp.o
  359. [ 33%] Building CXX object src/CMakeFiles/zorba_simplestore.dir/functions/signature.cpp.o
  360. [ 33%] Building CXX object src/CMakeFiles/zorba_simplestore.dir/functions/func_accessors_impl.cpp.o
  361. [ 33%] Building CXX object src/CMakeFiles/zorba_simplestore.dir/functions/func_arithmetic.cpp.o
  362. [ 33%] Building CXX object src/CMakeFiles/zorba_simplestore.dir/functions/func_booleans_impl.cpp.o
  363. [ 33%] Building CXX object src/CMakeFiles/zorba_simplestore.dir/functions/func_collections_impl.cpp.o
  364. [ 33%] Building CXX object src/CMakeFiles/zorba_simplestore.dir/functions/func_durations_dates_times_impl.cpp.o
  365. [ 33%] Building CXX object src/CMakeFiles/zorba_simplestore.dir/functions/func_enclosed.cpp.o
  366. [ 33%] Building CXX object src/CMakeFiles/zorba_simplestore.dir/functions/func_errors_and_diagnostics_impl.cpp.o
  367. [ 33%] Building CXX object src/CMakeFiles/zorba_simplestore.dir/functions/func_hoist.cpp.o
  368. [ 33%] Building CXX object src/CMakeFiles/zorba_simplestore.dir/functions/func_index_ddl.cpp.o
  369. [ 34%] Building CXX object src/CMakeFiles/zorba_simplestore.dir/functions/func_node_sort_distinct.cpp.o
  370. [ 34%] Building CXX object src/CMakeFiles/zorba_simplestore.dir/functions/func_nodes_impl.cpp.o
  371. [ 34%] Building CXX object src/CMakeFiles/zorba_simplestore.dir/functions/func_numerics_impl.cpp.o
  372. [ 34%] Building CXX object src/CMakeFiles/zorba_simplestore.dir/functions/func_sequences_impl.cpp.o
  373. [ 34%] Building CXX object src/CMakeFiles/zorba_simplestore.dir/functions/func_strings_impl.cpp.o
  374. [ 34%] Building CXX object src/CMakeFiles/zorba_simplestore.dir/functions/func_var_decl.cpp.o
  375. [ 34%] Building CXX object src/CMakeFiles/zorba_simplestore.dir/functions/func_eval.cpp.o
  376. [ 34%] Building CXX object src/CMakeFiles/zorba_simplestore.dir/functions/func_reflection.cpp.o
  377. [ 34%] Building CXX object src/CMakeFiles/zorba_simplestore.dir/functions/func_apply.cpp.o
  378. [ 34%] Building CXX object src/CMakeFiles/zorba_simplestore.dir/functions/func_serialize_impl.cpp.o
  379. [ 34%] Building CXX object src/CMakeFiles/zorba_simplestore.dir/functions/func_parse_fragment_impl.cpp.o
  380. [ 34%] Building CXX object src/CMakeFiles/zorba_simplestore.dir/functions/func_schema_impl.cpp.o
  381. [ 35%] Building CXX object src/CMakeFiles/zorba_simplestore.dir/functions/func_fn_hof_functions_impl.cpp.o
  382. [ 35%] Building CXX object src/CMakeFiles/zorba_simplestore.dir/functions/func_jsoniq_functions_impl.cpp.o
  383. [ 35%] Building CXX object src/CMakeFiles/zorba_simplestore.dir/annotations/annotations.cpp.o
  384. [ 35%] Building CXX object src/CMakeFiles/zorba_simplestore.dir/runtime/accessors/accessors.cpp.o
  385. [ 35%] Building CXX object src/CMakeFiles/zorba_simplestore.dir/runtime/accessors/accessors_impl.cpp.o
  386. [ 35%] Building CXX object src/CMakeFiles/zorba_simplestore.dir/runtime/any_uri/any_uri.cpp.o
  387. [ 35%] Building CXX object src/CMakeFiles/zorba_simplestore.dir/runtime/any_uri/any_uri_impl.cpp.o
  388. [ 35%] Building CXX object src/CMakeFiles/zorba_simplestore.dir/runtime/base64/base64.cpp.o
  389. [ 35%] Building CXX object src/CMakeFiles/zorba_simplestore.dir/runtime/base64/base64_impl.cpp.o
  390. [ 35%] Building CXX object src/CMakeFiles/zorba_simplestore.dir/runtime/booleans/booleans.cpp.o
  391. [ 35%] Building CXX object src/CMakeFiles/zorba_simplestore.dir/runtime/booleans/booleans_impl.cpp.o
  392. [ 36%] Building CXX object src/CMakeFiles/zorba_simplestore.dir/runtime/collections/collections.cpp.o
  393. [ 36%] Building CXX object src/CMakeFiles/zorba_simplestore.dir/runtime/collections/collections_impl.cpp.o
  394. [ 36%] Building CXX object src/CMakeFiles/zorba_simplestore.dir/runtime/context/context.cpp.o
  395. [ 36%] Building CXX object src/CMakeFiles/zorba_simplestore.dir/runtime/context/context_impl.cpp.o
  396. [ 36%] Building CXX object src/CMakeFiles/zorba_simplestore.dir/runtime/csv/csv.cpp.o
  397. [ 36%] Building CXX object src/CMakeFiles/zorba_simplestore.dir/runtime/csv/csv_impl.cpp.o
  398. [ 36%] Building CXX object src/CMakeFiles/zorba_simplestore.dir/runtime/datetime/datetime.cpp.o
  399. [ 36%] Building CXX object src/CMakeFiles/zorba_simplestore.dir/runtime/datetime/datetime_impl.cpp.o
  400. [ 36%] Building CXX object src/CMakeFiles/zorba_simplestore.dir/runtime/debug/debug_iterator.cpp.o
  401. [ 36%] Building CXX object src/CMakeFiles/zorba_simplestore.dir/runtime/debug/debug_iterator_impl.cpp.o
  402. [ 36%] Building CXX object src/CMakeFiles/zorba_simplestore.dir/runtime/durations_dates_times/durations_dates_times.cpp.o
  403. [ 37%] Building CXX object src/CMakeFiles/zorba_simplestore.dir/runtime/durations_dates_times/durations_dates_times_impl.cpp.o
  404. [ 37%] Building CXX object src/CMakeFiles/zorba_simplestore.dir/runtime/errors_and_diagnostics/errors_and_diagnostics.cpp.o
  405. [ 37%] Building CXX object src/CMakeFiles/zorba_simplestore.dir/runtime/errors_and_diagnostics/errors_and_diagnostics_impl.cpp.o
  406. [ 37%] Building CXX object src/CMakeFiles/zorba_simplestore.dir/runtime/errors_and_diagnostics/other_diagnostics.cpp.o
  407. [ 37%] Building CXX object src/CMakeFiles/zorba_simplestore.dir/runtime/errors_and_diagnostics/other_diagnostics_impl.cpp.o
  408. [ 37%] Building CXX object src/CMakeFiles/zorba_simplestore.dir/runtime/fetch/fetch.cpp.o
  409. [ 37%] Building CXX object src/CMakeFiles/zorba_simplestore.dir/runtime/fetch/fetch_impl.cpp.o
  410. [ 37%] Building CXX object src/CMakeFiles/zorba_simplestore.dir/runtime/fnput/fnput.cpp.o
  411. [ 37%] Building CXX object src/CMakeFiles/zorba_simplestore.dir/runtime/fnput/fnput_impl.cpp.o
  412. [ 37%] Building CXX object src/CMakeFiles/zorba_simplestore.dir/runtime/full_text/ft_module.cpp.o
  413. [ 37%] Building CXX object src/CMakeFiles/zorba_simplestore.dir/runtime/full_text/ft_module_impl.cpp.o
  414. [ 38%] Building CXX object src/CMakeFiles/zorba_simplestore.dir/runtime/hof/fn_hof_functions.cpp.o
  415. [ 38%] Building CXX object src/CMakeFiles/zorba_simplestore.dir/runtime/hof/fn_hof_functions_impl.cpp.o
  416. [ 38%] Building CXX object src/CMakeFiles/zorba_simplestore.dir/runtime/indexing/ic_ddl.cpp.o
  417. [ 38%] Building CXX object src/CMakeFiles/zorba_simplestore.dir/runtime/indexing/ic_ddl_impl.cpp.o
  418. [ 38%] Building CXX object src/CMakeFiles/zorba_simplestore.dir/runtime/indexing/index_func.cpp.o
  419. [ 38%] Building CXX object src/CMakeFiles/zorba_simplestore.dir/runtime/indexing/index_func_impl.cpp.o
  420. [ 38%] Building CXX object src/CMakeFiles/zorba_simplestore.dir/runtime/item/item.cpp.o
  421. [ 38%] Building CXX object src/CMakeFiles/zorba_simplestore.dir/runtime/item/item_impl.cpp.o
  422. [ 38%] Building CXX object src/CMakeFiles/zorba_simplestore.dir/runtime/json/json.cpp.o
  423. [ 38%] Building CXX object src/CMakeFiles/zorba_simplestore.dir/runtime/json/json_impl.cpp.o
  424. [ 38%] Building CXX object src/CMakeFiles/zorba_simplestore.dir/runtime/json/jsoniq_functions.cpp.o
  425. [ 39%] Building CXX object src/CMakeFiles/zorba_simplestore.dir/runtime/json/jsoniq_functions_impl.cpp.o
  426. [ 39%] Building CXX object src/CMakeFiles/zorba_simplestore.dir/runtime/maths/maths.cpp.o
  427. [ 39%] Building CXX object src/CMakeFiles/zorba_simplestore.dir/runtime/maths/maths_impl.cpp.o
  428. [ 39%] Building CXX object src/CMakeFiles/zorba_simplestore.dir/runtime/nodes/node_position.cpp.o
  429. [ 39%] Building CXX object src/CMakeFiles/zorba_simplestore.dir/runtime/nodes/node_position_impl.cpp.o
  430. /home/dev-gso/zorba/src/zorba-3.0/src/runtime/nodes/node_position_impl.cpp: In member function ‘virtual bool zorba::NodePositionIterator::nextImpl(zorba::store::Item_t&, zorba::PlanState&) const’:
  431. /home/dev-gso/zorba/src/zorba-3.0/src/runtime/nodes/node_position_impl.cpp:41:8: warning: variable ‘valid’ set but not used [-Wunused-but-set-variable]
  432.    bool valid;
  433.         ^
  434. [ 39%] Building CXX object src/CMakeFiles/zorba_simplestore.dir/runtime/nodes/nodes.cpp.o
  435. [ 39%] Building CXX object src/CMakeFiles/zorba_simplestore.dir/runtime/nodes/nodes_impl.cpp.o
  436. [ 39%] Building CXX object src/CMakeFiles/zorba_simplestore.dir/runtime/numerics/numerics.cpp.o
  437. [ 39%] Building CXX object src/CMakeFiles/zorba_simplestore.dir/runtime/numerics/numerics_impl.cpp.o
  438. [ 39%] Building CXX object src/CMakeFiles/zorba_simplestore.dir/runtime/parsing_and_serializing/parse_fragment.cpp.o
  439. [ 39%] Building CXX object src/CMakeFiles/zorba_simplestore.dir/runtime/parsing_and_serializing/parse_fragment_impl.cpp.o
  440. [ 40%] Building CXX object src/CMakeFiles/zorba_simplestore.dir/runtime/parsing_and_serializing/parsing_and_serializing.cpp.o
  441. [ 40%] Building CXX object src/CMakeFiles/zorba_simplestore.dir/runtime/parsing_and_serializing/parsing_and_serializing_impl.cpp.o
  442. [ 40%] Building CXX object src/CMakeFiles/zorba_simplestore.dir/runtime/qnames/qnames.cpp.o
  443. [ 40%] Building CXX object src/CMakeFiles/zorba_simplestore.dir/runtime/qnames/qnames_impl.cpp.o
  444. [ 40%] Building CXX object src/CMakeFiles/zorba_simplestore.dir/runtime/random/random.cpp.o
  445. [ 40%] Building CXX object src/CMakeFiles/zorba_simplestore.dir/runtime/random/random_impl.cpp.o
  446. [ 40%] Building CXX object src/CMakeFiles/zorba_simplestore.dir/runtime/reference/reference.cpp.o
  447. [ 40%] Building CXX object src/CMakeFiles/zorba_simplestore.dir/runtime/reference/reference_impl.cpp.o
  448. [ 40%] Building CXX object src/CMakeFiles/zorba_simplestore.dir/runtime/schema/schema.cpp.o
  449. [ 40%] Building CXX object src/CMakeFiles/zorba_simplestore.dir/runtime/schema/schema_impl.cpp.o
  450. [ 40%] Building CXX object src/CMakeFiles/zorba_simplestore.dir/runtime/sctx/sctx.cpp.o
  451. [ 40%] Building CXX object src/CMakeFiles/zorba_simplestore.dir/runtime/sctx/sctx_impl.cpp.o
  452. [ 41%] Building CXX object src/CMakeFiles/zorba_simplestore.dir/runtime/seq/seq.cpp.o
  453. [ 41%] Building CXX object src/CMakeFiles/zorba_simplestore.dir/runtime/seq/seq_impl.cpp.o
  454. [ 41%] Building CXX object src/CMakeFiles/zorba_simplestore.dir/runtime/sequences/sequences.cpp.o
  455. [ 41%] Building CXX object src/CMakeFiles/zorba_simplestore.dir/runtime/sequences/sequences_impl.cpp.o
  456. [ 41%] Building CXX object src/CMakeFiles/zorba_simplestore.dir/runtime/store/documents.cpp.o
  457. [ 41%] Building CXX object src/CMakeFiles/zorba_simplestore.dir/runtime/store/documents_impl.cpp.o
  458. [ 41%] Building CXX object src/CMakeFiles/zorba_simplestore.dir/runtime/store/maps.cpp.o
  459. [ 41%] Building CXX object src/CMakeFiles/zorba_simplestore.dir/runtime/store/maps_impl.cpp.o
  460. [ 41%] Building CXX object src/CMakeFiles/zorba_simplestore.dir/runtime/strings/strings.cpp.o
  461. [ 41%] Building CXX object src/CMakeFiles/zorba_simplestore.dir/runtime/strings/strings_impl.cpp.o
  462. /home/dev-gso/zorba/src/zorba-3.0/src/runtime/strings/strings_impl.cpp: In member function ‘virtual bool zorba::StringAnalyzeStringIterator::nextImpl(zorba::store::Item_t&, zorba::PlanState&) const’:
  463. /home/dev-gso/zorba/src/zorba-3.0/src/runtime/strings/strings_impl.cpp:2503:14: warning: comparison between signed and unsigned integer expressions [-Wsign-compare]
  464.    if ( m_end < u_size ) {
  465.               ^
  466. [ 41%] Building CXX object src/CMakeFiles/zorba_simplestore.dir/runtime/uris/uris.cpp.o
  467. [ 42%] Building CXX object src/CMakeFiles/zorba_simplestore.dir/runtime/uris/uris_impl.cpp.o
  468. [ 42%] Building CXX object src/CMakeFiles/zorba_simplestore.dir/runtime/xqdoc/xqdoc.cpp.o
  469. [ 42%] Building CXX object src/CMakeFiles/zorba_simplestore.dir/runtime/xqdoc/xqdoc_impl.cpp.o
  470. [ 42%] Building CXX object src/CMakeFiles/zorba_simplestore.dir/runtime/visitors/printer_visitor.cpp.o
  471. [ 42%] Building CXX object src/CMakeFiles/zorba_simplestore.dir/runtime/visitors/printer_visitor_impl.cpp.o
  472. [ 42%] Building CXX object src/CMakeFiles/zorba_simplestore.dir/runtime/api/plan_iterator_wrapper.cpp.o
  473. [ 42%] Building CXX object src/CMakeFiles/zorba_simplestore.dir/runtime/api/plan_wrapper.cpp.o
  474. [ 42%] Building CXX object src/CMakeFiles/zorba_simplestore.dir/runtime/base/plan_iterator.cpp.o
  475. [ 42%] Building CXX object src/CMakeFiles/zorba_simplestore.dir/runtime/booleans/BooleanImpl.cpp.o
  476. [ 42%] Building CXX object src/CMakeFiles/zorba_simplestore.dir/runtime/core/apply_updates.cpp.o
  477. [ 43%] Building CXX object src/CMakeFiles/zorba_simplestore.dir/runtime/core/arithmetic_impl.cpp.o
  478. [ 43%] Building CXX object src/CMakeFiles/zorba_simplestore.dir/runtime/core/constructors.cpp.o
  479. [ 43%] Building CXX object src/CMakeFiles/zorba_simplestore.dir/runtime/core/flwor_iterator.cpp.o
  480. [ 43%] Building CXX object src/CMakeFiles/zorba_simplestore.dir/runtime/core/fncall_iterator.cpp.o
  481. [ 43%] Building CXX object src/CMakeFiles/zorba_simplestore.dir/runtime/core/item_iterator.cpp.o
  482. [ 43%] Building CXX object src/CMakeFiles/zorba_simplestore.dir/runtime/core/nodeid_iterators.cpp.o
  483. [ 43%] Building CXX object src/CMakeFiles/zorba_simplestore.dir/runtime/core/path_iterators.cpp.o
  484. [ 43%] Building CXX object src/CMakeFiles/zorba_simplestore.dir/runtime/core/sequencetypes.cpp.o
  485. [ 43%] Building CXX object src/CMakeFiles/zorba_simplestore.dir/runtime/core/trycatch.cpp.o
  486. [ 43%] Building CXX object src/CMakeFiles/zorba_simplestore.dir/runtime/core/var_iterators.cpp.o
  487. [ 43%] Building CXX object src/CMakeFiles/zorba_simplestore.dir/runtime/core/gflwor/common.cpp.o
  488. [ 44%] Building CXX object src/CMakeFiles/zorba_simplestore.dir/runtime/core/gflwor/tuplestream_iterator.cpp.o
  489. [ 44%] Building CXX object src/CMakeFiles/zorba_simplestore.dir/runtime/core/gflwor/for_iterator.cpp.o
  490. [ 44%] Building CXX object src/CMakeFiles/zorba_simplestore.dir/runtime/core/gflwor/let_iterator.cpp.o
  491. [ 44%] Building CXX object src/CMakeFiles/zorba_simplestore.dir/runtime/core/gflwor/where_iterator.cpp.o
  492. [ 44%] Building CXX object src/CMakeFiles/zorba_simplestore.dir/runtime/core/gflwor/comp_function.cpp.o
  493. [ 44%] Building CXX object src/CMakeFiles/zorba_simplestore.dir/runtime/core/gflwor/count_iterator.cpp.o
  494. [ 44%] Building CXX object src/CMakeFiles/zorba_simplestore.dir/runtime/core/gflwor/groupby_iterator.cpp.o
  495. [ 44%] Building CXX object src/CMakeFiles/zorba_simplestore.dir/runtime/core/gflwor/tuplesource_iterator.cpp.o
  496. [ 44%] Building CXX object src/CMakeFiles/zorba_simplestore.dir/runtime/core/gflwor/window_iterator.cpp.o
  497. [ 44%] Building CXX object src/CMakeFiles/zorba_simplestore.dir/runtime/core/gflwor/orderby_iterator.cpp.o
  498. [ 44%] Building CXX object src/CMakeFiles/zorba_simplestore.dir/runtime/core/gflwor/outerfor_iterator.cpp.o
  499. [ 45%] Building CXX object src/CMakeFiles/zorba_simplestore.dir/runtime/core/internal_operators.cpp.o
  500. [ 45%] Building CXX object src/CMakeFiles/zorba_simplestore.dir/runtime/durations_dates_times/DurationsDatesTimesImpl.cpp.o
  501. [ 45%] Building CXX object src/CMakeFiles/zorba_simplestore.dir/runtime/durations_dates_times/format_dateTime.cpp.o
  502. [ 45%] Building CXX object src/CMakeFiles/zorba_simplestore.dir/runtime/indexing/doc_indexer.cpp.o
  503. [ 45%] Building CXX object src/CMakeFiles/zorba_simplestore.dir/runtime/indexing/index_ddl.cpp.o
  504. /home/dev-gso/zorba/src/zorba-3.0/src/runtime/indexing/index_ddl.cpp: In member function ‘zorba::store::IndexCondition_t zorba::ProbeIndexRangeValueIterator::createCondition(zorba::ProbeIndexRangeValueIteratorState*, zorba::PlanState&) const’:
  505. /home/dev-gso/zorba/src/zorba-3.0/src/runtime/indexing/index_ddl.cpp:1296:53: warning: ‘leftType’ may be used uninitialized in this function [-Wmaybe-uninitialized]
  506.              !TypeOps::is_subtype(rightType, leftType))
  507.                                                      ^
  508. [ 45%] Building CXX object src/CMakeFiles/zorba_simplestore.dir/runtime/json/common.cpp.o
  509. [ 45%] Building CXX object src/CMakeFiles/zorba_simplestore.dir/runtime/json/jsonml_array.cpp.o
  510. [ 45%] Building CXX object src/CMakeFiles/zorba_simplestore.dir/runtime/json/snelson.cpp.o
  511. [ 45%] Building CXX object src/CMakeFiles/zorba_simplestore.dir/runtime/numerics/NumericsImpl.cpp.o
  512. [ 45%] Building CXX object src/CMakeFiles/zorba_simplestore.dir/runtime/numerics/format_integer.cpp.o
  513. /home/dev-gso/zorba/src/zorba-3.0/src/runtime/numerics/format_integer.cpp: In function ‘void zorba::format_integer(const xs_integer&, const zorba::{anonymous}::picture&, zorba::zstring*)’:
  514. /home/dev-gso/zorba/src/zorba-3.0/src/runtime/numerics/format_integer.cpp:269:49: warning: ‘grouping_cp’ may be used uninitialized in this function [-Wmaybe-uninitialized]
  515.                u_dest.insert( 0, 1, grouping_cp );
  516.                                                  ^
  517. [ 45%] Building CXX object src/CMakeFiles/zorba_simplestore.dir/runtime/numerics/format_number.cpp.o
  518. [ 46%] Building CXX object src/CMakeFiles/zorba_simplestore.dir/runtime/sequences/SequencesImpl.cpp.o
  519. [ 46%] Building CXX object src/CMakeFiles/zorba_simplestore.dir/runtime/visitors/iterprinter.cpp.o
  520. [ 46%] Building CXX object src/CMakeFiles/zorba_simplestore.dir/runtime/update/update.cpp.o
  521. [ 46%] Building CXX object src/CMakeFiles/zorba_simplestore.dir/runtime/util/item_iterator.cpp.o
  522. [ 46%] Building CXX object src/CMakeFiles/zorba_simplestore.dir/runtime/util/timeout.cpp.o
  523. [ 46%] Building CXX object src/CMakeFiles/zorba_simplestore.dir/runtime/util/flowctl_exception.cpp.o
  524. [ 46%] Building CXX object src/CMakeFiles/zorba_simplestore.dir/runtime/util/doc_uri_heuristics.cpp.o
  525. [ 46%] Building CXX object src/CMakeFiles/zorba_simplestore.dir/runtime/hof/function_item.cpp.o
  526. [ 46%] Building CXX object src/CMakeFiles/zorba_simplestore.dir/runtime/hof/function_item_iter.cpp.o
  527. [ 46%] Building CXX object src/CMakeFiles/zorba_simplestore.dir/runtime/hof/dynamic_fncall_iterator.cpp.o
  528. [ 46%] Building CXX object src/CMakeFiles/zorba_simplestore.dir/runtime/eval/eval.cpp.o
  529. [ 46%] Building CXX object src/CMakeFiles/zorba_simplestore.dir/runtime/collections/collections_base.cpp.o
  530. [ 47%] Building CXX object src/CMakeFiles/zorba_simplestore.dir/runtime/misc/materialize.cpp.o
  531. [ 47%] Building CXX object src/CMakeFiles/zorba_simplestore.dir/runtime/scripting/scripting.cpp.o
  532. [ 47%] Building CXX object src/CMakeFiles/zorba_simplestore.dir/runtime/json/json_constructors.cpp.o
  533. [ 47%] Building CXX object src/CMakeFiles/zorba_simplestore.dir/runtime/json/json_loader.cpp.o
  534. [ 47%] Building CXX object src/CMakeFiles/zorba_simplestore.dir/runtime/full_text/ft_util.cpp.o
  535. [ 47%] Building CXX object src/CMakeFiles/zorba_simplestore.dir/runtime/full_text/ft_stop_words_set.cpp.o
  536. [ 47%] Building CXX object src/CMakeFiles/zorba_simplestore.dir/runtime/full_text/ft_wildcard.cpp.o
  537. [ 48%] Building CXX object src/CMakeFiles/zorba_simplestore.dir/runtime/full_text/ft_token_matcher.cpp.o
  538. [ 48%] Building CXX object src/CMakeFiles/zorba_simplestore.dir/runtime/full_text/apply.cpp.o
  539. [ 48%] Building CXX object src/CMakeFiles/zorba_simplestore.dir/runtime/full_text/ftcontains_visitor.cpp.o
  540. [ 48%] Building CXX object src/CMakeFiles/zorba_simplestore.dir/runtime/full_text/full_text.cpp.o
  541. [ 48%] Building CXX object src/CMakeFiles/zorba_simplestore.dir/runtime/full_text/full_text_impl.cpp.o
  542. [ 48%] Building CXX object src/CMakeFiles/zorba_simplestore.dir/runtime/full_text/stemmer.cpp.o
  543. [ 48%] Building CXX object src/CMakeFiles/zorba_simplestore.dir/runtime/full_text/thesaurus.cpp.o
  544. [ 48%] Building CXX object src/CMakeFiles/zorba_simplestore.dir/runtime/full_text/tokenizer.cpp.o
  545. [ 48%] Building CXX object src/CMakeFiles/zorba_simplestore.dir/runtime/full_text/ft_module_util.cpp.o
  546. [ 49%] Building CXX object src/CMakeFiles/zorba_simplestore.dir/runtime/full_text/icu_tokenizer.cpp.o
  547. [ 49%] Building CXX object src/CMakeFiles/zorba_simplestore.dir/runtime/full_text/thesauri/wn_synset.cpp.o
  548. [ 49%] Building CXX object src/CMakeFiles/zorba_simplestore.dir/runtime/full_text/thesauri/wn_thesaurus.cpp.o
  549. [ 49%] Building CXX object src/CMakeFiles/zorba_simplestore.dir/runtime/full_text/thesauri/xqftts_thesaurus.cpp.o
  550. [ 49%] Building CXX object src/CMakeFiles/zorba_simplestore.dir/types/casting.cpp.o
  551. [ 49%] Building CXX object src/CMakeFiles/zorba_simplestore.dir/types/node_test.cpp.o
  552. [ 49%] Building CXX object src/CMakeFiles/zorba_simplestore.dir/types/typemanagerimpl.cpp.o
  553. [ 49%] Building CXX object src/CMakeFiles/zorba_simplestore.dir/types/root_typemanager.cpp.o
  554. [ 49%] Building CXX object src/CMakeFiles/zorba_simplestore.dir/types/typeimpl.cpp.o
  555. [ 49%] Building CXX object src/CMakeFiles/zorba_simplestore.dir/types/typeops.cpp.o
  556. [ 50%] Building CXX object src/CMakeFiles/zorba_simplestore.dir/types/schema/schema.cpp.o
  557. [ 50%] Building CXX object src/CMakeFiles/zorba_simplestore.dir/types/schema/validate.cpp.o
  558. [ 50%] Building CXX object src/CMakeFiles/zorba_simplestore.dir/types/schema/LoadSchemaErrorHandler.cpp.o
  559. [ 50%] Building CXX object src/CMakeFiles/zorba_simplestore.dir/types/schema/PrintSchema.cpp.o
  560. [ 50%] Building CXX object src/CMakeFiles/zorba_simplestore.dir/types/schema/EventSchemaValidator.cpp.o
  561. [ 50%] Building CXX object src/CMakeFiles/zorba_simplestore.dir/types/schema/SchemaValidatorFilter.cpp.o
  562. [ 50%] Building CXX object src/CMakeFiles/zorba_simplestore.dir/types/schema/ValidationEventHandler.cpp.o
  563. [ 50%] Building CXX object src/CMakeFiles/zorba_simplestore.dir/types/schema/revalidateUtils.cpp.o
  564. [ 50%] Building CXX object src/CMakeFiles/zorba_simplestore.dir/types/schema/XercesParseUtils.cpp.o
  565. [ 50%] Building CXX object src/CMakeFiles/zorba_simplestore.dir/util/dynamic_bitset.cpp.o
  566. [ 50%] Building CXX object src/CMakeFiles/zorba_simplestore.dir/util/error_util.cpp.o
  567. [ 50%] Building CXX object src/CMakeFiles/zorba_simplestore.dir/util/fs_util.cpp.o
  568. [ 50%] Building CXX object src/CMakeFiles/zorba_simplestore.dir/util/uri_util.cpp.o
  569. [ 50%] Building CXX object src/CMakeFiles/zorba_simplestore.dir/util/utf8_streambuf.cpp.o
  570. [ 50%] Building CXX object src/CMakeFiles/zorba_simplestore.dir/util/fx/fxcharheap.cpp.o
  571. [ 51%] Building CXX object src/CMakeFiles/zorba_simplestore.dir/util/http_util.cpp.o
  572. [ 51%] Building CXX object src/CMakeFiles/zorba_simplestore.dir/util/mmap_file.cpp.o
  573. [ 51%] Building CXX object src/CMakeFiles/zorba_simplestore.dir/util/icu_regex.cpp.o
  574. [ 51%] Building CXX object src/CMakeFiles/zorba_simplestore.dir/util/icu_streambuf.cpp.o
  575. [ 51%] Building CXX object src/CMakeFiles/zorba_simplestore.dir/zorbaserialization/class_serializer.cpp.o
  576. [ 51%] Building CXX object src/CMakeFiles/zorba_simplestore.dir/zorbaserialization/archiver.cpp.o
  577. [ 51%] Building CXX object src/CMakeFiles/zorba_simplestore.dir/zorbaserialization/mem_archiver.cpp.o
  578. [ 51%] Building CXX object src/CMakeFiles/zorba_simplestore.dir/zorbaserialization/bin_archiver.cpp.o
  579. [ 51%] Building CXX object src/CMakeFiles/zorba_simplestore.dir/zorbaserialization/serialize_basic_types.cpp.o
  580. [ 51%] Building CXX object src/CMakeFiles/zorba_simplestore.dir/zorbaserialization/serialize_zorba_types.cpp.o
  581. [ 52%] Building CXX object src/CMakeFiles/zorba_simplestore.dir/zorbatypes/decimal.cpp.o
  582. [ 52%] Building CXX object src/CMakeFiles/zorba_simplestore.dir/zorbatypes/float.cpp.o
  583. [ 52%] Building CXX object src/CMakeFiles/zorba_simplestore.dir/zorbatypes/integer.cpp.o
  584. [ 52%] Building CXX object src/CMakeFiles/zorba_simplestore.dir/zorbatypes/numconversions.cpp.o
  585. [ 52%] Building CXX object src/CMakeFiles/zorba_simplestore.dir/zorbatypes/numeric_types.cpp.o
  586. [ 52%] Building CXX object src/CMakeFiles/zorba_simplestore.dir/zorbatypes/binary.cpp.o
  587. [ 52%] Building CXX object src/CMakeFiles/zorba_simplestore.dir/zorbatypes/URI.cpp.o
  588. [ 52%] Building CXX object src/CMakeFiles/zorba_simplestore.dir/zorbatypes/timezone.cpp.o
  589. [ 53%] Building CXX object src/CMakeFiles/zorba_simplestore.dir/zorbatypes/m_apm.cpp.o
  590. [ 53%] Building CXX object src/CMakeFiles/zorba_simplestore.dir/zorbatypes/datetime/duration.cpp.o
  591. [ 53%] Building CXX object src/CMakeFiles/zorba_simplestore.dir/zorbatypes/datetime/datetimetype.cpp.o
  592. [ 53%] Building CXX object src/CMakeFiles/zorba_simplestore.dir/zorbatypes/datetime/parse.cpp.o
  593. [ 54%] Building CXX object src/CMakeFiles/zorba_simplestore.dir/zorbautils/hashset_node_itemh.cpp.o
  594. [ 54%] Building CXX object src/CMakeFiles/zorba_simplestore.dir/zorbautils/hashset_atomic_itemh.cpp.o
  595. [ 54%] Building CXX object src/CMakeFiles/zorba_simplestore.dir/zorbautils/latch.cpp.o
  596. [ 54%] Building CXX object src/CMakeFiles/zorba_simplestore.dir/zorbautils/lock.cpp.o
  597. [ 54%] Building CXX object src/CMakeFiles/zorba_simplestore.dir/zorbautils/string_util.cpp.o
  598. [ 54%] Building CXX object src/CMakeFiles/zorba_simplestore.dir/zorbautils/SAXParser.cpp.o
  599. [ 54%] Building CXX object src/CMakeFiles/zorba_simplestore.dir/store/util/item_vector.cpp.o
  600. [ 54%] Building CXX object src/CMakeFiles/zorba_simplestore.dir/debugger/query_locationimpl.cpp.o
  601. [ 54%] Building CXX object src/CMakeFiles/zorba_simplestore.dir/debugger/debugger_server.cpp.o
  602. [ 54%] Building CXX object src/CMakeFiles/zorba_simplestore.dir/debugger/debugger_communicator.cpp.o
  603. [ 54%] Building CXX object src/CMakeFiles/zorba_simplestore.dir/debugger/debugger_runtime.cpp.o
  604. [ 54%] Building CXX object src/CMakeFiles/zorba_simplestore.dir/debugger/debugger_commons.cpp.o
  605. [ 54%] Building CXX object src/CMakeFiles/zorba_simplestore.dir/unit_tests/test_hashmaps.cpp.o
  606. [ 54%] Building CXX object src/CMakeFiles/zorba_simplestore.dir/unit_tests/test_mem_sizeof.cpp.o
  607. [ 54%] Building CXX object src/CMakeFiles/zorba_simplestore.dir/unit_tests/test_uri.cpp.o
  608. [ 55%] Building CXX object src/CMakeFiles/zorba_simplestore.dir/store/naive/atomic_items.cpp.o
  609. [ 55%] Building CXX object src/CMakeFiles/zorba_simplestore.dir/store/naive/collection.cpp.o
  610. [ 55%] Building CXX object src/CMakeFiles/zorba_simplestore.dir/store/naive/dataguide.cpp.o
  611. [ 55%] Building CXX object src/CMakeFiles/zorba_simplestore.dir/store/naive/inmemorystore.cpp.o
  612. [ 55%] Building CXX object src/CMakeFiles/zorba_simplestore.dir/store/naive/inmemorystorec.cpp.o
  613. [ 55%] Building CXX object src/CMakeFiles/zorba_simplestore.dir/store/naive/item.cpp.o
  614. [ 55%] Building CXX object src/CMakeFiles/zorba_simplestore.dir/store/naive/item_iterator.cpp.o
  615. [ 55%] Building CXX object src/CMakeFiles/zorba_simplestore.dir/store/naive/item_vector.cpp.o
  616. [ 55%] Building CXX object src/CMakeFiles/zorba_simplestore.dir/store/naive/loader_fast.cpp.o
  617. [ 55%] Building CXX object src/CMakeFiles/zorba_simplestore.dir/store/naive/loader_dtd.cpp.o
  618. /home/dev-gso/zorba/src/zorba-3.0/src/store/naive/loader_dtd.cpp: In static member function ‘static void zorba::simplestore::DtdXmlLoader::startElement(void*, xmlNode*)’:
  619. /home/dev-gso/zorba/src/zorba-3.0/src/store/naive/loader_dtd.cpp:1356:9: warning: case value ‘0’ not in enumerated type ‘xmlAttributeType’ [-Wswitch]
  620.          case 0:                       // libxml2 bug
  621.          ^
  622. [ 55%] Building CXX object src/CMakeFiles/zorba_simplestore.dir/store/naive/node_factory.cpp.o
  623. [ 56%] Building CXX object src/CMakeFiles/zorba_simplestore.dir/store/naive/node_items.cpp.o
  624. [ 56%] Building CXX object src/CMakeFiles/zorba_simplestore.dir/store/naive/node_iterators.cpp.o
  625. [ 56%] Building CXX object src/CMakeFiles/zorba_simplestore.dir/store/naive/node_updates.cpp.o
  626. [ 56%] Building CXX object src/CMakeFiles/zorba_simplestore.dir/store/naive/nsbindings.cpp.o
  627. [ 56%] Building CXX object src/CMakeFiles/zorba_simplestore.dir/store/naive/ordpath.cpp.o
  628. [ 56%] Building CXX object src/CMakeFiles/zorba_simplestore.dir/store/naive/pul_primitive_factory.cpp.o
  629. [ 56%] Building CXX object src/CMakeFiles/zorba_simplestore.dir/store/naive/pul_primitives.cpp.o
  630. [ 56%] Building CXX object src/CMakeFiles/zorba_simplestore.dir/store/naive/qname_pool.cpp.o
  631. [ 56%] Building CXX object src/CMakeFiles/zorba_simplestore.dir/store/naive/simple_collection.cpp.o
  632. [ 56%] Building CXX object src/CMakeFiles/zorba_simplestore.dir/store/naive/simple_collection_set.cpp.o
  633. [ 57%] Building CXX object src/CMakeFiles/zorba_simplestore.dir/store/naive/simple_index.cpp.o
  634. [ 57%] Building CXX object src/CMakeFiles/zorba_simplestore.dir/store/naive/simple_index_general.cpp.o
  635. [ 57%] Building CXX object src/CMakeFiles/zorba_simplestore.dir/store/naive/simple_index_value.cpp.o
  636. [ 57%] Building CXX object src/CMakeFiles/zorba_simplestore.dir/store/naive/simple_item_factory.cpp.o
  637. [ 57%] Building CXX object src/CMakeFiles/zorba_simplestore.dir/store/naive/simple_iterator_factory.cpp.o
  638. [ 57%] Building CXX object src/CMakeFiles/zorba_simplestore.dir/store/naive/simple_lazy_temp_seq.cpp.o
  639. In file included from /home/dev-gso/zorba/src/zorba-3.0/src/store/naive/simple_lazy_temp_seq.cpp:20:0:
  640. /home/dev-gso/zorba/src/zorba-3.0/src/store/naive/simple_lazy_temp_seq.cpp: In member function ‘virtual void zorba::simplestore::SimpleLazyTempSeq::purgeUpTo(zorba::xs_integer)’:
  641. /home/dev-gso/zorba/src/zorba-3.0/src/store/naive/simple_lazy_temp_seq.cpp:183:36: warning: comparison between signed and unsigned integer expressions [-Wsign-compare]
  642.    ZORBA_ASSERT(pos - thePurgedUpTo <= theItems.size());
  643.                                     ^
  644. /home/dev-gso/zorba/src/zorba-3.0/src/diagnostics/assert.h:51:12: note: in definition of macro ‘ZORBA_ASSERT’
  645.      if ( !(COND) ) {                                        \
  646.             ^
  647. /home/dev-gso/zorba/src/zorba-3.0/src/store/naive/simple_lazy_temp_seq.cpp: In member function ‘virtual void zorba::simplestore::SimpleLazyTempSeq::getItem(zorba::xs_integer, zorba::store::Item_t&)’:
  648. /home/dev-gso/zorba/src/zorba-3.0/src/store/naive/simple_lazy_temp_seq.cpp:218:45: warning: comparison between signed and unsigned integer expressions [-Wsign-compare]
  649.    while (!theMatFinished && theItems.size() <  numItemsToBuffer)
  650.                                              ^
  651. /home/dev-gso/zorba/src/zorba-3.0/src/store/naive/simple_lazy_temp_seq.cpp:223:23: warning: comparison between signed and unsigned integer expressions [-Wsign-compare]
  652.    if (theItems.size() >= numItemsToBuffer)
  653.                        ^
  654. /home/dev-gso/zorba/src/zorba-3.0/src/store/naive/simple_lazy_temp_seq.cpp: In member function ‘virtual bool zorba::simplestore::SimpleLazyTempSeq::containsItem(zorba::xs_integer)’:
  655. /home/dev-gso/zorba/src/zorba-3.0/src/store/naive/simple_lazy_temp_seq.cpp:272:45: warning: comparison between signed and unsigned integer expressions [-Wsign-compare]
  656.    while (!theMatFinished && theItems.size() <  numItemsToBuffer)
  657.                                              ^
  658. /home/dev-gso/zorba/src/zorba-3.0/src/store/naive/simple_lazy_temp_seq.cpp:277:26: warning: comparison between signed and unsigned integer expressions [-Wsign-compare]
  659.    return theItems.size() >= numItemsToBuffer;
  660.                           ^
  661. [ 57%] Building CXX object src/CMakeFiles/zorba_simplestore.dir/store/naive/simple_pul.cpp.o
  662. [ 57%] Building CXX object src/CMakeFiles/zorba_simplestore.dir/store/naive/simple_store.cpp.o
  663. [ 57%] Building CXX object src/CMakeFiles/zorba_simplestore.dir/store/naive/simple_temp_seq.cpp.o
  664. /home/dev-gso/zorba/src/zorba-3.0/src/store/naive/simple_temp_seq.cpp: In member function ‘virtual void zorba::simplestore::SimpleTempSeq::getItem(zorba::xs_integer, zorba::store::Item_t&)’:
  665. /home/dev-gso/zorba/src/zorba-3.0/src/store/naive/simple_temp_seq.cpp:188:22: warning: comparison between signed and unsigned integer expressions [-Wsign-compare]
  666.    if (0 < pos && pos <= theItems.size())
  667.                       ^
  668. /home/dev-gso/zorba/src/zorba-3.0/src/store/naive/simple_temp_seq.cpp: In member function ‘virtual bool zorba::simplestore::SimpleTempSeq::containsItem(zorba::xs_integer)’:
  669. /home/dev-gso/zorba/src/zorba-3.0/src/store/naive/simple_temp_seq.cpp:217:25: warning: comparison between signed and unsigned integer expressions [-Wsign-compare]
  670.    return 0 < pos && pos <= theItems.size();
  671.                          ^
  672. [ 57%] Building CXX object src/CMakeFiles/zorba_simplestore.dir/store/naive/store.cpp.o
  673. [ 57%] Building CXX object src/CMakeFiles/zorba_simplestore.dir/store/naive/string_pool.cpp.o
  674. [ 58%] Building CXX object src/CMakeFiles/zorba_simplestore.dir/store/naive/structured_item.cpp.o
  675. [ 58%] Building CXX object src/CMakeFiles/zorba_simplestore.dir/store/naive/tree_id_generator.cpp.o
  676. [ 58%] Building CXX object src/CMakeFiles/zorba_simplestore.dir/store/naive/json_items.cpp.o
  677. Linking CXX shared library libzorba_simplestore.so
  678. [ 90%] Built target zorba_simplestore
  679. Linking CXX executable xqdb
  680. /usr/bin/ld: CMakeFiles/xqdb.dir/debugger/process_listener.cpp.o: undefined reference to symbol 'pthread_create@@GLIBC_2.2.5'
  681. /usr/lib/libpthread.so.0: error adding symbols: DSO missing from command line
  682. collect2: error: ld returned 1 exit status
  683. bin/CMakeFiles/xqdb.dir/build.make:218: recipe for target 'bin/xqdb' failed
  684. make[2]: *** [bin/xqdb] Error 1
  685. CMakeFiles/Makefile2:1106: recipe for target 'bin/CMakeFiles/xqdb.dir/all' failed
  686. make[1]: *** [bin/CMakeFiles/xqdb.dir/all] Error 2
  687. Makefile:147: recipe for target 'all' failed
  688. make: *** [all] Error 2
  689. ==> ERROR:(B A failure occurred in build().(B
  690.     Aborting...(B
RAW Paste Data
We use cookies for various purposes including analytics. By continuing to use Pastebin, you agree to our use of cookies as described in the Cookies Policy. OK, I Understand
 
Top